Tests pending pull requests

Build: #8294 failed

Job: Build and Test Job failed

Stages & jobs

  1. Build and Test

Build log

The build generated 783 lines of output. Download or view full build log

20-Jun-2018 22:13:43 Build phpBB3 - Pull Requests - Build and Test Job #8294 (PHPBB3-PR-JOB1-8294) started building on agent Default Agent
20-Jun-2018 22:13:43
20-Jun-2018 22:13:43 Build working directory is /home/bamboo/xml-data/build-dir/PHPBB3-PR-JOB1
20-Jun-2018 22:13:43 Executing build phpBB3 - Pull Requests - Build and Test Job #8294 (PHPBB3-PR-JOB1-8294)
20-Jun-2018 22:13:43 Starting task 'Checkout develop branch' of type 'com.atlassian.bamboo.plugins.vcs:task.vcs.checkout'
20-Jun-2018 22:13:43 Build always requires a clean checkout
20-Jun-2018 22:13:43 Cleaning build directory '/home/bamboo/xml-data/build-dir/PHPBB3-PR-JOB1'
20-Jun-2018 22:13:43 Checking out into /home/bamboo/xml-data/build-dir/PHPBB3-PR-JOB1
20-Jun-2018 22:13:43 Updating source code to revision: dc8ff9da28b8ab4ad11c7ea94cca526f17c87fe5
20-Jun-2018 22:13:43 Fetching 'refs/heads/3.1.x' from 'https://github.com/phpbb/phpbb.git'.
20-Jun-2018 22:13:44 Checking out revision dc8ff9da28b8ab4ad11c7ea94cca526f17c87fe5.
20-Jun-2018 22:13:44 Creating local git repository in '/home/bamboo/xml-data/build-dir/PHPBB3-PR-JOB1/.git'.
20-Jun-2018 22:13:44 Cloning into '/home/bamboo/xml-data/build-dir/PHPBB3-PR-JOB1'...
20-Jun-2018 22:13:44 done.
20-Jun-2018 22:13:46 Switched to a new branch '3.1.x'
20-Jun-2018 22:13:46 Branch 3.1.x set up to track remote branch 3.1.x from origin.
20-Jun-2018 22:13:46 Updated source code to revision: dc8ff9da28b8ab4ad11c7ea94cca526f17c87fe5
20-Jun-2018 22:13:46 Finished task 'Checkout develop branch' with result: Success
20-Jun-2018 22:13:46 Running pre-build action: VCS Version Collector
20-Jun-2018 22:13:46
Substituting variable: ${bamboo.PRnumber} with 5225
20-Jun-2018 22:13:46
Substituting variable: ${bamboo.buildResultsUrl} with https://bamboo.phpbb.com/browse/PHPBB3-PR-JOB1-8294
20-Jun-2018 22:13:46 Starting task 'Set pending build status' of type 'com.atlassian.bamboo.plugins.scripttask:task.builder.script'
20-Jun-2018 22:13:46
Beginning to execute external process for build 'phpBB3 - Pull Requests - Build and Test Job #8294 (PHPBB3-PR-JOB1-8294)'
... running command line:
/bin/sh /home/bamboo/temp/PHPBB3-PR-JOB1-8294-ScriptBuildTask-4891976228033225313.sh
... in: /home/bamboo/xml-data/build-dir/PHPBB3-PR-JOB1
... using extra environment variables:
bamboo_planRepository_1_branch=3.1.x
bamboo_planRepository_1_branchDisplayName=3.1.x
bamboo_repository_revision_number=dc8ff9da28b8ab4ad11c7ea94cca526f17c87fe5
bamboo_PRref=master
bamboo_resultsUrl=https://bamboo.phpbb.com/browse/PHPBB3-PR-JOB1-8294
bamboo_capability_system_builder_command_Git=/usr/bin/git
bamboo_repository_75956235_git_username=bantu
bamboo_build_working_directory=/home/bamboo/xml-data/build-dir/PHPBB3-PR-JOB1
bamboo_planRepository_1_name=phpBB Ascraeus
bamboo_buildKey=PHPBB3-PR-JOB1
bamboo_capability_phpbb_tests=true
bamboo_shortPlanName=Pull Requests
bamboo_capability_system_builder_command_fop=/usr/bin/fop
bamboo_capability_dbms_sqlite_2=true
bamboo_planRepository_name=phpBB Ascraeus
bamboo_PRnumber=5225
bamboo_buildNumber=8294
bamboo_repository_75956235_git_repositoryUrl=https://github.com/phpbb/phpbb.git
bamboo_capability_system_builder_phpunit_PHPUnit=/usr/bin/phpunit
bamboo_shortJobName=Build and Test Job
bamboo_buildResultsUrl=https://bamboo.phpbb.com/browse/PHPBB3-PR-JOB1-8294
bamboo_repository_75956235_branch_name=3.1.x
bamboo_planRepository_repositoryUrl=https://github.com/phpbb/phpbb.git
bamboo_agentId=131073
bamboo_planName=phpBB3 - Pull Requests
bamboo_shortPlanKey=PR
bamboo_shortJobKey=JOB1
bamboo_capability_dbms_mysql_55=true
bamboo_capability_system_jdk_JDK_1_7_0_65=/usr/lib/jvm/java-7-openjdk-amd64
bamboo_planRepository_revision=dc8ff9da28b8ab4ad11c7ea94cca526f17c87fe5
bamboo_buildTimeStamp=2018-06-20T22:13:43.701Z
bamboo_repository_previous_revision_number=dc8ff9da28b8ab4ad11c7ea94cca526f17c87fe5
bamboo_capability_system_jdk_JDK_1_6_0_16=/usr/lib/jvm/java-6-sun-1.6.0.16
bamboo_capability_system_builder_mvn2_Maven_2=/usr/share/maven2
bamboo_planRepository_previousRevision=dc8ff9da28b8ab4ad11c7ea94cca526f17c87fe5
bamboo_repository_git_branch=3.1.x
bamboo_buildResultKey=PHPBB3-PR-JOB1-8294
bamboo_repository_branch_name=3.1.x
bamboo_buildPlanName=phpBB3 - Pull Requests - Build and Test Job
bamboo_planRepository_1_revision=dc8ff9da28b8ab4ad11c7ea94cca526f17c87fe5
bamboo_repository_name=phpBB Ascraeus
bamboo_buildFailed=false
bamboo_capability_system_docker_executable=/usr/bin/docker
bamboo_planRepository_branch=3.1.x
bamboo_agentWorkingDirectory=/home/bamboo/xml-data/build-dir
bamboo_capability_system_git_executable=/usr/bin/git
bamboo_capability_system_builder_phpunit_PHPUnit_3_4=/usr/bin/phpunit
bamboo_repository_git_username=bantu
bamboo_planRepository_1_previousRevision=dc8ff9da28b8ab4ad11c7ea94cca526f17c87fe5
bamboo_repository_75956235_revision_number=dc8ff9da28b8ab4ad11c7ea94cca526f17c87fe5
bamboo_planRepository_branchDisplayName=3.1.x
bamboo_planRepository_1_type=gitv2
bamboo_planRepository_branchName=3.1.x
bamboo_repository_75956235_previous_revision_number=dc8ff9da28b8ab4ad11c7ea94cca526f17c87fe5
bamboo_capability_system_jdk_JDK=/usr/lib/jvm/java-6-sun
bamboo_plan_storageTag=PHPBB3-PR
bamboo_hg_cache_directory=/home/bamboo/xml-data/build-dir/_hg-repositories-cache
bamboo_planRepository_1_username=bantu
bamboo_planRepository_type=gitv2
bamboo_git_cache_directory=/home/bamboo/xml-data/build-dir/_git-repositories-cache
bamboo_ManualBuildTriggerReason_userName=Build Robot
bamboo_repository_git_repositoryUrl=https://github.com/phpbb/phpbb.git
bamboo_repository_75956235_git_branch=3.1.x
bamboo_capability_system_builder_ant_Ant=/usr/share/ant
bamboo_repository_75956235_name=phpBB Ascraeus
bamboo_tmp_directory=/home/bamboo/temp
bamboo_working_directory=/home/bamboo/xml-data/build-dir/PHPBB3-PR-JOB1
bamboo_planKey=PHPBB3-PR
bamboo_capability_local=true
bamboo_planRepository_1_repositoryUrl=https://github.com/phpbb/phpbb.git
bamboo_planRepository_username=bantu
bamboo_capability_system_jdk_JDK_1_6=/usr/lib/jvm/java-6-sun
bamboo_capability_system_jdk_JDK_1_7=/usr/lib/jvm/java-7-openjdk-amd64
bamboo_planRepository_1_branchName=3.1.x
20-Jun-2018 22:13:48 From https://github.com/phpbb/phpbb
20-Jun-2018 22:13:48 * branch            refs/pull/5225/head -> FETCH_HEAD
20-Jun-2018 22:13:48   % Total    % Received % Xferd  Average Speed   Time    Time     Time  Current
20-Jun-2018 22:13:48                                  Dload  Upload   Total   Spent    Left  Speed
20-Jun-2018 22:13:48
20-Jun-2018 22:13:49   0     0    0     0    0     0      0      0 --:--:-- --:--:-- --:--:--     0
20-Jun-2018 22:13:49 100   275  100    93  100   182    323    632 --:--:-- --:--:-- --:--:--   634
20-Jun-2018 22:13:49 Finished task 'Set pending build status' with result: Success
20-Jun-2018 22:13:49
Substituting variable: ${bamboo.PRnumber} with 5225
20-Jun-2018 22:13:49 Starting task 'Fetch PR' of type 'com.atlassian.bamboo.plugins.scripttask:task.builder.script'
20-Jun-2018 22:13:49
Beginning to execute external process for build 'phpBB3 - Pull Requests - Build and Test Job #8294 (PHPBB3-PR-JOB1-8294)'
... running command line:
/bin/sh /home/bamboo/temp/PHPBB3-PR-JOB1-8294-ScriptBuildTask-7930556980437546452.sh
... in: /home/bamboo/xml-data/build-dir/PHPBB3-PR-JOB1
... using extra environment variables:
bamboo_planRepository_1_branch=3.1.x
bamboo_planRepository_1_branchDisplayName=3.1.x
bamboo_repository_revision_number=dc8ff9da28b8ab4ad11c7ea94cca526f17c87fe5
bamboo_PRref=master
bamboo_resultsUrl=https://bamboo.phpbb.com/browse/PHPBB3-PR-JOB1-8294
bamboo_capability_system_builder_command_Git=/usr/bin/git
bamboo_repository_75956235_git_username=bantu
bamboo_build_working_directory=/home/bamboo/xml-data/build-dir/PHPBB3-PR-JOB1
bamboo_planRepository_1_name=phpBB Ascraeus
bamboo_buildKey=PHPBB3-PR-JOB1
bamboo_capability_phpbb_tests=true
bamboo_shortPlanName=Pull Requests
bamboo_capability_system_builder_command_fop=/usr/bin/fop
bamboo_capability_dbms_sqlite_2=true
bamboo_planRepository_name=phpBB Ascraeus
bamboo_PRnumber=5225
bamboo_buildNumber=8294
bamboo_repository_75956235_git_repositoryUrl=https://github.com/phpbb/phpbb.git
bamboo_capability_system_builder_phpunit_PHPUnit=/usr/bin/phpunit
bamboo_shortJobName=Build and Test Job
bamboo_buildResultsUrl=https://bamboo.phpbb.com/browse/PHPBB3-PR-JOB1-8294
bamboo_repository_75956235_branch_name=3.1.x
bamboo_planRepository_repositoryUrl=https://github.com/phpbb/phpbb.git
bamboo_agentId=131073
bamboo_planName=phpBB3 - Pull Requests
bamboo_build_commandline_com_atlassian_bamboo_plugins_scripttask_task_builder_script_7=/bin/sh /home/bamboo/temp/PHPBB3-PR-JOB1-8294-ScriptBuildTask-4891976228033225313.sh
bamboo_shortPlanKey=PR
bamboo_shortJobKey=JOB1
bamboo_capability_dbms_mysql_55=true
bamboo_capability_system_jdk_JDK_1_7_0_65=/usr/lib/jvm/java-7-openjdk-amd64
bamboo_planRepository_revision=dc8ff9da28b8ab4ad11c7ea94cca526f17c87fe5
bamboo_buildTimeStamp=2018-06-20T22:13:43.701Z
bamboo_repository_previous_revision_number=dc8ff9da28b8ab4ad11c7ea94cca526f17c87fe5
bamboo_capability_system_jdk_JDK_1_6_0_16=/usr/lib/jvm/java-6-sun-1.6.0.16
bamboo_capability_system_builder_mvn2_Maven_2=/usr/share/maven2
bamboo_planRepository_previousRevision=dc8ff9da28b8ab4ad11c7ea94cca526f17c87fe5
bamboo_repository_git_branch=3.1.x
bamboo_buildResultKey=PHPBB3-PR-JOB1-8294
bamboo_repository_branch_name=3.1.x
bamboo_buildPlanName=phpBB3 - Pull Requests - Build and Test Job
bamboo_planRepository_1_revision=dc8ff9da28b8ab4ad11c7ea94cca526f17c87fe5
bamboo_repository_name=phpBB Ascraeus
bamboo_buildFailed=false
bamboo_capability_system_docker_executable=/usr/bin/docker
bamboo_planRepository_branch=3.1.x
bamboo_agentWorkingDirectory=/home/bamboo/xml-data/build-dir
bamboo_capability_system_git_executable=/usr/bin/git
bamboo_capability_system_builder_phpunit_PHPUnit_3_4=/usr/bin/phpunit
bamboo_repository_git_username=bantu
bamboo_planRepository_1_previousRevision=dc8ff9da28b8ab4ad11c7ea94cca526f17c87fe5
bamboo_repository_75956235_revision_number=dc8ff9da28b8ab4ad11c7ea94cca526f17c87fe5
bamboo_planRepository_branchDisplayName=3.1.x
bamboo_planRepository_1_type=gitv2
bamboo_planRepository_branchName=3.1.x
bamboo_repository_75956235_previous_revision_number=dc8ff9da28b8ab4ad11c7ea94cca526f17c87fe5
bamboo_capability_system_jdk_JDK=/usr/lib/jvm/java-6-sun
bamboo_plan_storageTag=PHPBB3-PR
bamboo_hg_cache_directory=/home/bamboo/xml-data/build-dir/_hg-repositories-cache
bamboo_planRepository_1_username=bantu
bamboo_planRepository_type=gitv2
bamboo_git_cache_directory=/home/bamboo/xml-data/build-dir/_git-repositories-cache
bamboo_ManualBuildTriggerReason_userName=Build Robot
bamboo_repository_git_repositoryUrl=https://github.com/phpbb/phpbb.git
bamboo_repository_75956235_git_branch=3.1.x
bamboo_capability_system_builder_ant_Ant=/usr/share/ant
bamboo_repository_75956235_name=phpBB Ascraeus
bamboo_tmp_directory=/home/bamboo/temp
bamboo_working_directory=/home/bamboo/xml-data/build-dir/PHPBB3-PR-JOB1
bamboo_planKey=PHPBB3-PR
bamboo_capability_local=true
bamboo_planRepository_1_repositoryUrl=https://github.com/phpbb/phpbb.git
bamboo_planRepository_username=bantu
bamboo_capability_system_jdk_JDK_1_6=/usr/lib/jvm/java-6-sun
bamboo_capability_system_jdk_JDK_1_7=/usr/lib/jvm/java-7-openjdk-amd64
bamboo_planRepository_1_branchName=3.1.x
20-Jun-2018 22:13:52 From https://github.com/phpbb/phpbb
20-Jun-2018 22:13:52 * branch            refs/pull/5225/merge -> FETCH_HEAD
20-Jun-2018 22:13:52 Note: checking out 'FETCH_HEAD'.
20-Jun-2018 22:13:52
20-Jun-2018 22:13:52 You are in 'detached HEAD' state. You can look around, make experimental
20-Jun-2018 22:13:52 changes and commit them, and you can discard any commits you make in this
20-Jun-2018 22:13:52 state without impacting any branches by performing another checkout.
20-Jun-2018 22:13:52
20-Jun-2018 22:13:52 If you want to create a new branch to retain commits you create, you may
20-Jun-2018 22:13:52 do so (now or later) by using -b with the checkout command again. Example:
20-Jun-2018 22:13:52
20-Jun-2018 22:13:52   git checkout -b new_branch_name
20-Jun-2018 22:13:52
20-Jun-2018 22:13:52 HEAD is now at f4d1945... Merge bfdbe6136a836b5437a66c28a17e662186e4a842 into 68c6670c8b92cb43e53f9d504a900a441802e8fa
20-Jun-2018 22:13:52 Finished task 'Fetch PR' with result: Success
20-Jun-2018 22:13:52 Skipping execution of task 'Prepare directory' as it is disabled
20-Jun-2018 22:13:52
Substituting variable: ${bamboo.working.directory} with /home/bamboo/xml-data/build-dir/PHPBB3-PR-JOB1
20-Jun-2018 22:13:52 Starting task 'Prepare directory' of type 'com.atlassian.bamboo.plugins.bamboo-docker-plugin:task.docker.cli'
20-Jun-2018 22:13:52 Running image name (phpbb:php-5.6)
20-Jun-2018 22:13:52
Beginning to execute external process for build 'phpBB3 - Pull Requests - Build and Test Job #8294 (PHPBB3-PR-JOB1-8294)'
... running command line:
/usr/bin/docker run --volume /home/bamboo/xml-data/build-dir/PHPBB3-PR-JOB1:/data --workdir /data/phpBB --rm -e HOME=/home/bamboo -u=991 phpbb:php-5.6 /bin/bash -c php ../composer.phar install --dev; cd ../build; ../phpBB/vendor/bin/phing clean prepare
... in: /home/bamboo/xml-data/build-dir/PHPBB3-PR-JOB1
... using extra environment variables:
bamboo_planRepository_1_branch=3.1.x
bamboo_planRepository_1_branchDisplayName=3.1.x
bamboo_repository_revision_number=dc8ff9da28b8ab4ad11c7ea94cca526f17c87fe5
bamboo_PRref=master
bamboo_resultsUrl=https://bamboo.phpbb.com/browse/PHPBB3-PR-JOB1-8294
bamboo_capability_system_builder_command_Git=/usr/bin/git
bamboo_repository_75956235_git_username=bantu
bamboo_build_working_directory=/home/bamboo/xml-data/build-dir/PHPBB3-PR-JOB1
bamboo_planRepository_1_name=phpBB Ascraeus
bamboo_buildKey=PHPBB3-PR-JOB1
bamboo_capability_phpbb_tests=true
bamboo_shortPlanName=Pull Requests
bamboo_capability_system_builder_command_fop=/usr/bin/fop
bamboo_capability_dbms_sqlite_2=true
bamboo_planRepository_name=phpBB Ascraeus
bamboo_PRnumber=5225
bamboo_buildNumber=8294
bamboo_repository_75956235_git_repositoryUrl=https://github.com/phpbb/phpbb.git
bamboo_capability_system_builder_phpunit_PHPUnit=/usr/bin/phpunit
bamboo_shortJobName=Build and Test Job
bamboo_buildResultsUrl=https://bamboo.phpbb.com/browse/PHPBB3-PR-JOB1-8294
bamboo_repository_75956235_branch_name=3.1.x
bamboo_planRepository_repositoryUrl=https://github.com/phpbb/phpbb.git
bamboo_agentId=131073
bamboo_planName=phpBB3 - Pull Requests
bamboo_build_commandline_com_atlassian_bamboo_plugins_scripttask_task_builder_script_7=/bin/sh /home/bamboo/temp/PHPBB3-PR-JOB1-8294-ScriptBuildTask-4891976228033225313.sh
bamboo_shortPlanKey=PR
bamboo_shortJobKey=JOB1
bamboo_capability_dbms_mysql_55=true
bamboo_capability_system_jdk_JDK_1_7_0_65=/usr/lib/jvm/java-7-openjdk-amd64
bamboo_planRepository_revision=dc8ff9da28b8ab4ad11c7ea94cca526f17c87fe5
bamboo_buildTimeStamp=2018-06-20T22:13:43.701Z
bamboo_repository_previous_revision_number=dc8ff9da28b8ab4ad11c7ea94cca526f17c87fe5
bamboo_capability_system_jdk_JDK_1_6_0_16=/usr/lib/jvm/java-6-sun-1.6.0.16
bamboo_capability_system_builder_mvn2_Maven_2=/usr/share/maven2
bamboo_planRepository_previousRevision=dc8ff9da28b8ab4ad11c7ea94cca526f17c87fe5
bamboo_build_commandline_com_atlassian_bamboo_plugins_scripttask_task_builder_script_4=/bin/sh /home/bamboo/temp/PHPBB3-PR-JOB1-8294-ScriptBuildTask-7930556980437546452.sh
bamboo_repository_git_branch=3.1.x
bamboo_buildResultKey=PHPBB3-PR-JOB1-8294
bamboo_repository_branch_name=3.1.x
bamboo_buildPlanName=phpBB3 - Pull Requests - Build and Test Job
bamboo_planRepository_1_revision=dc8ff9da28b8ab4ad11c7ea94cca526f17c87fe5
bamboo_repository_name=phpBB Ascraeus
bamboo_buildFailed=false
bamboo_capability_system_docker_executable=/usr/bin/docker
bamboo_planRepository_branch=3.1.x
bamboo_agentWorkingDirectory=/home/bamboo/xml-data/build-dir
bamboo_capability_system_git_executable=/usr/bin/git
bamboo_capability_system_builder_phpunit_PHPUnit_3_4=/usr/bin/phpunit
bamboo_repository_git_username=bantu
bamboo_planRepository_1_previousRevision=dc8ff9da28b8ab4ad11c7ea94cca526f17c87fe5
bamboo_repository_75956235_revision_number=dc8ff9da28b8ab4ad11c7ea94cca526f17c87fe5
bamboo_planRepository_branchDisplayName=3.1.x
bamboo_planRepository_1_type=gitv2
bamboo_planRepository_branchName=3.1.x
bamboo_repository_75956235_previous_revision_number=dc8ff9da28b8ab4ad11c7ea94cca526f17c87fe5
bamboo_capability_system_jdk_JDK=/usr/lib/jvm/java-6-sun
bamboo_plan_storageTag=PHPBB3-PR
bamboo_hg_cache_directory=/home/bamboo/xml-data/build-dir/_hg-repositories-cache
bamboo_planRepository_1_username=bantu
bamboo_planRepository_type=gitv2
bamboo_git_cache_directory=/home/bamboo/xml-data/build-dir/_git-repositories-cache
bamboo_ManualBuildTriggerReason_userName=Build Robot
bamboo_repository_git_repositoryUrl=https://github.com/phpbb/phpbb.git
bamboo_repository_75956235_git_branch=3.1.x
bamboo_capability_system_builder_ant_Ant=/usr/share/ant
bamboo_repository_75956235_name=phpBB Ascraeus
bamboo_tmp_directory=/home/bamboo/temp
bamboo_working_directory=/home/bamboo/xml-data/build-dir/PHPBB3-PR-JOB1
bamboo_planKey=PHPBB3-PR
bamboo_capability_local=true
bamboo_planRepository_1_repositoryUrl=https://github.com/phpbb/phpbb.git
bamboo_planRepository_username=bantu
bamboo_capability_system_jdk_JDK_1_6=/usr/lib/jvm/java-6-sun
bamboo_capability_system_jdk_JDK_1_7=/usr/lib/jvm/java-7-openjdk-amd64
bamboo_planRepository_1_branchName=3.1.x
20-Jun-2018 22:13:52 Cannot create cache directory /home/bamboo/.composer/cache/repo/https---packagist.org/, or directory is not writable. Proceeding without cache
20-Jun-2018 22:13:52 Cannot create cache directory /home/bamboo/.composer/cache/files/, or directory is not writable. Proceeding without cache
20-Jun-2018 22:13:52 You are using the deprecated option "dev". Dev packages are installed by default now.
20-Jun-2018 22:13:53 Loading composer repositories with package information
20-Jun-2018 22:13:53 Installing dependencies (including require-dev) from lock file
20-Jun-2018 22:13:53 Package operations: 75 installs, 0 updates, 0 removals
20-Jun-2018 22:13:54   - Installing composer/installers (v1.5.0): Downloading (connecting...)Downloading (0%)           Downloading (5%)Downloading (20%)Downloading (25%)Downloading (30%)Downloading (35%)Downloading (50%)Downloading (55%)Downloading (60%)Downloading (80%)Downloading (85%)Downloading (90%)Downloading (100%)
20-Jun-2018 22:13:54   - Installing bantu/ini-get-wrapper (v1.0.1): Downloading (connecting...)Downloading (0%)           Downloading (100%)
20-Jun-2018 22:13:55   - Installing symfony/process (v3.4.3): Downloading (connecting...)Downloading (0%)           Downloading (5%)Downloading (30%)Downloading (35%)Downloading (55%)Downloading (60%)Downloading (65%)Downloading (90%)Downloading (95%)Downloading (100%)
20-Jun-2018 22:13:56   - Installing symfony/finder (v3.4.3): Downloading (connecting...)Downloading (0%)           Downloading (5%)Downloading (10%)Downloading (40%)Downloading (45%)Downloading (50%)Downloading (55%)Downloading (60%)Downloading (80%)Downloading (100%)
20-Jun-2018 22:13:57   - Installing symfony/filesystem (v3.4.3): Downloading (connecting...)Downloading (0%)           Downloading (5%)Downloading (95%)Downloading (100%)
20-Jun-2018 22:13:57   - Installing symfony/polyfill-mbstring (v1.7.0): Downloading (connecting...)Downloading (0%)           Downloading (20%)Downloading (40%)Downloading (100%)
20-Jun-2018 22:13:58   - Installing psr/log (1.0.2): Downloading (connecting...)Downloading (0%)           Downloading (15%)Downloading (100%)
20-Jun-2018 22:13:59   - Installing symfony/debug (v3.4.3): Downloading (connecting...)Downloading (0%)           Downloading (5%)Downloading (15%)Downloading (20%)Downloading (25%)Downloading (35%)Downloading (40%)Downloading (45%)Downloading (55%)Downloading (60%)Downloading (65%)Downloading (75%)Downloading (80%)Downloading (95%)Downloading (100%)
20-Jun-2018 22:14:00   - Installing symfony/console (v3.4.3): Downloading (connecting...)Downloading (0%)           Downloading (5%)Downloading (10%)Downloading (15%)Downloading (20%)Downloading (25%)Downloading (30%)Downloading (35%)Downloading (40%)Downloading (45%)Downloading (50%)Downloading (55%)Downloading (60%)Downloading (65%)Downloading (70%)Downloading (75%)Downloading (80%)Downloading (85%)Downloading (90%)Downloading (95%)Downloading (100%)
20-Jun-2018 22:14:01   - Installing seld/phar-utils (1.0.1): Downloading (connecting...)Downloading (0%)           Downloading (30%)Downloading (60%)Downloading (90%)Downloading (100%)
20-Jun-2018 22:14:02   - Installing seld/jsonlint (1.7.0): Downloading (connecting...)Downloading (0%)           Downloading (15%)Downloading (60%)Downloading (75%)Downloading (90%)Downloading (100%)
20-Jun-2018 22:14:02   - Installing seld/cli-prompt (1.0.3): Downloading (connecting...)Downloading (0%)           Downloading (15%)Downloading (30%)Downloading (100%)
20-Jun-2018 22:14:03   - Installing justinrainbow/json-schema (5.2.6): Downloading (connecting...)Downloading (0%)           Downloading (20%)Downloading (25%)Downloading (30%)Downloading (35%)Downloading (50%)Downloading (55%)Downloading (60%)Downloading (65%)Downloading (80%)Downloading (85%)Downloading (100%)
20-Jun-2018 22:14:04   - Installing composer/spdx-licenses (1.2.0): Downloading (connecting...)Downloading (0%)           Downloading (65%)Downloading (100%)
20-Jun-2018 22:14:05   - Installing composer/semver (1.4.2): Downloading (connecting...)Downloading (0%)           Downloading (35%)Downloading (75%)Downloading (100%)
20-Jun-2018 22:14:06   - Installing composer/ca-bundle (1.1.0): Downloading (connecting...)Downloading (0%)           Downloading (5%)Downloading (10%)Downloading (15%)Downloading (20%)Downloading (25%)Downloading (30%)Downloading (35%)Downloading (40%)Downloading (45%)Downloading (50%)Downloading (55%)Downloading (60%)Downloading (65%)Downloading (70%)Downloading (75%)Downloading (80%)Downloading (85%)Downloading (90%)Downloading (95%)Downloading (100%)
20-Jun-2018 22:14:10   - Installing composer/composer (1.6.2): Downloading (connecting...)Downloading (0%)           Downloading (5%)Downloading (10%)Downloading (15%)Downloading (20%)Downloading (25%)Downloading (30%)Downloading (35%)Downloading (40%)Downloading (45%)Downloading (50%)Downloading (55%)Downloading (60%)Downloading (65%)Downloading (70%)Downloading (75%)Downloading (80%)Downloading (85%)Downloading (90%)Downloading (95%)Downloading (100%)
20-Jun-2018 22:14:11   - Installing google/recaptcha (1.1.3): Downloading (connecting...)Downloading (0%)           Downloading (25%)Downloading (30%)Downloading (55%)Downloading (80%)Downloading (85%)Downloading (100%)
20-Jun-2018 22:14:12   - Installing guzzlehttp/promises (v1.3.1): Downloading (connecting...)Downloading (0%)           Downloading (30%)Downloading (60%)Downloading (80%)Downloading (100%)
20-Jun-2018 22:14:12   - Installing psr/http-message (1.0.1): Downloading (connecting...)Downloading (0%)           Downloading (95%)Downloading (100%)
20-Jun-2018 22:14:13   - Installing guzzlehttp/psr7 (1.4.2): Downloading (connecting...)Downloading (0%)           Downloading (5%)Downloading (10%)Downloading (15%)Downloading (50%)Downloading (55%)Downloading (60%)Downloading (65%)Downloading (85%)Downloading (90%)Downloading (95%)Downloading (100%)
20-Jun-2018 22:14:14   - Installing lusitanian/oauth (v0.8.10): Downloading (connecting...)Downloading (0%)           Downloading (5%)Downloading (10%)Downloading (15%)Downloading (20%)Downloading (25%)Downloading (30%)Downloading (35%)Downloading (40%)Downloading (45%)Downloading (50%)Downloading (55%)Downloading (65%)Downloading (70%)Downloading (80%)Downloading (85%)Downloading (95%)Downloading (100%)
20-Jun-2018 22:14:15   - Installing marc1706/fast-image-size (v1.1.4): Downloading (connecting...)Downloading (0%)           Downloading (45%)Downloading (95%)Downloading (100%)
20-Jun-2018 22:14:16   - Installing patchwork/utf8 (v1.3.1): Downloading (connecting...)Downloading (0%)           Downloading (5%)Downloading (10%)Downloading (15%)Downloading (20%)Downloading (25%)Downloading (30%)Downloading (35%)Downloading (40%)Downloading (45%)Downloading (50%)Downloading (55%)Downloading (60%)Downloading (65%)Downloading (70%)Downloading (75%)Downloading (80%)Downloading (85%)Downloading (90%)Downloading (95%)Downloading (100%)
20-Jun-2018 22:14:17   - Installing psr/container (1.0.0): Downloading (connecting...)Downloading (0%)           Downloading (75%)Downloading (100%)
20-Jun-2018 22:14:19   - Installing s9e/text-formatter (0.13.1): Downloading (connecting...)Downloading (0%)           Downloading (5%)Downloading (10%)Downloading (15%)Downloading (20%)Downloading (25%)Downloading (30%)Downloading (35%)Downloading (40%)Downloading (45%)Downloading (50%)Downloading (55%)Downloading (60%)Downloading (65%)Downloading (70%)Downloading (75%)Downloading (80%)Downloading (85%)Downloading (90%)Downloading (95%)Downloading (100%)
20-Jun-2018 22:14:20   - Installing symfony/config (v3.4.3): Downloading (connecting...)Downloading (0%)           Downloading (5%)Downloading (10%)Downloading (15%)Downloading (20%)Downloading (25%)Downloading (30%)Downloading (35%)Downloading (40%)Downloading (45%)Downloading (50%)Downloading (55%)Downloading (60%)Downloading (65%)Downloading (70%)Downloading (75%)Downloading (80%)Downloading (85%)Downloading (90%)Downloading (95%)Downloading (100%)
20-Jun-2018 22:14:21   - Installing paragonie/random_compat (v1.4.2): Downloading (connecting...)Downloading (0%)           Downloading (10%)Downloading (35%)Downloading (45%)Downloading (50%)Downloading (60%)Downloading (85%)Downloading (95%)Downloading (100%)
20-Jun-2018 22:14:22   - Installing symfony/polyfill-php70 (v1.6.0): Downloading (connecting...)Downloading (0%)           Downloading (85%)Downloading (100%)
20-Jun-2018 22:14:23   - Installing symfony/http-foundation (v3.4.3): Downloading (connecting...)Downloading (0%)           Downloading (5%)Downloading (10%)Downloading (15%)Downloading (20%)Downloading (25%)Downloading (30%)Downloading (35%)Downloading (40%)Downloading (45%)Downloading (50%)Downloading (55%)Downloading (60%)Downloading (65%)Downloading (70%)Downloading (75%)Downloading (80%)Downloading (85%)Downloading (90%)Downloading (95%)Downloading (100%)
20-Jun-2018 22:14:24   - Installing symfony/event-dispatcher (v3.4.3): Downloading (connecting...)Downloading (0%)           Downloading (5%)Downloading (90%)Downloading (95%)Downloading (100%)
20-Jun-2018 22:14:26   - Installing symfony/http-kernel (v3.4.3): Downloading (connecting...)Downloading (0%)           Downloading (5%)Downloading (10%)Downloading (15%)Downloading (20%)Downloading (25%)Downloading (30%)Downloading (35%)Downloading (40%)Downloading (45%)Downloading (50%)Downloading (55%)Downloading (60%)Downloading (65%)Downloading (70%)Downloading (75%)Downloading (80%)Downloading (85%)Downloading (90%)Downloading (95%)Downloading (100%)
20-Jun-2018 22:14:27   - Installing symfony/dependency-injection (v3.4.3): Downloading (connecting...)Downloading (0%)           Downloading (5%)Downloading (10%)Downloading (15%)Downloading (20%)Downloading (25%)Downloading (30%)Downloading (35%)Downloading (40%)Downloading (45%)Downloading (50%)Downloading (55%)Downloading (60%)Downloading (65%)Downloading (70%)Downloading (75%)Downloading (80%)Downloading (85%)Downloading (90%)Downloading (95%)Downloading (100%)
20-Jun-2018 22:14:28   - Installing zendframework/zend-eventmanager (3.2.0): Downloading (connecting...)Downloading (0%)           Downloading (30%)Downloading (45%)Downloading (50%)Downloading (75%)Downloading (100%)
20-Jun-2018 22:14:29   - Installing zendframework/zend-code (2.6.3): Downloading (connecting...)Downloading (0%)           Downloading (5%)Downloading (10%)Downloading (15%)Downloading (20%)Downloading (25%)Downloading (30%)Downloading (35%)Downloading (40%)Downloading (45%)Downloading (50%)Downloading (55%)Downloading (60%)Downloading (65%)Downloading (70%)Downloading (75%)Downloading (80%)Downloading (85%)Downloading (90%)Downloading (95%)Downloading (100%)
20-Jun-2018 22:14:30   - Installing ocramius/proxy-manager (1.0.2): Downloading (connecting...)Downloading (0%)           Downloading (5%)Downloading (10%)Downloading (15%)Downloading (20%)Downloading (25%)Downloading (30%)Downloading (35%)Downloading (40%)Downloading (45%)Downloading (50%)Downloading (55%)Downloading (60%)Downloading (65%)Downloading (70%)Downloading (75%)Downloading (80%)Downloading (85%)Downloading (90%)Downloading (95%)Downloading (100%)
20-Jun-2018 22:14:31   - Installing symfony/proxy-manager-bridge (v3.4.3): Downloading (connecting...)Downloading (0%)           Downloading (75%)Downloading (100%)
20-Jun-2018 22:14:33   - Installing symfony/routing (v3.4.3): Downloading (connecting...)Downloading (0%)           Downloading (5%)Downloading (10%)Downloading (15%)Downloading (20%)Downloading (25%)Downloading (30%)Downloading (35%)Downloading (40%)Downloading (45%)Downloading (50%)Downloading (55%)Downloading (60%)Downloading (65%)Downloading (70%)Downloading (75%)Downloading (80%)Downloading (85%)Downloading (90%)Downloading (95%)Downloading (100%)
20-Jun-2018 22:14:33   - Installing twig/twig (v1.35.0): Downloading (connecting...)Downloading (0%)           Downloading (5%)Downloading (10%)Downloading (15%)Downloading (20%)Downloading (25%)Downloading (30%)Downloading (35%)Downloading (40%)Downloading (45%)Downloading (50%)Downloading (55%)Downloading (60%)Downloading (65%)Downloading (70%)Downloading (75%)Downloading (80%)Downloading (85%)Downloading (90%)Downloading (95%)Downloading (100%)
20-Jun-2018 22:14:35   - Installing symfony/twig-bridge (v3.4.3): Downloading (connecting...)Downloading (0%)           Downloading (5%)Downloading (10%)Downloading (20%)Downloading (30%)Downloading (35%)Downloading (40%)Downloading (45%)Downloading (55%)Downloading (60%)Downloading (65%)Downloading (70%)Downloading (80%)Downloading (85%)Downloading (90%)Downloading (95%)Downloading (100%)
20-Jun-2018 22:14:36   - Installing symfony/dom-crawler (v3.4.3): Downloading (connecting...)Downloading (0%)           Downloading (5%)Downloading (25%)Downloading (30%)Downloading (35%)Downloading (55%)Downloading (60%)Downloading (85%)Downloading (90%)Downloading (100%)
20-Jun-2018 22:14:36   - Installing symfony/css-selector (v3.4.3): Downloading (connecting...)Downloading (0%)           Downloading (5%)Downloading (10%)Downloading (15%)Downloading (20%)Downloading (25%)Downloading (30%)Downloading (55%)Downloading (60%)Downloading (65%)Downloading (70%)Downloading (75%)Downloading (80%)Downloading (85%)Downloading (90%)Downloading (95%)Downloading (100%)
20-Jun-2018 22:14:37   - Installing symfony/browser-kit (v3.4.3): Downloading (connecting...)Downloading (0%)           Downloading (5%)Downloading (70%)Downloading (100%)
20-Jun-2018 22:14:39   - Installing guzzlehttp/guzzle (6.3.0): Downloading (connecting...)Downloading (0%)           Downloading (5%)Downloading (15%)Downloading (25%)Downloading (30%)Downloading (40%)Downloading (45%)Downloading (55%)Downloading (60%)Downloading (70%)Downloading (75%)Downloading (90%)Downloading (95%)Downloading (100%)
20-Jun-2018 22:14:39   - Installing fabpot/goutte (v3.2.2): Downloading (connecting...)Downloading (0%)           Downloading (55%)Downloading (90%)Downloading (100%)
20-Jun-2018 22:14:41   - Installing facebook/webdriver (1.5.0): Downloading (connecting...)Downloading (0%)           Downloading (5%)Downloading (10%)Downloading (15%)Downloading (20%)Downloading (25%)Downloading (30%)Downloading (35%)Downloading (40%)Downloading (45%)Downloading (50%)Downloading (55%)Downloading (60%)Downloading (65%)Downloading (70%)Downloading (75%)Downloading (80%)Downloading (85%)Downloading (90%)Downloading (95%)Downloading (100%)
20-Jun-2018 22:14:42   - Installing symfony/yaml (v3.4.3): Downloading (connecting...)Downloading (0%)           Downloading (5%)Downloading (10%)Downloading (15%)Downloading (20%)Downloading (25%)Downloading (30%)Downloading (35%)Downloading (40%)Downloading (45%)Downloading (50%)Downloading (55%)Downloading (60%)Downloading (65%)Downloading (70%)Downloading (75%)Downloading (80%)Downloading (85%)Downloading (90%)Downloading (95%)Downloading (100%)
20-Jun-2018 22:14:43   - Installing laravel/homestead (v7.7.0): Downloading (connecting...)Downloading (0%)           Downloading (5%)Downloading (10%)Downloading (50%)Downloading (55%)Downloading (70%)Downloading (75%)Downloading (80%)Downloading (85%)Downloading (90%)Downloading (95%)Downloading (100%)
20-Jun-2018 22:14:48   - Installing phing/phing (2.4.14): Downloading (connecting...)Downloading (0%)           Downloading (5%)Downloading (10%)Downloading (15%)Downloading (20%)Downloading (25%)Downloading (30%)Downloading (35%)Downloading (40%)Downloading (45%)Downloading (50%)Downloading (55%)Downloading (60%)Downloading (65%)Downloading (70%)Downloading (75%)Downloading (80%)Downloading (85%)Downloading (90%)Downloading (95%)Downloading (100%)
20-Jun-2018 22:14:49   - Installing webmozart/assert (1.2.0): Downloading (connecting...)Downloading (0%)           Downloading (55%)Downloading (80%)Downloading (100%)
20-Jun-2018 22:14:49   - Installing phpdocumentor/reflection-common (1.0.1): Downloading (connecting...)Downloading (0%)           Downloading (100%)
20-Jun-2018 22:14:50   - Installing phpdocumentor/type-resolver (0.4.0): Downloading (connecting...)Downloading (0%)           Downloading (5%)Downloading (100%)
20-Jun-2018 22:14:51   - Installing phpdocumentor/reflection-docblock (3.3.2): Downloading (connecting...)Downloading (0%)           Downloading (5%)Downloading (10%)Downloading (15%)Downloading (20%)Downloading (25%)Downloading (30%)Downloading (45%)Downloading (50%)Downloading (55%)Downloading (60%)Downloading (65%)Downloading (70%)Downloading (75%)Downloading (100%)
20-Jun-2018 22:14:52   - Installing sebastian/version (2.0.1): Downloading (connecting...)Downloading (0%)           Downloading (100%)
20-Jun-2018 22:14:52   - Installing sebastian/resource-operations (1.0.0): Downloading (connecting...)Downloading (0%)           Downloading (65%)Downloading (100%)
20-Jun-2018 22:14:53   - Installing sebastian/recursion-context (2.0.0): Downloading (connecting...)Downloading (0%)           Downloading (100%)
20-Jun-2018 22:14:53   - Installing sebastian/object-enumerator (2.0.1): Downloading (connecting...)Downloading (0%)           Downloading (95%)Downloading (100%)
20-Jun-2018 22:14:54   - Installing sebastian/global-state (1.1.1): Downloading (connecting...)Downloading (0%)           Downloading (40%)Downloading (70%)Downloading (100%)
20-Jun-2018 22:14:55   - Installing sebastian/exporter (2.0.0): Downloading (connecting...)Downloading (0%)           Downloading (100%)
20-Jun-2018 22:14:56   - Installing sebastian/environment (2.0.0): Downloading (connecting...)Downloading (0%)           Downloading (15%)Downloading (30%)Downloading (45%)Downloading (60%)Downloading (75%)Downloading (90%)Downloading (100%)
20-Jun-2018 22:14:57   - Installing sebastian/diff (1.4.3): Downloading (connecting...)Downloading (0%)           Downloading (35%)Downloading (40%)Downloading (75%)Downloading (100%)
20-Jun-2018 22:14:57   - Installing sebastian/comparator (1.2.4): Downloading (connecting...)Downloading (0%)           Downloading (10%)Downloading (30%)Downloading (40%)Downloading (75%)Downloading (100%)
20-Jun-2018 22:14:58   - Installing phpunit/php-text-template (1.2.1): Downloading (connecting...)Downloading (0%)           Downloading (35%)Downloading (100%)
20-Jun-2018 22:14:59   - Installing doctrine/instantiator (1.0.5): Downloading (connecting...)Downloading (0%)           Downloading (15%)Downloading (30%)Downloading (45%)Downloading (50%)Downloading (65%)Downloading (80%)Downloading (95%)Downloading (100%)
20-Jun-2018 22:15:00   - Installing phpunit/phpunit-mock-objects (3.4.4): Downloading (connecting...)Downloading (0%)           Downloading (5%)Downloading (10%)Downloading (15%)Downloading (20%)Downloading (25%)Downloading (30%)Downloading (35%)Downloading (40%)Downloading (45%)Downloading (50%)Downloading (55%)Downloading (60%)Downloading (65%)Downloading (70%)Downloading (75%)Downloading (85%)Downloading (90%)Downloading (95%)Downloading (100%)
20-Jun-2018 22:15:01   - Installing phpunit/php-timer (1.0.9): Downloading (connecting...)Downloading (0%)           Downloading (45%)Downloading (90%)Downloading (100%)
20-Jun-2018 22:15:02   - Installing phpunit/php-file-iterator (1.4.5): Downloading (connecting...)Downloading (0%)           Downloading (100%)
20-Jun-2018 22:15:02   - Installing sebastian/code-unit-reverse-lookup (1.0.1): Downloading (connecting...)Downloading (0%)           Downloading (55%)Downloading (100%)
20-Jun-2018 22:15:03   - Installing phpunit/php-token-stream (1.4.12): Downloading (connecting...)Downloading (0%)           Downloading (5%)Downloading (10%)Downloading (15%)Downloading (20%)Downloading (100%)
20-Jun-2018 22:15:05   - Installing phpunit/php-code-coverage (4.0.8): Downloading (connecting...)Downloading (0%)           Downloading (5%)Downloading (10%)Downloading (15%)Downloading (20%)Downloading (25%)Downloading (30%)Downloading (35%)Downloading (40%)Downloading (45%)Downloading (50%)Downloading (55%)Downloading (60%)Downloading (65%)Downloading (70%)Downloading (75%)Downloading (80%)Downloading (85%)Downloading (90%)Downloading (95%)Downloading (100%)
20-Jun-2018 22:15:06   - Installing phpspec/prophecy (1.7.5): Downloading (connecting...)Downloading (0%)           Downloading (10%)Downloading (15%)Downloading (25%)Downloading (35%)Downloading (40%)Downloading (45%)Downloading (50%)Downloading (55%)Downloading (65%)Downloading (75%)Downloading (85%)Downloading (90%)Downloading (95%)Downloading (100%)
20-Jun-2018 22:15:07   - Installing myclabs/deep-copy (1.7.0): Downloading (connecting...)Downloading (0%)           Downloading (25%)Downloading (30%)Downloading (45%)Downloading (50%)Downloading (60%)Downloading (75%)Downloading (80%)Downloading (95%)Downloading (100%)
20-Jun-2018 22:15:09   - Installing phpunit/phpunit (5.7.26): Downloading (connecting...)Downloading (0%)           Downloading (5%)Downloading (10%)Downloading (15%)Downloading (20%)Downloading (25%)Downloading (30%)Downloading (35%)Downloading (40%)Downloading (45%)Downloading (50%)Downloading (55%)Downloading (60%)Downloading (65%)Downloading (70%)Downloading (75%)Downloading (80%)Downloading (85%)Downloading (90%)Downloading (95%)Downloading (100%)
20-Jun-2018 22:15:11   - Installing phpunit/dbunit (2.0.3): Downloading (connecting...)Downloading (0%)           Downloading (5%)Downloading (10%)Downloading (15%)Downloading (20%)Downloading (25%)Downloading (30%)Downloading (35%)Downloading (40%)Downloading (45%)Downloading (50%)Downloading (55%)Downloading (60%)Downloading (65%)Downloading (70%)Downloading (75%)Downloading (80%)Downloading (85%)Downloading (90%)Downloading (95%)Downloading (100%)
20-Jun-2018 22:15:11   - Installing squizlabs/php_codesniffer (2.9.1): Downloading (connecting...)Downloading (0%)           Downloading (5%)Downloading (10%)Downloading (15%)Downloading (20%)Downloading (25%)Downloading (30%)Downloading (35%)Downloading (40%)Downloading (45%)Downloading (50%)Downloading (55%)Downloading (60%)Downloading (65%)Downloading (70%)Downloading (75%)Downloading (80%)Downloading (85%)Downloading (90%)Downloading (95%)Downloading (100%)
20-Jun-2018 22:15:12 symfony/console suggests installing symfony/lock ()
20-Jun-2018 22:15:12 lusitanian/oauth suggests installing predis/predis (Allows using the Redis storage backend.)
20-Jun-2018 22:15:12 patchwork/utf8 suggests installing ext-intl (Use Intl for best performance)
20-Jun-2018 22:15:12 patchwork/utf8 suggests installing ext-wfio (Use WFIO for UTF-8 filesystem access on Windows)
20-Jun-2018 22:15:12 s9e/text-formatter suggests installing ext-intl (Allows international URLs to be accepted by the URL filter)
20-Jun-2018 22:15:12 s9e/text-formatter suggests installing ext-xsl (Enables the XSLT renderer)
20-Jun-2018 22:15:12 paragonie/random_compat suggests installing ext-libsodium (Provides a modern crypto API that can be used to generate random bytes.)
20-Jun-2018 22:15:12 symfony/http-kernel suggests installing symfony/var-dumper ()
20-Jun-2018 22:15:12 symfony/dependency-injection suggests installing symfony/expression-language (For using expressions in service container configuration)
20-Jun-2018 22:15:12 zendframework/zend-eventmanager suggests installing container-interop/container-interop (^1.1.0, to use the lazy listeners feature)
20-Jun-2018 22:15:12 zendframework/zend-eventmanager suggests installing zendframework/zend-stdlib (^2.7.3 || ^3.0, to use the FilterChain feature)
20-Jun-2018 22:15:12 zendframework/zend-code suggests installing doctrine/annotations (Doctrine\Common\Annotations >=1.0 for annotation features)
20-Jun-2018 22:15:12 zendframework/zend-code suggests installing zendframework/zend-stdlib (Zend\Stdlib component)
20-Jun-2018 22:15:12 ocramius/proxy-manager suggests installing ocramius/generated-hydrator (To have very fast object to array to object conversion for ghost objects)
20-Jun-2018 22:15:12 ocramius/proxy-manager suggests installing zendframework/zend-json (To have the JsonRpc adapter (Remote Object feature))
20-Jun-2018 22:15:12 ocramius/proxy-manager suggests installing zendframework/zend-soap (To have the Soap adapter (Remote Object feature))
20-Jun-2018 22:15:12 ocramius/proxy-manager suggests installing zendframework/zend-stdlib (To use the hydrator proxy)
20-Jun-2018 22:15:12 ocramius/proxy-manager suggests installing zendframework/zend-xmlrpc (To have the XmlRpc adapter (Remote Object feature))
20-Jun-2018 22:15:12 symfony/routing suggests installing doctrine/annotations (For using the annotation loader)
20-Jun-2018 22:15:12 symfony/routing suggests installing symfony/expression-language (For using expression matching)
20-Jun-2018 22:15:12 symfony/twig-bridge suggests installing symfony/asset (For using the AssetExtension)
20-Jun-2018 22:15:12 symfony/twig-bridge suggests installing symfony/expression-language (For using the ExpressionExtension)
20-Jun-2018 22:15:12 symfony/twig-bridge suggests installing symfony/form (For using the FormExtension)
20-Jun-2018 22:15:12 symfony/twig-bridge suggests installing symfony/security (For using the SecurityExtension)
20-Jun-2018 22:15:12 symfony/twig-bridge suggests installing symfony/stopwatch (For using the StopwatchExtension)
20-Jun-2018 22:15:12 symfony/twig-bridge suggests installing symfony/templating (For using the TwigEngine)
20-Jun-2018 22:15:12 symfony/twig-bridge suggests installing symfony/translation (For using the TranslationExtension)
20-Jun-2018 22:15:12 symfony/twig-bridge suggests installing symfony/var-dumper (For using the DumpExtension)
20-Jun-2018 22:15:12 symfony/twig-bridge suggests installing symfony/web-link (For using the WebLinkExtension)
20-Jun-2018 22:15:12 sebastian/global-state suggests installing ext-uopz (*)
20-Jun-2018 22:15:12 phpunit/phpunit-mock-objects suggests installing ext-soap (*)
20-Jun-2018 22:15:12 phpunit/phpunit suggests installing phpunit/php-invoker (~1.1)
20-Jun-2018 22:15:12 Generating autoload files
20-Jun-2018 22:15:13 Buildfile: /data/build/build.xml
20-Jun-2018 22:15:13
20-Jun-2018 22:15:13 phpBB > clean:
20-Jun-2018 22:15:13
20-Jun-2018 22:15:13    [delete] Directory /data/build/logs does not exist or is not a directory.
20-Jun-2018 22:15:13    [delete] Directory /data/build/api does not exist or is not a directory.
20-Jun-2018 22:15:13    [delete] Directory /data/build/codebrowser does not exist or is not a directory.
20-Jun-2018 22:15:13    [delete] Directory /data/build/coverage does not exist or is not a directory.
20-Jun-2018 22:15:13    [delete] Directory /data/build/cpd does not exist or is not a directory.
20-Jun-2018 22:15:13    [delete] Directory /data/build/dependencies does not exist or is not a directory.
20-Jun-2018 22:15:13    [delete] Directory /data/build/new_version does not exist or is not a directory.
20-Jun-2018 22:15:13    [delete] Directory /data/build/old_versions does not exist or is not a directory.
20-Jun-2018 22:15:13    [delete] Directory /data/build/save does not exist or is not a directory.
20-Jun-2018 22:15:13
20-Jun-2018 22:15:13 phpBB > prepare:
20-Jun-2018 22:15:13
20-Jun-2018 22:15:13     [mkdir] Created dir: /data/build/logs
20-Jun-2018 22:15:13     [mkdir] Created dir: /data/build/api
20-Jun-2018 22:15:13     [mkdir] Created dir: /data/build/codebrowser
20-Jun-2018 22:15:13     [mkdir] Created dir: /data/build/coverage
20-Jun-2018 22:15:13     [mkdir] Created dir: /data/build/cpd
20-Jun-2018 22:15:13     [mkdir] Created dir: /data/build/dependencies
20-Jun-2018 22:15:13     [mkdir] Created dir: /data/build/new_version
20-Jun-2018 22:15:13     [mkdir] Created dir: /data/build/new_version/files
20-Jun-2018 22:15:13     [mkdir] Created dir: /data/build/new_version/patches
20-Jun-2018 22:15:13     [mkdir] Created dir: /data/build/new_version/release_files
20-Jun-2018 22:15:13     [mkdir] Created dir: /data/build/new_version/update
20-Jun-2018 22:15:13     [mkdir] Created dir: /data/build/old_versions
20-Jun-2018 22:15:13     [mkdir] Created dir: /data/build/save
20-Jun-2018 22:15:13
20-Jun-2018 22:15:13 BUILD FINISHED
20-Jun-2018 22:15:13
20-Jun-2018 22:15:13 Total time: 0.1009 seconds
20-Jun-2018 22:15:13
20-Jun-2018 22:15:13 Finished task 'Prepare directory' with result: Success
20-Jun-2018 22:15:13 Skipping execution of task 'Run sniffs' as it is disabled
20-Jun-2018 22:15:13
Substituting variable: ${bamboo.working.directory} with /home/bamboo/xml-data/build-dir/PHPBB3-PR-JOB1
20-Jun-2018 22:15:13 Starting task 'Run sniffs' of type 'com.atlassian.bamboo.plugins.bamboo-docker-plugin:task.docker.cli'
20-Jun-2018 22:15:13 Running image name (phpbb:php-5.6)
20-Jun-2018 22:15:13
Beginning to execute external process for build 'phpBB3 - Pull Requests - Build and Test Job #8294 (PHPBB3-PR-JOB1-8294)'
... running command line:
/usr/bin/docker run --volume /home/bamboo/xml-data/build-dir/PHPBB3-PR-JOB1:/data --workdir /data/build --rm -u=991 phpbb:php-5.6 ../phpBB/vendor/bin/phing sniff
... in: /home/bamboo/xml-data/build-dir/PHPBB3-PR-JOB1
... using extra environment variables:
bamboo_planRepository_1_branch=3.1.x
bamboo_planRepository_1_branchDisplayName=3.1.x
bamboo_repository_revision_number=dc8ff9da28b8ab4ad11c7ea94cca526f17c87fe5
bamboo_PRref=master
bamboo_resultsUrl=https://bamboo.phpbb.com/browse/PHPBB3-PR-JOB1-8294
bamboo_capability_system_builder_command_Git=/usr/bin/git
bamboo_repository_75956235_git_username=bantu
bamboo_build_working_directory=/home/bamboo/xml-data/build-dir/PHPBB3-PR-JOB1
bamboo_planRepository_1_name=phpBB Ascraeus
bamboo_buildKey=PHPBB3-PR-JOB1
bamboo_capability_phpbb_tests=true
bamboo_shortPlanName=Pull Requests
bamboo_capability_system_builder_command_fop=/usr/bin/fop
bamboo_capability_dbms_sqlite_2=true
bamboo_planRepository_name=phpBB Ascraeus
bamboo_PRnumber=5225
bamboo_buildNumber=8294
bamboo_repository_75956235_git_repositoryUrl=https://github.com/phpbb/phpbb.git
bamboo_capability_system_builder_phpunit_PHPUnit=/usr/bin/phpunit
bamboo_shortJobName=Build and Test Job
bamboo_buildResultsUrl=https://bamboo.phpbb.com/browse/PHPBB3-PR-JOB1-8294
bamboo_repository_75956235_branch_name=3.1.x
bamboo_planRepository_repositoryUrl=https://github.com/phpbb/phpbb.git
bamboo_agentId=131073
bamboo_planName=phpBB3 - Pull Requests
bamboo_build_commandline_com_atlassian_bamboo_plugins_scripttask_task_builder_script_7=/bin/sh /home/bamboo/temp/PHPBB3-PR-JOB1-8294-ScriptBuildTask-4891976228033225313.sh
bamboo_shortPlanKey=PR
bamboo_shortJobKey=JOB1
bamboo_capability_dbms_mysql_55=true
bamboo_capability_system_jdk_JDK_1_7_0_65=/usr/lib/jvm/java-7-openjdk-amd64
bamboo_planRepository_revision=dc8ff9da28b8ab4ad11c7ea94cca526f17c87fe5
bamboo_buildTimeStamp=2018-06-20T22:13:43.701Z
bamboo_repository_previous_revision_number=dc8ff9da28b8ab4ad11c7ea94cca526f17c87fe5
bamboo_capability_system_jdk_JDK_1_6_0_16=/usr/lib/jvm/java-6-sun-1.6.0.16
bamboo_capability_system_builder_mvn2_Maven_2=/usr/share/maven2
bamboo_planRepository_previousRevision=dc8ff9da28b8ab4ad11c7ea94cca526f17c87fe5
bamboo_build_commandline_com_atlassian_bamboo_plugins_scripttask_task_builder_script_4=/bin/sh /home/bamboo/temp/PHPBB3-PR-JOB1-8294-ScriptBuildTask-7930556980437546452.sh
bamboo_repository_git_branch=3.1.x
bamboo_buildResultKey=PHPBB3-PR-JOB1-8294
bamboo_repository_branch_name=3.1.x
bamboo_buildPlanName=phpBB3 - Pull Requests - Build and Test Job
bamboo_planRepository_1_revision=dc8ff9da28b8ab4ad11c7ea94cca526f17c87fe5
bamboo_repository_name=phpBB Ascraeus
bamboo_buildFailed=false
bamboo_capability_system_docker_executable=/usr/bin/docker
bamboo_build_commandline_com_atlassian_bamboo_plugins_bamboo_docker_plugin_task_docker_cli_12=/usr/bin/docker run --volume /home/bamboo/xml-data/build-dir/PHPBB3-PR-JOB1:/data --workdir /data/phpBB --rm -e HOME=/home/bamboo -u=991 phpbb:php-5.6 /bin/bash -c php ../composer.phar install --dev; cd ../build; ../phpBB/vendor/bin/phing clean prepare
bamboo_planRepository_branch=3.1.x
bamboo_agentWorkingDirectory=/home/bamboo/xml-data/build-dir
bamboo_capability_system_git_executable=/usr/bin/git
bamboo_capability_system_builder_phpunit_PHPUnit_3_4=/usr/bin/phpunit
bamboo_repository_git_username=bantu
bamboo_planRepository_1_previousRevision=dc8ff9da28b8ab4ad11c7ea94cca526f17c87fe5
bamboo_repository_75956235_revision_number=dc8ff9da28b8ab4ad11c7ea94cca526f17c87fe5
bamboo_planRepository_branchDisplayName=3.1.x
bamboo_planRepository_1_type=gitv2
bamboo_planRepository_branchName=3.1.x
bamboo_repository_75956235_previous_revision_number=dc8ff9da28b8ab4ad11c7ea94cca526f17c87fe5
bamboo_capability_system_jdk_JDK=/usr/lib/jvm/java-6-sun
bamboo_plan_storageTag=PHPBB3-PR
bamboo_hg_cache_directory=/home/bamboo/xml-data/build-dir/_hg-repositories-cache
bamboo_planRepository_1_username=bantu
bamboo_planRepository_type=gitv2
bamboo_git_cache_directory=/home/bamboo/xml-data/build-dir/_git-repositories-cache
bamboo_ManualBuildTriggerReason_userName=Build Robot
bamboo_repository_git_repositoryUrl=https://github.com/phpbb/phpbb.git
bamboo_repository_75956235_git_branch=3.1.x
bamboo_capability_system_builder_ant_Ant=/usr/share/ant
bamboo_repository_75956235_name=phpBB Ascraeus
bamboo_tmp_directory=/home/bamboo/temp
bamboo_working_directory=/home/bamboo/xml-data/build-dir/PHPBB3-PR-JOB1
bamboo_planKey=PHPBB3-PR
bamboo_capability_local=true
bamboo_planRepository_1_repositoryUrl=https://github.com/phpbb/phpbb.git
bamboo_planRepository_username=bantu
bamboo_capability_system_jdk_JDK_1_6=/usr/lib/jvm/java-6-sun
bamboo_capability_system_jdk_JDK_1_7=/usr/lib/jvm/java-7-openjdk-amd64
bamboo_planRepository_1_branchName=3.1.x
20-Jun-2018 22:15:14 Buildfile: /data/build/build.xml
20-Jun-2018 22:15:14
20-Jun-2018 22:15:14 phpBB > sniff:
20-Jun-2018 22:15:14
20-Jun-2018 22:15:22 ............................................................  60 / 766 (8%)
20-Jun-2018 22:15:23 ............................................................ 120 / 766 (16%)
20-Jun-2018 22:15:24 ............................................................ 180 / 766 (23%)
20-Jun-2018 22:15:24 ............................................................ 240 / 766 (31%)
20-Jun-2018 22:15:27 ............................................................ 300 / 766 (39%)
20-Jun-2018 22:15:33 ............................................................ 360 / 766 (47%)
20-Jun-2018 22:15:38 ............................................................ 420 / 766 (55%)
20-Jun-2018 22:15:42 ............................................................ 480 / 766 (63%)
20-Jun-2018 22:15:45 ............................................................ 540 / 766 (70%)
20-Jun-2018 22:15:49 ............................................................ 600 / 766 (78%)
20-Jun-2018 22:15:53 ............................................................ 660 / 766 (86%)
20-Jun-2018 22:15:57 ............................................................ 720 / 766 (94%)
20-Jun-2018 22:15:58 ..............................................
20-Jun-2018 22:15:58
20-Jun-2018 22:15:58 Time: 44.41 secs; Memory: 64.5Mb
20-Jun-2018 22:15:58
20-Jun-2018 22:16:06 ............................................................  60 / 209 (29%)
20-Jun-2018 22:16:24 ............................................................ 120 / 209 (57%)
20-Jun-2018 22:16:38 ............................................................ 180 / 209 (86%)
20-Jun-2018 22:16:45 .............................
20-Jun-2018 22:16:45
20-Jun-2018 22:16:45 Time: 47 secs; Memory: 60.75Mb
20-Jun-2018 22:16:45
20-Jun-2018 22:16:45
20-Jun-2018 22:16:45
20-Jun-2018 22:16:45 Time: 17ms; Memory: 3.75Mb
20-Jun-2018 22:16:45
20-Jun-2018 22:16:45
20-Jun-2018 22:16:45 BUILD FINISHED
20-Jun-2018 22:16:45
20-Jun-2018 22:16:45 Total time: 2 minutes  31.72 seconds
20-Jun-2018 22:16:45
20-Jun-2018 22:16:46 Finished task 'Run sniffs' with result: Success
20-Jun-2018 22:16:46 Skipping execution of task 'Run tests' as it is disabled
20-Jun-2018 22:16:46
Substituting variable: ${bamboo.working.directory} with /home/bamboo/xml-data/build-dir/PHPBB3-PR-JOB1
20-Jun-2018 22:16:46 Starting task 'Run tests' of type 'com.atlassian.bamboo.plugins.bamboo-docker-plugin:task.docker.cli'
20-Jun-2018 22:16:46 Running image name (phpbb:php-5.6)
20-Jun-2018 22:16:46
Beginning to execute external process for build 'phpBB3 - Pull Requests - Build and Test Job #8294 (PHPBB3-PR-JOB1-8294)'
... running command line:
/usr/bin/docker run --volume /home/bamboo/xml-data/build-dir/PHPBB3-PR-JOB1:/data --workdir /data --rm -u=991 -t phpbb:php-5.6 /bin/bash -c phpBB/vendor/bin/phpunit --log-junit build/logs/phpunit.xml
... in: /home/bamboo/xml-data/build-dir/PHPBB3-PR-JOB1
... using extra environment variables:
bamboo_planRepository_1_branch=3.1.x
bamboo_planRepository_1_branchDisplayName=3.1.x
bamboo_repository_revision_number=dc8ff9da28b8ab4ad11c7ea94cca526f17c87fe5
bamboo_PRref=master
bamboo_resultsUrl=https://bamboo.phpbb.com/browse/PHPBB3-PR-JOB1-8294
bamboo_capability_system_builder_command_Git=/usr/bin/git
bamboo_repository_75956235_git_username=bantu
bamboo_build_working_directory=/home/bamboo/xml-data/build-dir/PHPBB3-PR-JOB1
bamboo_planRepository_1_name=phpBB Ascraeus
bamboo_buildKey=PHPBB3-PR-JOB1
bamboo_capability_phpbb_tests=true
bamboo_shortPlanName=Pull Requests
bamboo_capability_system_builder_command_fop=/usr/bin/fop
bamboo_capability_dbms_sqlite_2=true
bamboo_planRepository_name=phpBB Ascraeus
bamboo_PRnumber=5225
bamboo_buildNumber=8294
bamboo_repository_75956235_git_repositoryUrl=https://github.com/phpbb/phpbb.git
bamboo_capability_system_builder_phpunit_PHPUnit=/usr/bin/phpunit
bamboo_shortJobName=Build and Test Job
bamboo_buildResultsUrl=https://bamboo.phpbb.com/browse/PHPBB3-PR-JOB1-8294
bamboo_repository_75956235_branch_name=3.1.x
bamboo_planRepository_repositoryUrl=https://github.com/phpbb/phpbb.git
bamboo_agentId=131073
bamboo_planName=phpBB3 - Pull Requests
bamboo_build_commandline_com_atlassian_bamboo_plugins_scripttask_task_builder_script_7=/bin/sh /home/bamboo/temp/PHPBB3-PR-JOB1-8294-ScriptBuildTask-4891976228033225313.sh
bamboo_shortPlanKey=PR
bamboo_shortJobKey=JOB1
bamboo_capability_dbms_mysql_55=true
bamboo_capability_system_jdk_JDK_1_7_0_65=/usr/lib/jvm/java-7-openjdk-amd64
bamboo_planRepository_revision=dc8ff9da28b8ab4ad11c7ea94cca526f17c87fe5
bamboo_buildTimeStamp=2018-06-20T22:13:43.701Z
bamboo_repository_previous_revision_number=dc8ff9da28b8ab4ad11c7ea94cca526f17c87fe5
bamboo_capability_system_jdk_JDK_1_6_0_16=/usr/lib/jvm/java-6-sun-1.6.0.16
bamboo_capability_system_builder_mvn2_Maven_2=/usr/share/maven2
bamboo_planRepository_previousRevision=dc8ff9da28b8ab4ad11c7ea94cca526f17c87fe5
bamboo_build_commandline_com_atlassian_bamboo_plugins_scripttask_task_builder_script_4=/bin/sh /home/bamboo/temp/PHPBB3-PR-JOB1-8294-ScriptBuildTask-7930556980437546452.sh
bamboo_repository_git_branch=3.1.x
bamboo_buildResultKey=PHPBB3-PR-JOB1-8294
bamboo_repository_branch_name=3.1.x
bamboo_buildPlanName=phpBB3 - Pull Requests - Build and Test Job
bamboo_planRepository_1_revision=dc8ff9da28b8ab4ad11c7ea94cca526f17c87fe5
bamboo_repository_name=phpBB Ascraeus
bamboo_buildFailed=false
bamboo_capability_system_docker_executable=/usr/bin/docker
bamboo_build_commandline_com_atlassian_bamboo_plugins_bamboo_docker_plugin_task_docker_cli_11=/usr/bin/docker run --volume /home/bamboo/xml-data/build-dir/PHPBB3-PR-JOB1:/data --workdir /data/build --rm -u=991 phpbb:php-5.6 ../phpBB/vendor/bin/phing sniff
bamboo_build_commandline_com_atlassian_bamboo_plugins_bamboo_docker_plugin_task_docker_cli_12=/usr/bin/docker run --volume /home/bamboo/xml-data/build-dir/PHPBB3-PR-JOB1:/data --workdir /data/phpBB --rm -e HOME=/home/bamboo -u=991 phpbb:php-5.6 /bin/bash -c php ../composer.phar install --dev; cd ../build; ../phpBB/vendor/bin/phing clean prepare
bamboo_planRepository_branch=3.1.x
bamboo_agentWorkingDirectory=/home/bamboo/xml-data/build-dir
bamboo_capability_system_git_executable=/usr/bin/git
bamboo_capability_system_builder_phpunit_PHPUnit_3_4=/usr/bin/phpunit
bamboo_repository_git_username=bantu
bamboo_planRepository_1_previousRevision=dc8ff9da28b8ab4ad11c7ea94cca526f17c87fe5
bamboo_repository_75956235_revision_number=dc8ff9da28b8ab4ad11c7ea94cca526f17c87fe5
bamboo_planRepository_branchDisplayName=3.1.x
bamboo_planRepository_1_type=gitv2
bamboo_planRepository_branchName=3.1.x
bamboo_repository_75956235_previous_revision_number=dc8ff9da28b8ab4ad11c7ea94cca526f17c87fe5
bamboo_capability_system_jdk_JDK=/usr/lib/jvm/java-6-sun
bamboo_plan_storageTag=PHPBB3-PR
bamboo_hg_cache_directory=/home/bamboo/xml-data/build-dir/_hg-repositories-cache
bamboo_planRepository_1_username=bantu
bamboo_planRepository_type=gitv2
bamboo_git_cache_directory=/home/bamboo/xml-data/build-dir/_git-repositories-cache
bamboo_ManualBuildTriggerReason_userName=Build Robot
bamboo_repository_git_repositoryUrl=https://github.com/phpbb/phpbb.git
bamboo_repository_75956235_git_branch=3.1.x
bamboo_capability_system_builder_ant_Ant=/usr/share/ant
bamboo_repository_75956235_name=phpBB Ascraeus
bamboo_tmp_directory=/home/bamboo/temp
bamboo_working_directory=/home/bamboo/xml-data/build-dir/PHPBB3-PR-JOB1
bamboo_planKey=PHPBB3-PR
bamboo_capability_local=true
bamboo_planRepository_1_repositoryUrl=https://github.com/phpbb/phpbb.git
bamboo_planRepository_username=bantu
bamboo_capability_system_jdk_JDK_1_6=/usr/lib/jvm/java-6-sun
bamboo_capability_system_jdk_JDK_1_7=/usr/lib/jvm/java-7-openjdk-amd64
bamboo_planRepository_1_branchName=3.1.x
20-Jun-2018 22:16:49 PHPUnit 5.7.26 by Sebastian Bergmann and contributors.
20-Jun-2018 22:16:49
20-Jun-2018 22:16:56 .............................................................   61 / 7199 (  0%)
20-Jun-2018 22:16:57 .............................................................  122 / 7199 (  1%)
20-Jun-2018 22:16:58 .............I.....SSSSSSSS............SSSS.........S...S....  183 / 7199 (  2%)
20-Jun-2018 22:17:00 .............................................................  244 / 7199 (  3%)
20-Jun-2018 22:17:08 .....S............W..........................................  305 / 7199 (  4%)
20-Jun-2018 22:17:09 .............................................................  366 / 7199 (  5%)
20-Jun-2018 22:17:09 .............................................................  427 / 7199 (  5%)
20-Jun-2018 22:17:10 .............................................................  488 / 7199 (  6%)
20-Jun-2018 22:17:10 .............................................................  549 / 7199 (  7%)
20-Jun-2018 22:17:11 .............................................................  610 / 7199 (  8%)
20-Jun-2018 22:17:12 .............................................................  671 / 7199 (  9%)
20-Jun-2018 22:17:12 .............................................................  732 / 7199 ( 10%)
20-Jun-2018 22:17:13 .............................................................  793 / 7199 ( 11%)
20-Jun-2018 22:17:14 .............................................................  854 / 7199 ( 11%)
20-Jun-2018 22:17:15 .............................................................  915 / 7199 ( 12%)
20-Jun-2018 22:17:16 .............................................................  976 / 7199 ( 13%)
20-Jun-2018 22:17:16 ............................................................. 1037 / 7199 ( 14%)
20-Jun-2018 22:17:20 ................................................I............ 1098 / 7199 ( 15%)
20-Jun-2018 22:17:25 ............................................................. 1159 / 7199 ( 16%)
20-Jun-2018 22:17:32 ............................................................. 1220 / 7199 ( 16%)
20-Jun-2018 22:17:34 ........................................S.S.S................ 1281 / 7199 ( 17%)
20-Jun-2018 22:17:35 ............................................................. 1342 / 7199 ( 18%)
20-Jun-2018 22:17:35 ............................................................. 1403 / 7199 ( 19%)
20-Jun-2018 22:17:35 ............................................................. 1464 / 7199 ( 20%)
20-Jun-2018 22:17:35 ............................................................. 1525 / 7199 ( 21%)
20-Jun-2018 22:17:35 ............................................................. 1586 / 7199 ( 22%)
20-Jun-2018 22:17:36 ............................................................. 1647 / 7199 ( 22%)
20-Jun-2018 22:17:36 ............................................................. 1708 / 7199 ( 23%)
20-Jun-2018 22:17:36 ............................................................. 1769 / 7199 ( 24%)
20-Jun-2018 22:17:36 ............................................................. 1830 / 7199 ( 25%)
20-Jun-2018 22:17:36 ............................................................. 1891 / 7199 ( 26%)
20-Jun-2018 22:17:36 ............................................................. 1952 / 7199 ( 27%)
20-Jun-2018 22:17:36 ............................................................. 2013 / 7199 ( 27%)
20-Jun-2018 22:17:36 ............................................................. 2074 / 7199 ( 28%)
20-Jun-2018 22:17:37 ............................................................. 2135 / 7199 ( 29%)
20-Jun-2018 22:17:38 ............................................................. 2196 / 7199 ( 30%)
20-Jun-2018 22:17:39 ............................................................. 2257 / 7199 ( 31%)
20-Jun-2018 22:17:39 ............................................................. 2318 / 7199 ( 32%)
20-Jun-2018 22:17:39 ............................................................. 2379 / 7199 ( 33%)
20-Jun-2018 22:17:41 ............................I.II............................. 2440 / 7199 ( 33%)
20-Jun-2018 22:17:42 ............................................................. 2501 / 7199 ( 34%)
20-Jun-2018 22:17:42 ............................................................. 2562 / 7199 ( 35%)
20-Jun-2018 22:17:42 ............................................................. 2623 / 7199 ( 36%)
20-Jun-2018 22:17:43 ............................................................. 2684 / 7199 ( 37%)
20-Jun-2018 22:17:46 ............................................................. 2745 / 7199 ( 38%)
20-Jun-2018 22:17:47 ............................................................. 2806 / 7199 ( 38%)
20-Jun-2018 22:17:47 ..................................................SSSSSSSSS.. 2867 / 7199 ( 39%)
20-Jun-2018 22:17:47 ............................................................. 2928 / 7199 ( 40%)
20-Jun-2018 22:17:58 ............................................................. 2989 / 7199 ( 41%)
20-Jun-2018 22:18:04 ............................................................. 3050 / 7199 ( 42%)
20-Jun-2018 22:18:08 ..........................S.................................. 3111 / 7199 ( 43%)
20-Jun-2018 22:18:09 ............................................................. 3172 / 7199 ( 44%)
20-Jun-2018 22:18:14 ...................EEEEEEEEEEEEEEE........................... 3233 / 7199 ( 44%)
20-Jun-2018 22:18:21 ...................................................SSSS...... 3294 / 7199 ( 45%)
20-Jun-2018 22:18:31 ............................................................. 3355 / 7199 ( 46%)
20-Jun-2018 22:18:32 ............................................................. 3416 / 7199 ( 47%)
20-Jun-2018 22:18:32 ............................................................. 3477 / 7199 ( 48%)
20-Jun-2018 22:18:32 ............................................................. 3538 / 7199 ( 49%)
20-Jun-2018 22:18:33 ............................................................. 3599 / 7199 ( 49%)
20-Jun-2018 22:18:33 ............................................................. 3660 / 7199 ( 50%)
20-Jun-2018 22:18:33 ............................................................. 3721 / 7199 ( 51%)
20-Jun-2018 22:18:33 ............................................................. 3782 / 7199 ( 52%)
20-Jun-2018 22:18:33 ............................................................. 3843 / 7199 ( 53%)
20-Jun-2018 22:18:36 ............................................................. 3904 / 7199 ( 54%)
20-Jun-2018 22:18:36 ............................................................. 3965 / 7199 ( 55%)
20-Jun-2018 22:18:39 ............................................................. 4026 / 7199 ( 55%)
20-Jun-2018 22:18:40 ............................................................. 4087 / 7199 ( 56%)
20-Jun-2018 22:18:41 ............................................................. 4148 / 7199 ( 57%)
20-Jun-2018 22:18:44 ............................................................. 4209 / 7199 ( 58%)
20-Jun-2018 22:18:52 ............................................................. 4270 / 7199 ( 59%)
20-Jun-2018 22:18:56 ............................................................. 4331 / 7199 ( 60%)
20-Jun-2018 22:18:57 ............................................................. 4392 / 7199 ( 61%)
20-Jun-2018 22:18:57 ............................................................. 4453 / 7199 ( 61%)
20-Jun-2018 22:18:57 ............................................................. 4514 / 7199 ( 62%)
20-Jun-2018 22:18:58 ............................................................. 4575 / 7199 ( 63%)
20-Jun-2018 22:18:58 ............................................................. 4636 / 7199 ( 64%)
20-Jun-2018 22:18:58 ............................................................. 4697 / 7199 ( 65%)
20-Jun-2018 22:18:58 ............................................................. 4758 / 7199 ( 66%)
20-Jun-2018 22:18:58 ............................................................. 4819 / 7199 ( 66%)
20-Jun-2018 22:18:58 ............................................................. 4880 / 7199 ( 67%)
20-Jun-2018 22:19:11 ............................................................. 4941 / 7199 ( 68%)
20-Jun-2018 22:19:19 ..........................S.................................. 5002 / 7199 ( 69%)
20-Jun-2018 22:19:27 ............................................................. 5063 / 7199 ( 70%)
20-Jun-2018 22:19:34 ............................................................. 5124 / 7199 ( 71%)
20-Jun-2018 22:19:34 ............................................................. 5185 / 7199 ( 72%)
20-Jun-2018 22:19:35 ............................................................. 5246 / 7199 ( 72%)
20-Jun-2018 22:19:35 ............................................................. 5307 / 7199 ( 73%)
20-Jun-2018 22:19:36 ...........................................SSSSSSSSSSSSSSSSSS 5368 / 7199 ( 74%)
20-Jun-2018 22:19:36 SSSSSSSSSSSSSSSSSSSSSSSSSSSSSSSSSSSSSSSSSSSSSSSSSSSSSSSSSSSSS 5429 / 7199 ( 75%)
20-Jun-2018 22:19:36 SSSSSSSSSSSSSSSSSSSSSSSSSSSSSSSSSSSSSSSSSSSSSSSSSSSSSSSSSSSSS 5490 / 7199 ( 76%)
20-Jun-2018 22:19:36 SSSSSSSSSSSSSSSSSSSSSSSSSSSSSSSSSSSSSSSSSSSSSSSSSSSSSSSSSSSSS 5551 / 7199 ( 77%)
20-Jun-2018 22:19:36 SSSSSSSSSSSSSSSSSSSSSSSSSSSSSSSSSSSSSSSSSSSSSSSSSSSSSSSSSSSSS 5612 / 7199 ( 77%)
20-Jun-2018 22:19:38 ............................................................. 5673 / 7199 ( 78%)
20-Jun-2018 22:19:41 ............................................................. 5734 / 7199 ( 79%)
20-Jun-2018 22:19:44 ............................................................. 5795 / 7199 ( 80%)
20-Jun-2018 22:19:47 ............................................................. 5856 / 7199 ( 81%)
20-Jun-2018 22:19:49 ............................................................. 5917 / 7199 ( 82%)
20-Jun-2018 22:19:52 ............................................................. 5978 / 7199 ( 83%)
20-Jun-2018 22:19:55 ............................................................. 6039 / 7199 ( 83%)
20-Jun-2018 22:19:57 ............................................................. 6100 / 7199 ( 84%)
20-Jun-2018 22:20:00 ............................................................. 6161 / 7199 ( 85%)
20-Jun-2018 22:20:03 ............................................................. 6222 / 7199 ( 86%)
20-Jun-2018 22:20:05 ............................................................. 6283 / 7199 ( 87%)
20-Jun-2018 22:20:08 ............................................................. 6344 / 7199 ( 88%)
20-Jun-2018 22:20:11 ............................................................. 6405 / 7199 ( 88%)
20-Jun-2018 22:20:13 ............................................................. 6466 / 7199 ( 89%)
20-Jun-2018 22:20:16 ............................................................. 6527 / 7199 ( 90%)
20-Jun-2018 22:20:18 ............................................................. 6588 / 7199 ( 91%)
20-Jun-2018 22:20:21 ............................................................. 6649 / 7199 ( 92%)
20-Jun-2018 22:20:24 ............................................................. 6710 / 7199 ( 93%)
20-Jun-2018 22:20:27 ............................................................. 6771 / 7199 ( 94%)
20-Jun-2018 22:20:29 ............................................................. 6832 / 7199 ( 94%)
20-Jun-2018 22:20:32 ............................................................. 6893 / 7199 ( 95%)
20-Jun-2018 22:20:34 ............................................................. 6954 / 7199 ( 96%)
20-Jun-2018 22:20:37 ............................................................. 7015 / 7199 ( 97%)
20-Jun-2018 22:20:40 ............................................................. 7076 / 7199 ( 98%)
20-Jun-2018 22:20:42 ............................................................. 7137 / 7199 ( 99%)
20-Jun-2018 22:20:45 ............................................................S 7198 / 7199 ( 99%)
20-Jun-2018 22:20:45 S                                                             7199 / 7199 (100%)
20-Jun-2018 22:20:45
20-Jun-2018 22:20:45 Time: 3.97 minutes, Memory: 520.25MB
20-Jun-2018 22:20:45
20-Jun-2018 22:20:45 There were 15 errors:
20-Jun-2018 22:20:45
20-Jun-2018 22:20:45 1) phpbb_notification_group_request_test::test_notifications
20-Jun-2018 22:20:45 Symfony\Component\DependencyInjection\Exception\ServiceNotFoundException: The service "notification.type.mention" has a dependency on a non-existent service "text_formatter.s9e.mention_helper".
20-Jun-2018 22:20:45
20-Jun-2018 22:20:45 /data/phpBB/vendor/symfony/dependency-injection/Compiler/CheckExceptionOnInvalidReferenceBehaviorPass.php:32
20-Jun-2018 22:20:45 /data/phpBB/vendor/symfony/dependency-injection/Compiler/AbstractRecursivePass.php:60
20-Jun-2018 22:20:45 /data/phpBB/vendor/symfony/dependency-injection/Compiler/CheckExceptionOnInvalidReferenceBehaviorPass.php:29
20-Jun-2018 22:20:45 /data/phpBB/vendor/symfony/dependency-injection/Compiler/AbstractRecursivePass.php:60
20-Jun-2018 22:20:45 /data/phpBB/vendor/symfony/dependency-injection/Compiler/CheckExceptionOnInvalidReferenceBehaviorPass.php:29
20-Jun-2018 22:20:45 /data/phpBB/vendor/symfony/dependency-injection/Compiler/AbstractRecursivePass.php:60
20-Jun-2018 22:20:45 /data/phpBB/vendor/symfony/dependency-injection/Compiler/CheckExceptionOnInvalidReferenceBehaviorPass.php:29
20-Jun-2018 22:20:45 /data/phpBB/vendor/symfony/dependency-injection/Compiler/AbstractRecursivePass.php:69
20-Jun-2018 22:20:45 /data/phpBB/vendor/symfony/dependency-injection/Compiler/CheckExceptionOnInvalidReferenceBehaviorPass.php:29
20-Jun-2018 22:20:45 /data/phpBB/vendor/symfony/dependency-injection/Compiler/AbstractRecursivePass.php:60
20-Jun-2018 22:20:45 /data/phpBB/vendor/symfony/dependency-injection/Compiler/CheckExceptionOnInvalidReferenceBehaviorPass.php:29
20-Jun-2018 22:20:45 /data/phpBB/vendor/symfony/dependency-injection/Compiler/AbstractRecursivePass.php:39
20-Jun-2018 22:20:45 /data/phpBB/vendor/symfony/dependency-injection/Compiler/Compiler.php:141
20-Jun-2018 22:20:45 /data/phpBB/vendor/symfony/dependency-injection/ContainerBuilder.php:753
20-Jun-2018 22:20:45 /data/tests/notification/base.php:122
20-Jun-2018 22:20:45
20-Jun-2018 22:20:45 2) phpbb_notification_test::test_get_notification_type_id
20-Jun-2018 22:20:45 Symfony\Component\DependencyInjection\Exception\ServiceNotFoundException: The service "notification.type.mention" has a dependency on a non-existent service "text_formatter.s9e.mention_helper".
20-Jun-2018 22:20:45
20-Jun-2018 22:20:45 /data/phpBB/vendor/symfony/dependency-injection/Compiler/CheckExceptionOnInvalidReferenceBehaviorPass.php:32
20-Jun-2018 22:20:45 /data/phpBB/vendor/symfony/dependency-injection/Compiler/AbstractRecursivePass.php:60
20-Jun-2018 22:20:45 /data/phpBB/vendor/symfony/dependency-injection/Compiler/CheckExceptionOnInvalidReferenceBehaviorPass.php:29
20-Jun-2018 22:20:45 /data/phpBB/vendor/symfony/dependency-injection/Compiler/AbstractRecursivePass.php:60
20-Jun-2018 22:20:45 /data/phpBB/vendor/symfony/dependency-injection/Compiler/CheckExceptionOnInvalidReferenceBehaviorPass.php:29
20-Jun-2018 22:20:45 /data/phpBB/vendor/symfony/dependency-injection/Compiler/AbstractRecursivePass.php:60
20-Jun-2018 22:20:45 /data/phpBB/vendor/symfony/dependency-injection/Compiler/CheckExceptionOnInvalidReferenceBehaviorPass.php:29
20-Jun-2018 22:20:45 /data/phpBB/vendor/symfony/dependency-injection/Compiler/AbstractRecursivePass.php:69
20-Jun-2018 22:20:45 /data/phpBB/vendor/symfony/dependency-injection/Compiler/CheckExceptionOnInvalidReferenceBehaviorPass.php:29
20-Jun-2018 22:20:45 /data/phpBB/vendor/symfony/dependency-injection/Compiler/AbstractRecursivePass.php:60
20-Jun-2018 22:20:45 /data/phpBB/vendor/symfony/dependency-injection/Compiler/CheckExceptionOnInvalidReferenceBehaviorPass.php:29
20-Jun-2018 22:20:45 /data/phpBB/vendor/symfony/dependency-injection/Compiler/AbstractRecursivePass.php:39
20-Jun-2018 22:20:45 /data/phpBB/vendor/symfony/dependency-injection/Compiler/Compiler.php:141
20-Jun-2018 22:20:45 /data/phpBB/vendor/symfony/dependency-injection/ContainerBuilder.php:753
20-Jun-2018 22:20:45 /data/tests/notification/base.php:122
20-Jun-2018 22:20:45
20-Jun-2018 22:20:45 3) phpbb_notification_test::test_get_subscription_types
20-Jun-2018 22:20:45 Symfony\Component\DependencyInjection\Exception\ServiceNotFoundException: The service "notification.type.mention" has a dependency on a non-existent service "text_formatter.s9e.mention_helper".
20-Jun-2018 22:20:45
20-Jun-2018 22:20:45 /data/phpBB/vendor/symfony/dependency-injection/Compiler/CheckExceptionOnInvalidReferenceBehaviorPass.php:32
20-Jun-2018 22:20:45 /data/phpBB/vendor/symfony/dependency-injection/Compiler/AbstractRecursivePass.php:60
20-Jun-2018 22:20:45 /data/phpBB/vendor/symfony/dependency-injection/Compiler/CheckExceptionOnInvalidReferenceBehaviorPass.php:29
20-Jun-2018 22:20:45 /data/phpBB/vendor/symfony/dependency-injection/Compiler/AbstractRecursivePass.php:60
20-Jun-2018 22:20:45 /data/phpBB/vendor/symfony/dependency-injection/Compiler/CheckExceptionOnInvalidReferenceBehaviorPass.php:29
20-Jun-2018 22:20:45 /data/phpBB/vendor/symfony/dependency-injection/Compiler/AbstractRecursivePass.php:60
20-Jun-2018 22:20:45 /data/phpBB/vendor/symfony/dependency-injection/Compiler/CheckExceptionOnInvalidReferenceBehaviorPass.php:29
20-Jun-2018 22:20:45 /data/phpBB/vendor/symfony/dependency-injection/Compiler/AbstractRecursivePass.php:69
20-Jun-2018 22:20:45 /data/phpBB/vendor/symfony/dependency-injection/Compiler/CheckExceptionOnInvalidReferenceBehaviorPass.php:29
20-Jun-2018 22:20:45 /data/phpBB/vendor/symfony/dependency-injection/Compiler/AbstractRecursivePass.php:60
20-Jun-2018 22:20:45 /data/phpBB/vendor/symfony/dependency-injection/Compiler/CheckExceptionOnInvalidReferenceBehaviorPass.php:29
20-Jun-2018 22:20:45 /data/phpBB/vendor/symfony/dependency-injection/Compiler/AbstractRecursivePass.php:39
20-Jun-2018 22:20:45 /data/phpBB/vendor/symfony/dependency-injection/Compiler/Compiler.php:141
20-Jun-2018 22:20:45 /data/phpBB/vendor/symfony/dependency-injection/ContainerBuilder.php:753
20-Jun-2018 22:20:45 /data/tests/notification/base.php:122
20-Jun-2018 22:20:45
20-Jun-2018 22:20:45 4) phpbb_notification_test::test_subscriptions
20-Jun-2018 22:20:45 Symfony\Component\DependencyInjection\Exception\ServiceNotFoundException: The service "notification.type.mention" has a dependency on a non-existent service "text_formatter.s9e.mention_helper".
20-Jun-2018 22:20:45
20-Jun-2018 22:20:45 /data/phpBB/vendor/symfony/dependency-injection/Compiler/CheckExceptionOnInvalidReferenceBehaviorPass.php:32
20-Jun-2018 22:20:45 /data/phpBB/vendor/symfony/dependency-injection/Compiler/AbstractRecursivePass.php:60
20-Jun-2018 22:20:45 /data/phpBB/vendor/symfony/dependency-injection/Compiler/CheckExceptionOnInvalidReferenceBehaviorPass.php:29
20-Jun-2018 22:20:45 /data/phpBB/vendor/symfony/dependency-injection/Compiler/AbstractRecursivePass.php:60
20-Jun-2018 22:20:45 /data/phpBB/vendor/symfony/dependency-injection/Compiler/CheckExceptionOnInvalidReferenceBehaviorPass.php:29
20-Jun-2018 22:20:45 /data/phpBB/vendor/symfony/dependency-injection/Compiler/AbstractRecursivePass.php:60
20-Jun-2018 22:20:45 /data/phpBB/vendor/symfony/dependency-injection/Compiler/CheckExceptionOnInvalidReferenceBehaviorPass.php:29
20-Jun-2018 22:20:45 /data/phpBB/vendor/symfony/dependency-injection/Compiler/AbstractRecursivePass.php:69
20-Jun-2018 22:20:45 /data/phpBB/vendor/symfony/dependency-injection/Compiler/CheckExceptionOnInvalidReferenceBehaviorPass.php:29
20-Jun-2018 22:20:45 /data/phpBB/vendor/symfony/dependency-injection/Compiler/AbstractRecursivePass.php:60
20-Jun-2018 22:20:45 /data/phpBB/vendor/symfony/dependency-injection/Compiler/CheckExceptionOnInvalidReferenceBehaviorPass.php:29
20-Jun-2018 22:20:45 /data/phpBB/vendor/symfony/dependency-injection/Compiler/AbstractRecursivePass.php:39
20-Jun-2018 22:20:45 /data/phpBB/vendor/symfony/dependency-injection/Compiler/Compiler.php:141
20-Jun-2018 22:20:45 /data/phpBB/vendor/symfony/dependency-injection/ContainerBuilder.php:753
20-Jun-2018 22:20:45 /data/tests/notification/base.php:122
20-Jun-2018 22:20:45
20-Jun-2018 22:20:45 5) phpbb_notification_test::test_notifications
20-Jun-2018 22:20:45 Symfony\Component\DependencyInjection\Exception\ServiceNotFoundException: The service "notification.type.mention" has a dependency on a non-existent service "text_formatter.s9e.mention_helper".
20-Jun-2018 22:20:45
20-Jun-2018 22:20:45 /data/phpBB/vendor/symfony/dependency-injection/Compiler/CheckExceptionOnInvalidReferenceBehaviorPass.php:32
20-Jun-2018 22:20:45 /data/phpBB/vendor/symfony/dependency-injection/Compiler/AbstractRecursivePass.php:60
20-Jun-2018 22:20:45 /data/phpBB/vendor/symfony/dependency-injection/Compiler/CheckExceptionOnInvalidReferenceBehaviorPass.php:29
20-Jun-2018 22:20:45 /data/phpBB/vendor/symfony/dependency-injection/Compiler/AbstractRecursivePass.php:60
20-Jun-2018 22:20:45 /data/phpBB/vendor/symfony/dependency-injection/Compiler/CheckExceptionOnInvalidReferenceBehaviorPass.php:29
20-Jun-2018 22:20:45 /data/phpBB/vendor/symfony/dependency-injection/Compiler/AbstractRecursivePass.php:60
20-Jun-2018 22:20:45 /data/phpBB/vendor/symfony/dependency-injection/Compiler/CheckExceptionOnInvalidReferenceBehaviorPass.php:29
20-Jun-2018 22:20:45 /data/phpBB/vendor/symfony/dependency-injection/Compiler/AbstractRecursivePass.php:69
20-Jun-2018 22:20:45 /data/phpBB/vendor/symfony/dependency-injection/Compiler/CheckExceptionOnInvalidReferenceBehaviorPass.php:29
20-Jun-2018 22:20:45 /data/phpBB/vendor/symfony/dependency-injection/Compiler/AbstractRecursivePass.php:60
20-Jun-2018 22:20:45 /data/phpBB/vendor/symfony/dependency-injection/Compiler/CheckExceptionOnInvalidReferenceBehaviorPass.php:29
20-Jun-2018 22:20:45 /data/phpBB/vendor/symfony/dependency-injection/Compiler/AbstractRecursivePass.php:39
20-Jun-2018 22:20:45 /data/phpBB/vendor/symfony/dependency-injection/Compiler/Compiler.php:141
20-Jun-2018 22:20:45 /data/phpBB/vendor/symfony/dependency-injection/ContainerBuilder.php:753
20-Jun-2018 22:20:45 /data/tests/notification/base.php:122
20-Jun-2018 22:20:45
20-Jun-2018 22:20:45 6) phpbb_notification_submit_post_type_bookmark_test::test_submit_post with data set #0 (array(), array(array(5, 1, 1)), array(array(3, 2, 1), array(5, 1, 1), array(7, 2, 1)))
20-Jun-2018 22:20:45 Symfony\Component\DependencyInjection\Exception\ServiceNotFoundException: The service "notification.type.mention" has a dependency on a non-existent service "text_formatter.s9e.mention_helper".
20-Jun-2018 22:20:45
20-Jun-2018 22:20:45 /data/phpBB/vendor/symfony/dependency-injection/Compiler/CheckExceptionOnInvalidReferenceBehaviorPass.php:32
20-Jun-2018 22:20:45 /data/phpBB/vendor/symfony/dependency-injection/Compiler/AbstractRecursivePass.php:60
20-Jun-2018 22:20:45 /data/phpBB/vendor/symfony/dependency-injection/Compiler/CheckExceptionOnInvalidReferenceBehaviorPass.php:29
20-Jun-2018 22:20:45 /data/phpBB/vendor/symfony/dependency-injection/Compiler/AbstractRecursivePass.php:60
20-Jun-2018 22:20:45 /data/phpBB/vendor/symfony/dependency-injection/Compiler/CheckExceptionOnInvalidReferenceBehaviorPass.php:29
20-Jun-2018 22:20:45 /data/phpBB/vendor/symfony/dependency-injection/Compiler/AbstractRecursivePass.php:60
20-Jun-2018 22:20:45 /data/phpBB/vendor/symfony/dependency-injection/Compiler/CheckExceptionOnInvalidReferenceBehaviorPass.php:29
20-Jun-2018 22:20:45 /data/phpBB/vendor/symfony/dependency-injection/Compiler/AbstractRecursivePass.php:69
20-Jun-2018 22:20:45 /data/phpBB/vendor/symfony/dependency-injection/Compiler/CheckExceptionOnInvalidReferenceBehaviorPass.php:29
20-Jun-2018 22:20:45 /data/phpBB/vendor/symfony/dependency-injection/Compiler/AbstractRecursivePass.php:60
20-Jun-2018 22:20:45 /data/phpBB/vendor/symfony/dependency-injection/Compiler/CheckExceptionOnInvalidReferenceBehaviorPass.php:29
20-Jun-2018 22:20:45 /data/phpBB/vendor/symfony/dependency-injection/Compiler/AbstractRecursivePass.php:39
20-Jun-2018 22:20:45 /data/phpBB/vendor/symfony/dependency-injection/Compiler/Compiler.php:141
20-Jun-2018 22:20:45 /data/phpBB/vendor/symfony/dependency-injection/ContainerBuilder.php:753
20-Jun-2018 22:20:45 /data/tests/notification/submit_post_base.php:144
20-Jun-2018 22:20:45 /data/tests/notification/submit_post_type_bookmark_test.php:22
20-Jun-2018 22:20:45
20-Jun-2018 22:20:45 7) phpbb_notification_submit_post_type_bookmark_test::test_submit_post with data set #1 (array(false), array(array(5, 1, 1)), array(array(5, 1, 1)))
20-Jun-2018 22:20:45 Symfony\Component\DependencyInjection\Exception\ServiceNotFoundException: The service "notification.type.mention" has a dependency on a non-existent service "text_formatter.s9e.mention_helper".
20-Jun-2018 22:20:45
20-Jun-2018 22:20:45 /data/phpBB/vendor/symfony/dependency-injection/Compiler/CheckExceptionOnInvalidReferenceBehaviorPass.php:32
20-Jun-2018 22:20:45 /data/phpBB/vendor/symfony/dependency-injection/Compiler/AbstractRecursivePass.php:60
20-Jun-2018 22:20:45 /data/phpBB/vendor/symfony/dependency-injection/Compiler/CheckExceptionOnInvalidReferenceBehaviorPass.php:29
20-Jun-2018 22:20:45 /data/phpBB/vendor/symfony/dependency-injection/Compiler/AbstractRecursivePass.php:60
20-Jun-2018 22:20:45 /data/phpBB/vendor/symfony/dependency-injection/Compiler/CheckExceptionOnInvalidReferenceBehaviorPass.php:29
20-Jun-2018 22:20:45 /data/phpBB/vendor/symfony/dependency-injection/Compiler/AbstractRecursivePass.php:60
20-Jun-2018 22:20:45 /data/phpBB/vendor/symfony/dependency-injection/Compiler/CheckExceptionOnInvalidReferenceBehaviorPass.php:29
20-Jun-2018 22:20:45 /data/phpBB/vendor/symfony/dependency-injection/Compiler/AbstractRecursivePass.php:69
20-Jun-2018 22:20:45 /data/phpBB/vendor/symfony/dependency-injection/Compiler/CheckExceptionOnInvalidReferenceBehaviorPass.php:29
20-Jun-2018 22:20:45 /data/phpBB/vendor/symfony/dependency-injection/Compiler/AbstractRecursivePass.php:60
20-Jun-2018 22:20:45 /data/phpBB/vendor/symfony/dependency-injection/Compiler/CheckExceptionOnInvalidReferenceBehaviorPass.php:29
20-Jun-2018 22:20:45 /data/phpBB/vendor/symfony/dependency-injection/Compiler/AbstractRecursivePass.php:39
20-Jun-2018 22:20:45 /data/phpBB/vendor/symfony/dependency-injection/Compiler/Compiler.php:141
20-Jun-2018 22:20:45 /data/phpBB/vendor/symfony/dependency-injection/ContainerBuilder.php:753
20-Jun-2018 22:20:45 /data/tests/notification/submit_post_base.php:144
20-Jun-2018 22:20:45 /data/tests/notification/submit_post_type_bookmark_test.php:22
20-Jun-2018 22:20:45
20-Jun-2018 22:20:45 8) phpbb_notification_submit_post_type_post_in_queue_test::test_submit_post with data set #0 (array(), array(array(6, 1, 1)), array(array(6, 1, 1)))
20-Jun-2018 22:20:45 Symfony\Component\DependencyInjection\Exception\ServiceNotFoundException: The service "notification.type.mention" has a dependency on a non-existent service "text_formatter.s9e.mention_helper".
20-Jun-2018 22:20:45
20-Jun-2018 22:20:45 /data/phpBB/vendor/symfony/dependency-injection/Compiler/CheckExceptionOnInvalidReferenceBehaviorPass.php:32
20-Jun-2018 22:20:45 /data/phpBB/vendor/symfony/dependency-injection/Compiler/AbstractRecursivePass.php:60
20-Jun-2018 22:20:45 /data/phpBB/vendor/symfony/dependency-injection/Compiler/CheckExceptionOnInvalidReferenceBehaviorPass.php:29
20-Jun-2018 22:20:45 /data/phpBB/vendor/symfony/dependency-injection/Compiler/AbstractRecursivePass.php:60
20-Jun-2018 22:20:45 /data/phpBB/vendor/symfony/dependency-injection/Compiler/CheckExceptionOnInvalidReferenceBehaviorPass.php:29
20-Jun-2018 22:20:45 /data/phpBB/vendor/symfony/dependency-injection/Compiler/AbstractRecursivePass.php:60
20-Jun-2018 22:20:45 /data/phpBB/vendor/symfony/dependency-injection/Compiler/CheckExceptionOnInvalidReferenceBehaviorPass.php:29
20-Jun-2018 22:20:45 /data/phpBB/vendor/symfony/dependency-injection/Compiler/AbstractRecursivePass.php:69
20-Jun-2018 22:20:45 /data/phpBB/vendor/symfony/dependency-injection/Compiler/CheckExceptionOnInvalidReferenceBehaviorPass.php:29
20-Jun-2018 22:20:45 /data/phpBB/vendor/symfony/dependency-injection/Compiler/AbstractRecursivePass.php:60
20-Jun-2018 22:20:45 /data/phpBB/vendor/symfony/dependency-injection/Compiler/CheckExceptionOnInvalidReferenceBehaviorPass.php:29
20-Jun-2018 22:20:45 /data/phpBB/vendor/symfony/dependency-injection/Compiler/AbstractRecursivePass.php:39
20-Jun-2018 22:20:45 /data/phpBB/vendor/symfony/dependency-injection/Compiler/Compiler.php:141
20-Jun-2018 22:20:45 /data/phpBB/vendor/symfony/dependency-injection/ContainerBuilder.php:753
20-Jun-2018 22:20:45 /data/tests/notification/submit_post_base.php:144
20-Jun-2018 22:20:45 /data/tests/notification/submit_post_type_post_in_queue_test.php:22
20-Jun-2018 22:20:45
20-Jun-2018 22:20:45 9) phpbb_notification_submit_post_type_post_in_queue_test::test_submit_post with data set #1 (array(false), array(array(6, 1, 1)), array(array(3, 2, 1), array(6, 1, 1), array(6, 2, 1), array(8, 2, 1), array(9, 2, 1)))
20-Jun-2018 22:20:45 Symfony\Component\DependencyInjection\Exception\ServiceNotFoundException: The service "notification.type.mention" has a dependency on a non-existent service "text_formatter.s9e.mention_helper".
20-Jun-2018 22:20:45
20-Jun-2018 22:20:45 /data/phpBB/vendor/symfony/dependency-injection/Compiler/CheckExceptionOnInvalidReferenceBehaviorPass.php:32
20-Jun-2018 22:20:45 /data/phpBB/vendor/symfony/dependency-injection/Compiler/AbstractRecursivePass.php:60
20-Jun-2018 22:20:45 /data/phpBB/vendor/symfony/dependency-injection/Compiler/CheckExceptionOnInvalidReferenceBehaviorPass.php:29
20-Jun-2018 22:20:45 /data/phpBB/vendor/symfony/dependency-injection/Compiler/AbstractRecursivePass.php:60
20-Jun-2018 22:20:45 /data/phpBB/vendor/symfony/dependency-injection/Compiler/CheckExceptionOnInvalidReferenceBehaviorPass.php:29
20-Jun-2018 22:20:45 /data/phpBB/vendor/symfony/dependency-injection/Compiler/AbstractRecursivePass.php:60
20-Jun-2018 22:20:45 /data/phpBB/vendor/symfony/dependency-injection/Compiler/CheckExceptionOnInvalidReferenceBehaviorPass.php:29
20-Jun-2018 22:20:45 /data/phpBB/vendor/symfony/dependency-injection/Compiler/AbstractRecursivePass.php:69
20-Jun-2018 22:20:45 /data/phpBB/vendor/symfony/dependency-injection/Compiler/CheckExceptionOnInvalidReferenceBehaviorPass.php:29
20-Jun-2018 22:20:45 /data/phpBB/vendor/symfony/dependency-injection/Compiler/AbstractRecursivePass.php:60
20-Jun-2018 22:20:45 /data/phpBB/vendor/symfony/dependency-injection/Compiler/CheckExceptionOnInvalidReferenceBehaviorPass.php:29
20-Jun-2018 22:20:45 /data/phpBB/vendor/symfony/dependency-injection/Compiler/AbstractRecursivePass.php:39
20-Jun-2018 22:20:45 /data/phpBB/vendor/symfony/dependency-injection/Compiler/Compiler.php:141
20-Jun-2018 22:20:45 /data/phpBB/vendor/symfony/dependency-injection/ContainerBuilder.php:753
20-Jun-2018 22:20:45 /data/tests/notification/submit_post_base.php:144
20-Jun-2018 22:20:45 /data/tests/notification/submit_post_type_post_in_queue_test.php:22
20-Jun-2018 22:20:45
20-Jun-2018 22:20:45 10) phpbb_notification_submit_post_type_post_test::test_submit_post with data set #0 (array(), array(array(5, 1, 1), array(8, 1, 1)), array(array(3, 2, 1), array(5, 1, 1), array(6, 2, 1), array(7, 2, 1), array(8, 1, 1)))
20-Jun-2018 22:20:45 Symfony\Component\DependencyInjection\Exception\ServiceNotFoundException: The service "notification.type.mention" has a dependency on a non-existent service "text_formatter.s9e.mention_helper".
20-Jun-2018 22:20:45
20-Jun-2018 22:20:45 /data/phpBB/vendor/symfony/dependency-injection/Compiler/CheckExceptionOnInvalidReferenceBehaviorPass.php:32
20-Jun-2018 22:20:45 /data/phpBB/vendor/symfony/dependency-injection/Compiler/AbstractRecursivePass.php:60
20-Jun-2018 22:20:45 /data/phpBB/vendor/symfony/dependency-injection/Compiler/CheckExceptionOnInvalidReferenceBehaviorPass.php:29
20-Jun-2018 22:20:45 /data/phpBB/vendor/symfony/dependency-injection/Compiler/AbstractRecursivePass.php:60
20-Jun-2018 22:20:45 /data/phpBB/vendor/symfony/dependency-injection/Compiler/CheckExceptionOnInvalidReferenceBehaviorPass.php:29
20-Jun-2018 22:20:45 /data/phpBB/vendor/symfony/dependency-injection/Compiler/AbstractRecursivePass.php:60
20-Jun-2018 22:20:45 /data/phpBB/vendor/symfony/dependency-injection/Compiler/CheckExceptionOnInvalidReferenceBehaviorPass.php:29
20-Jun-2018 22:20:45 /data/phpBB/vendor/symfony/dependency-injection/Compiler/AbstractRecursivePass.php:69
20-Jun-2018 22:20:45 /data/phpBB/vendor/symfony/dependency-injection/Compiler/CheckExceptionOnInvalidReferenceBehaviorPass.php:29
20-Jun-2018 22:20:45 /data/phpBB/vendor/symfony/dependency-injection/Compiler/AbstractRecursivePass.php:60
20-Jun-2018 22:20:45 /data/phpBB/vendor/symfony/dependency-injection/Compiler/CheckExceptionOnInvalidReferenceBehaviorPass.php:29
20-Jun-2018 22:20:45 /data/phpBB/vendor/symfony/dependency-injection/Compiler/AbstractRecursivePass.php:39
20-Jun-2018 22:20:45 /data/phpBB/vendor/symfony/dependency-injection/Compiler/Compiler.php:141
20-Jun-2018 22:20:45 /data/phpBB/vendor/symfony/dependency-injection/ContainerBuilder.php:753
20-Jun-2018 22:20:45 /data/tests/notification/submit_post_base.php:144
20-Jun-2018 22:20:45 /data/tests/notification/submit_post_type_post_test.php:22
20-Jun-2018 22:20:45
20-Jun-2018 22:20:45 11) phpbb_notification_submit_post_type_post_test::test_submit_post with data set #1 (array(false), array(array(5, 1, 1), array(8, 1, 1)), array(array(5, 1, 1), array(8, 1, 1)))
20-Jun-2018 22:20:45 Symfony\Component\DependencyInjection\Exception\ServiceNotFoundException: The service "notification.type.mention" has a dependency on a non-existent service "text_formatter.s9e.mention_helper".
20-Jun-2018 22:20:45
20-Jun-2018 22:20:45 /data/phpBB/vendor/symfony/dependency-injection/Compiler/CheckExceptionOnInvalidReferenceBehaviorPass.php:32
20-Jun-2018 22:20:45 /data/phpBB/vendor/symfony/dependency-injection/Compiler/AbstractRecursivePass.php:60
20-Jun-2018 22:20:45 /data/phpBB/vendor/symfony/dependency-injection/Compiler/CheckExceptionOnInvalidReferenceBehaviorPass.php:29
20-Jun-2018 22:20:45 /data/phpBB/vendor/symfony/dependency-injection/Compiler/AbstractRecursivePass.php:60
20-Jun-2018 22:20:45 /data/phpBB/vendor/symfony/dependency-injection/Compiler/CheckExceptionOnInvalidReferenceBehaviorPass.php:29
20-Jun-2018 22:20:45 /data/phpBB/vendor/symfony/dependency-injection/Compiler/AbstractRecursivePass.php:60
20-Jun-2018 22:20:45 /data/phpBB/vendor/symfony/dependency-injection/Compiler/CheckExceptionOnInvalidReferenceBehaviorPass.php:29
20-Jun-2018 22:20:45 /data/phpBB/vendor/symfony/dependency-injection/Compiler/AbstractRecursivePass.php:69
20-Jun-2018 22:20:45 /data/phpBB/vendor/symfony/dependency-injection/Compiler/CheckExceptionOnInvalidReferenceBehaviorPass.php:29
20-Jun-2018 22:20:45 /data/phpBB/vendor/symfony/dependency-injection/Compiler/AbstractRecursivePass.php:60
20-Jun-2018 22:20:45 /data/phpBB/vendor/symfony/dependency-injection/Compiler/CheckExceptionOnInvalidReferenceBehaviorPass.php:29
20-Jun-2018 22:20:45 /data/phpBB/vendor/symfony/dependency-injection/Compiler/AbstractRecursivePass.php:39
20-Jun-2018 22:20:45 /data/phpBB/vendor/symfony/dependency-injection/Compiler/Compiler.php:141
20-Jun-2018 22:20:45 /data/phpBB/vendor/symfony/dependency-injection/ContainerBuilder.php:753
20-Jun-2018 22:20:45 /data/tests/notification/submit_post_base.php:144
20-Jun-2018 22:20:45 /data/tests/notification/submit_post_type_post_test.php:22
20-Jun-2018 22:20:45
20-Jun-2018 22:20:45 12) phpbb_notification_submit_post_type_quote_test::test_submit_post with data set #0 (array('<r><QUOTE author="poster"><s>...E></r>', 'uid'), array(array(5, 1, 1)), array(array(3, 2, 1), array(5, 1, 1), array(5, 2, 1), array(7, 2, 1)))
20-Jun-2018 22:20:45 Symfony\Component\DependencyInjection\Exception\ServiceNotFoundException: The service "notification.type.mention" has a dependency on a non-existent service "text_formatter.s9e.mention_helper".
20-Jun-2018 22:20:45
20-Jun-2018 22:20:45 /data/phpBB/vendor/symfony/dependency-injection/Compiler/CheckExceptionOnInvalidReferenceBehaviorPass.php:32
20-Jun-2018 22:20:45 /data/phpBB/vendor/symfony/dependency-injection/Compiler/AbstractRecursivePass.php:60
20-Jun-2018 22:20:45 /data/phpBB/vendor/symfony/dependency-injection/Compiler/CheckExceptionOnInvalidReferenceBehaviorPass.php:29
20-Jun-2018 22:20:45 /data/phpBB/vendor/symfony/dependency-injection/Compiler/AbstractRecursivePass.php:60
20-Jun-2018 22:20:45 /data/phpBB/vendor/symfony/dependency-injection/Compiler/CheckExceptionOnInvalidReferenceBehaviorPass.php:29
20-Jun-2018 22:20:45 /data/phpBB/vendor/symfony/dependency-injection/Compiler/AbstractRecursivePass.php:60
20-Jun-2018 22:20:45 /data/phpBB/vendor/symfony/dependency-injection/Compiler/CheckExceptionOnInvalidReferenceBehaviorPass.php:29
20-Jun-2018 22:20:45 /data/phpBB/vendor/symfony/dependency-injection/Compiler/AbstractRecursivePass.php:69
20-Jun-2018 22:20:45 /data/phpBB/vendor/symfony/dependency-injection/Compiler/CheckExceptionOnInvalidReferenceBehaviorPass.php:29
20-Jun-2018 22:20:45 /data/phpBB/vendor/symfony/dependency-injection/Compiler/AbstractRecursivePass.php:60
20-Jun-2018 22:20:45 /data/phpBB/vendor/symfony/dependency-injection/Compiler/CheckExceptionOnInvalidReferenceBehaviorPass.php:29
20-Jun-2018 22:20:45 /data/phpBB/vendor/symfony/dependency-injection/Compiler/AbstractRecursivePass.php:39
20-Jun-2018 22:20:45 /data/phpBB/vendor/symfony/dependency-injection/Compiler/Compiler.php:141
20-Jun-2018 22:20:45 /data/phpBB/vendor/symfony/dependency-injection/ContainerBuilder.php:753
20-Jun-2018 22:20:45 /data/tests/notification/submit_post_base.php:144
20-Jun-2018 22:20:45 /data/tests/notification/submit_post_type_quote_test.php:22
20-Jun-2018 22:20:45
20-Jun-2018 22:20:45 13) phpbb_notification_submit_post_type_quote_test::test_submit_post with data set #1 (array('<r><QUOTE author="poster"><s>...E></r>', 'uid', false), array(array(5, 1, 1)), array(array(5, 1, 1)))
20-Jun-2018 22:20:45 Symfony\Component\DependencyInjection\Exception\ServiceNotFoundException: The service "notification.type.mention" has a dependency on a non-existent service "text_formatter.s9e.mention_helper".
20-Jun-2018 22:20:45
20-Jun-2018 22:20:45 /data/phpBB/vendor/symfony/dependency-injection/Compiler/CheckExceptionOnInvalidReferenceBehaviorPass.php:32
20-Jun-2018 22:20:45 /data/phpBB/vendor/symfony/dependency-injection/Compiler/AbstractRecursivePass.php:60
20-Jun-2018 22:20:45 /data/phpBB/vendor/symfony/dependency-injection/Compiler/CheckExceptionOnInvalidReferenceBehaviorPass.php:29
20-Jun-2018 22:20:45 /data/phpBB/vendor/symfony/dependency-injection/Compiler/AbstractRecursivePass.php:60
20-Jun-2018 22:20:45 /data/phpBB/vendor/symfony/dependency-injection/Compiler/CheckExceptionOnInvalidReferenceBehaviorPass.php:29
20-Jun-2018 22:20:45 /data/phpBB/vendor/symfony/dependency-injection/Compiler/AbstractRecursivePass.php:60
20-Jun-2018 22:20:45 /data/phpBB/vendor/symfony/dependency-injection/Compiler/CheckExceptionOnInvalidReferenceBehaviorPass.php:29
20-Jun-2018 22:20:45 /data/phpBB/vendor/symfony/dependency-injection/Compiler/AbstractRecursivePass.php:69
20-Jun-2018 22:20:45 /data/phpBB/vendor/symfony/dependency-injection/Compiler/CheckExceptionOnInvalidReferenceBehaviorPass.php:29
20-Jun-2018 22:20:45 /data/phpBB/vendor/symfony/dependency-injection/Compiler/AbstractRecursivePass.php:60
20-Jun-2018 22:20:45 /data/phpBB/vendor/symfony/dependency-injection/Compiler/CheckExceptionOnInvalidReferenceBehaviorPass.php:29
20-Jun-2018 22:20:45 /data/phpBB/vendor/symfony/dependency-injection/Compiler/AbstractRecursivePass.php:39
20-Jun-2018 22:20:45 /data/phpBB/vendor/symfony/dependency-injection/Compiler/Compiler.php:141
20-Jun-2018 22:20:45 /data/phpBB/vendor/symfony/dependency-injection/ContainerBuilder.php:753
20-Jun-2018 22:20:45 /data/tests/notification/submit_post_base.php:144
20-Jun-2018 22:20:45 /data/tests/notification/submit_post_type_quote_test.php:22
20-Jun-2018 22:20:45
20-Jun-2018 22:20:45 14) phpbb_notification_submit_post_type_topic_test::test_submit_post with data set #0 (array(), array(array(8, 1, 1)), array(array(7, 2, 1), array(8, 1, 1), array(8, 2, 1)))
20-Jun-2018 22:20:45 Symfony\Component\DependencyInjection\Exception\ServiceNotFoundException: The service "notification.type.mention" has a dependency on a non-existent service "text_formatter.s9e.mention_helper".
20-Jun-2018 22:20:45
20-Jun-2018 22:20:45 /data/phpBB/vendor/symfony/dependency-injection/Compiler/CheckExceptionOnInvalidReferenceBehaviorPass.php:32
20-Jun-2018 22:20:45 /data/phpBB/vendor/symfony/dependency-injection/Compiler/AbstractRecursivePass.php:60
20-Jun-2018 22:20:45 /data/phpBB/vendor/symfony/dependency-injection/Compiler/CheckExceptionOnInvalidReferenceBehaviorPass.php:29
20-Jun-2018 22:20:45 /data/phpBB/vendor/symfony/dependency-injection/Compiler/AbstractRecursivePass.php:60
20-Jun-2018 22:20:45 /data/phpBB/vendor/symfony/dependency-injection/Compiler/CheckExceptionOnInvalidReferenceBehaviorPass.php:29
20-Jun-2018 22:20:45 /data/phpBB/vendor/symfony/dependency-injection/Compiler/AbstractRecursivePass.php:60
20-Jun-2018 22:20:45 /data/phpBB/vendor/symfony/dependency-injection/Compiler/CheckExceptionOnInvalidReferenceBehaviorPass.php:29
20-Jun-2018 22:20:45 /data/phpBB/vendor/symfony/dependency-injection/Compiler/AbstractRecursivePass.php:69
20-Jun-2018 22:20:45 /data/phpBB/vendor/symfony/dependency-injection/Compiler/CheckExceptionOnInvalidReferenceBehaviorPass.php:29
20-Jun-2018 22:20:45 /data/phpBB/vendor/symfony/dependency-injection/Compiler/AbstractRecursivePass.php:60
20-Jun-2018 22:20:45 /data/phpBB/vendor/symfony/dependency-injection/Compiler/CheckExceptionOnInvalidReferenceBehaviorPass.php:29
20-Jun-2018 22:20:45 /data/phpBB/vendor/symfony/dependency-injection/Compiler/AbstractRecursivePass.php:39
20-Jun-2018 22:20:45 /data/phpBB/vendor/symfony/dependency-injection/Compiler/Compiler.php:141
20-Jun-2018 22:20:45 /data/phpBB/vendor/symfony/dependency-injection/ContainerBuilder.php:753
20-Jun-2018 22:20:45 /data/tests/notification/submit_post_base.php:144
20-Jun-2018 22:20:45 /data/tests/notification/submit_post_type_topic_test.php:22
20-Jun-2018 22:20:45
20-Jun-2018 22:20:45 15) phpbb_notification_submit_post_type_topic_test::test_submit_post with data set #1 (array(false), array(array(8, 1, 1)), array(array(8, 1, 1)))
20-Jun-2018 22:20:45 Symfony\Component\DependencyInjection\Exception\ServiceNotFoundException: The service "notification.type.mention" has a dependency on a non-existent service "text_formatter.s9e.mention_helper".
20-Jun-2018 22:20:45
20-Jun-2018 22:20:45 /data/phpBB/vendor/symfony/dependency-injection/Compiler/CheckExceptionOnInvalidReferenceBehaviorPass.php:32
20-Jun-2018 22:20:45 /data/phpBB/vendor/symfony/dependency-injection/Compiler/AbstractRecursivePass.php:60
20-Jun-2018 22:20:45 /data/phpBB/vendor/symfony/dependency-injection/Compiler/CheckExceptionOnInvalidReferenceBehaviorPass.php:29
20-Jun-2018 22:20:45 /data/phpBB/vendor/symfony/dependency-injection/Compiler/AbstractRecursivePass.php:60
20-Jun-2018 22:20:45 /data/phpBB/vendor/symfony/dependency-injection/Compiler/CheckExceptionOnInvalidReferenceBehaviorPass.php:29
20-Jun-2018 22:20:45 /data/phpBB/vendor/symfony/dependency-injection/Compiler/AbstractRecursivePass.php:60
20-Jun-2018 22:20:45 /data/phpBB/vendor/symfony/dependency-injection/Compiler/CheckExceptionOnInvalidReferenceBehaviorPass.php:29
20-Jun-2018 22:20:45 /data/phpBB/vendor/symfony/dependency-injection/Compiler/AbstractRecursivePass.php:69
20-Jun-2018 22:20:45 /data/phpBB/vendor/symfony/dependency-injection/Compiler/CheckExceptionOnInvalidReferenceBehaviorPass.php:29
20-Jun-2018 22:20:45 /data/phpBB/vendor/symfony/dependency-injection/Compiler/AbstractRecursivePass.php:60
20-Jun-2018 22:20:45 /data/phpBB/vendor/symfony/dependency-injection/Compiler/CheckExceptionOnInvalidReferenceBehaviorPass.php:29
20-Jun-2018 22:20:45 /data/phpBB/vendor/symfony/dependency-injection/Compiler/AbstractRecursivePass.php:39
20-Jun-2018 22:20:45 /data/phpBB/vendor/symfony/dependency-injection/Compiler/Compiler.php:141
20-Jun-2018 22:20:45 /data/phpBB/vendor/symfony/dependency-injection/ContainerBuilder.php:753
20-Jun-2018 22:20:45 /data/tests/notification/submit_post_base.php:144
20-Jun-2018 22:20:45 /data/tests/notification/submit_post_type_topic_test.php:22
20-Jun-2018 22:20:45
20-Jun-2018 22:20:45 --
20-Jun-2018 22:20:45
20-Jun-2018 22:20:45 There was 1 warning:
20-Jun-2018 22:20:45
20-Jun-2018 22:20:45 1) phpbb_console_user_add_test::test_add_dialog
20-Jun-2018 22:20:45 PHPUnit_Framework_TestCase::getMock() is deprecated, use PHPUnit_Framework_TestCase::createMock() or PHPUnit_Framework_TestCase::getMockBuilder() instead
20-Jun-2018 22:20:45
20-Jun-2018 22:20:45 ERRORS!
20-Jun-2018 22:20:45 Tests: 9509, Assertions: 102251, Errors: 15, Warnings: 1, Skipped: 297, Incomplete: 5.
20-Jun-2018 22:20:46 Error occurred while running Task 'Run tests(10)' of type com.atlassian.bamboo.plugins.bamboo-docker-plugin:task.docker.cli.
20-Jun-2018 22:20:46 com.atlassian.bamboo.task.TaskException: Failed to execute task
20-Jun-2018 22:20:46         at com.atlassian.bamboo.plugins.docker.service.RunService.execute(RunService.java:75)
20-Jun-2018 22:20:46         at com.atlassian.bamboo.plugins.docker.tasks.cli.DockerCliTask.execute(DockerCliTask.java:70)
20-Jun-2018 22:20:46         at com.atlassian.bamboo.task.TaskExecutorImpl.lambda$executeTasks$3(TaskExecutorImpl.java:285)
20-Jun-2018 22:20:46         at com.atlassian.bamboo.task.TaskExecutorImpl.executeTaskWithPrePostActions(TaskExecutorImpl.java:224)
20-Jun-2018 22:20:46         at com.atlassian.bamboo.task.TaskExecutorImpl.executeTasks(TaskExecutorImpl.java:285)
20-Jun-2018 22:20:46         at com.atlassian.bamboo.task.TaskExecutorImpl.execute(TaskExecutorImpl.java:112)
20-Jun-2018 22:20:46         at com.atlassian.bamboo.build.pipeline.tasks.ExecuteBuildTask.call(ExecuteBuildTask.java:71)
20-Jun-2018 22:20:46         at com.atlassian.bamboo.v2.build.agent.DefaultBuildAgent.executeBuildPhase(DefaultBuildAgent.java:203)
20-Jun-2018 22:20:46         at com.atlassian.bamboo.v2.build.agent.DefaultBuildAgent.build(DefaultBuildAgent.java:175)
20-Jun-2018 22:20:46         at com.atlassian.bamboo.v2.build.agent.BuildAgentControllerImpl.lambda$waitAndPerformBuild$0(BuildAgentControllerImpl.java:122)
20-Jun-2018 22:20:46         at com.atlassian.bamboo.variable.CustomVariableContextImpl.withVariableSubstitutor(CustomVariableContextImpl.java:185)
20-Jun-2018 22:20:46         at com.atlassian.bamboo.v2.build.agent.BuildAgentControllerImpl.waitAndPerformBuild(BuildAgentControllerImpl.java:117)
20-Jun-2018 22:20:46         at com.atlassian.bamboo.v2.build.agent.DefaultBuildAgent$1.run(DefaultBuildAgent.java:126)
20-Jun-2018 22:20:46         at com.atlassian.bamboo.utils.BambooRunnables$1.run(BambooRunnables.java:48)
20-Jun-2018 22:20:46         at com.atlassian.bamboo.security.ImpersonationHelper.runWith(ImpersonationHelper.java:26)
20-Jun-2018 22:20:46         at com.atlassian.bamboo.security.ImpersonationHelper.runWithSystemAuthority(ImpersonationHelper.java:17)
20-Jun-2018 22:20:46         at com.atlassian.bamboo.security.ImpersonationHelper$1.run(ImpersonationHelper.java:41)
20-Jun-2018 22:20:46         at java.lang.Thread.run(Thread.java:748)
20-Jun-2018 22:20:46 Caused by: com.atlassian.bamboo.docker.DockerException: Error running Docker run command
20-Jun-2018 22:20:46         at com.atlassian.bamboo.docker.DockerContainerServiceImpl.run(DockerContainerServiceImpl.java:118)
20-Jun-2018 22:20:46         at sun.reflect.GeneratedMethodAccessor2553.invoke(Unknown Source)
20-Jun-2018 22:20:46         at sun.reflect.DelegatingMethodAccessorImpl.invoke(DelegatingMethodAccessorImpl.java:43)
20-Jun-2018 22:20:46         at java.lang.reflect.Method.invoke(Method.java:498)
20-Jun-2018 22:20:46         at com.atlassian.plugin.util.ContextClassLoaderSettingInvocationHandler.invoke(ContextClassLoaderSettingInvocationHandler.java:26)
20-Jun-2018 22:20:46         at com.sun.proxy.$Proxy401.run(Unknown Source)
20-Jun-2018 22:20:46         at sun.reflect.GeneratedMethodAccessor2553.invoke(Unknown Source)
20-Jun-2018 22:20:46         at sun.reflect.DelegatingMethodAccessorImpl.invoke(DelegatingMethodAccessorImpl.java:43)
20-Jun-2018 22:20:46         at java.lang.reflect.Method.invoke(Method.java:498)
20-Jun-2018 22:20:46         at org.springframework.aop.support.AopUtils.invokeJoinpointUsingReflection(AopUtils.java:302)
20-Jun-2018 22:20:46         at org.eclipse.gemini.blueprint.service.importer.support.internal.aop.ServiceInvoker.doInvoke(ServiceInvoker.java:56)
20-Jun-2018 22:20:46         at org.eclipse.gemini.blueprint.service.importer.support.internal.aop.ServiceInvoker.invoke(ServiceInvoker.java:60)
20-Jun-2018 22:20:46         at org.springframework.aop.framework.ReflectiveMethodInvocation.proceed(ReflectiveMethodInvocation.java:179)
20-Jun-2018 22:20:46         at org.springframework.aop.support.DelegatingIntroductionInterceptor.doProceed(DelegatingIntroductionInterceptor.java:133)
20-Jun-2018 22:20:46         at org.springframework.aop.support.DelegatingIntroductionInterceptor.invoke(DelegatingIntroductionInterceptor.java:121)
20-Jun-2018 22:20:46         at org.springframework.aop.framework.ReflectiveMethodInvocation.proceed(ReflectiveMethodInvocation.java:179)
20-Jun-2018 22:20:46         at org.eclipse.gemini.blueprint.service.util.internal.aop.ServiceTCCLInterceptor.invokeUnprivileged(ServiceTCCLInterceptor.java:70)
20-Jun-2018 22:20:46         at org.eclipse.gemini.blueprint.service.util.internal.aop.ServiceTCCLInterceptor.invoke(ServiceTCCLInterceptor.java:53)
20-Jun-2018 22:20:46         at org.springframework.aop.framework.ReflectiveMethodInvocation.proceed(ReflectiveMethodInvocation.java:179)
20-Jun-2018 22:20:46         at org.eclipse.gemini.blueprint.service.importer.support.LocalBundleContextAdvice.invoke(LocalBundleContextAdvice.java:57)
20-Jun-2018 22:20:46         at org.springframework.aop.framework.ReflectiveMethodInvocation.proceed(ReflectiveMethodInvocation.java:179)
20-Jun-2018 22:20:46         at org.springframework.aop.support.DelegatingIntroductionInterceptor.doProceed(DelegatingIntroductionInterceptor.java:133)
20-Jun-2018 22:20:46         at org.springframework.aop.support.DelegatingIntroductionInterceptor.invoke(DelegatingIntroductionInterceptor.java:121)
20-Jun-2018 22:20:46         at org.springframework.aop.framework.ReflectiveMethodInvocation.proceed(ReflectiveMethodInvocation.java:179)
20-Jun-2018 22:20:46         at org.springframework.aop.framework.JdkDynamicAopProxy.invoke(JdkDynamicAopProxy.java:207)
20-Jun-2018 22:20:46         at com.sun.proxy.$Proxy679.run(Unknown Source)
20-Jun-2018 22:20:46         at com.atlassian.bamboo.plugins.docker.client.DockerCmd.run(DockerCmd.java:51)
20-Jun-2018 22:20:46         at com.atlassian.bamboo.plugins.docker.service.RunService.execute(RunService.java:64)
20-Jun-2018 22:20:46         ... 17 more
20-Jun-2018 22:20:46 Caused by: com.atlassian.utils.process.ProcessException: Error executing /usr/bin/docker run --volume /home/bamboo/xml-data/build-dir/PHPBB3-PR-JOB1:/data --workdir /data --rm -u=991 -t phpbb:php-5.6 /bin/bash -c "phpBB/vendor/bin/phpunit --log-junit build/logs/phpunit.xml"
20-Jun-2018 22:20:46         at com.atlassian.bamboo.docker.DockerContainerServiceImpl.execute(DockerContainerServiceImpl.java:252)
20-Jun-2018 22:20:46         at com.atlassian.bamboo.docker.DockerContainerServiceImpl.run(DockerContainerServiceImpl.java:106)
20-Jun-2018 22:20:46         ... 44 more
20-Jun-2018 22:20:46 Starting task 'Parsing test results produced by script' of type 'com.atlassian.bamboo.plugins.testresultparser:task.testresultparser.junit'
20-Jun-2018 22:20:46 Parsing test results under /home/bamboo/xml-data/build-dir/PHPBB3-PR-JOB1...
20-Jun-2018 22:20:46 Failing task since 15 failing test cases were found.
20-Jun-2018 22:20:46 Finished task 'Parsing test results produced by script' with result: Failed
20-Jun-2018 22:20:46
Substituting variable: ${bamboo.PRnumber} with 5225
20-Jun-2018 22:20:46
Substituting variable: ${bamboo.buildResultsUrl} with https://bamboo.phpbb.com/browse/PHPBB3-PR-JOB1-8294
20-Jun-2018 22:20:46
Substituting variable: ${bamboo.buildResultsUrl} with https://bamboo.phpbb.com/browse/PHPBB3-PR-JOB1-8294
20-Jun-2018 22:20:46 Starting task 'Set result build status' of type 'com.atlassian.bamboo.plugins.scripttask:task.builder.script'
20-Jun-2018 22:20:46
Beginning to execute external process for build 'phpBB3 - Pull Requests - Build and Test Job #8294 (PHPBB3-PR-JOB1-8294)'
... running command line:
/bin/sh /home/bamboo/temp/PHPBB3-PR-JOB1-8294-ScriptBuildTask-1488430090656059032.sh
... in: /home/bamboo/xml-data/build-dir/PHPBB3-PR-JOB1
... using extra environment variables:
bamboo_planRepository_1_branch=3.1.x
bamboo_planRepository_1_branchDisplayName=3.1.x
bamboo_repository_revision_number=dc8ff9da28b8ab4ad11c7ea94cca526f17c87fe5
bamboo_PRref=master
bamboo_resultsUrl=https://bamboo.phpbb.com/browse/PHPBB3-PR-JOB1-8294
bamboo_capability_system_builder_command_Git=/usr/bin/git
bamboo_repository_75956235_git_username=bantu
bamboo_build_working_directory=/home/bamboo/xml-data/build-dir/PHPBB3-PR-JOB1
bamboo_planRepository_1_name=phpBB Ascraeus
bamboo_buildKey=PHPBB3-PR-JOB1
bamboo_capability_phpbb_tests=true
bamboo_shortPlanName=Pull Requests
bamboo_capability_system_builder_command_fop=/usr/bin/fop
bamboo_capability_dbms_sqlite_2=true
bamboo_planRepository_name=phpBB Ascraeus
bamboo_PRnumber=5225
bamboo_buildNumber=8294
bamboo_repository_75956235_git_repositoryUrl=https://github.com/phpbb/phpbb.git
bamboo_capability_system_builder_phpunit_PHPUnit=/usr/bin/phpunit
bamboo_shortJobName=Build and Test Job
bamboo_buildResultsUrl=https://bamboo.phpbb.com/browse/PHPBB3-PR-JOB1-8294
bamboo_repository_75956235_branch_name=3.1.x
bamboo_planRepository_repositoryUrl=https://github.com/phpbb/phpbb.git
bamboo_agentId=131073
bamboo_planName=phpBB3 - Pull Requests
bamboo_build_commandline_com_atlassian_bamboo_plugins_scripttask_task_builder_script_7=/bin/sh /home/bamboo/temp/PHPBB3-PR-JOB1-8294-ScriptBuildTask-4891976228033225313.sh
bamboo_shortPlanKey=PR
bamboo_shortJobKey=JOB1
bamboo_capability_dbms_mysql_55=true
bamboo_capability_system_jdk_JDK_1_7_0_65=/usr/lib/jvm/java-7-openjdk-amd64
bamboo_planRepository_revision=dc8ff9da28b8ab4ad11c7ea94cca526f17c87fe5
bamboo_buildTimeStamp=2018-06-20T22:13:43.701Z
bamboo_repository_previous_revision_number=dc8ff9da28b8ab4ad11c7ea94cca526f17c87fe5
bamboo_capability_system_jdk_JDK_1_6_0_16=/usr/lib/jvm/java-6-sun-1.6.0.16
bamboo_capability_system_builder_mvn2_Maven_2=/usr/share/maven2
bamboo_planRepository_previousRevision=dc8ff9da28b8ab4ad11c7ea94cca526f17c87fe5
bamboo_build_commandline_com_atlassian_bamboo_plugins_scripttask_task_builder_script_4=/bin/sh /home/bamboo/temp/PHPBB3-PR-JOB1-8294-ScriptBuildTask-7930556980437546452.sh
bamboo_repository_git_branch=3.1.x
bamboo_buildResultKey=PHPBB3-PR-JOB1-8294
bamboo_repository_branch_name=3.1.x
bamboo_buildPlanName=phpBB3 - Pull Requests - Build and Test Job
bamboo_planRepository_1_revision=dc8ff9da28b8ab4ad11c7ea94cca526f17c87fe5
bamboo_repository_name=phpBB Ascraeus
bamboo_buildFailed=true
bamboo_build_commandline_com_atlassian_bamboo_plugins_bamboo_docker_plugin_task_docker_cli_10=/usr/bin/docker run --volume /home/bamboo/xml-data/build-dir/PHPBB3-PR-JOB1:/data --workdir /data --rm -u=991 -t phpbb:php-5.6 /bin/bash -c phpBB/vendor/bin/phpunit --log-junit build/logs/phpunit.xml
bamboo_capability_system_docker_executable=/usr/bin/docker
bamboo_build_commandline_com_atlassian_bamboo_plugins_bamboo_docker_plugin_task_docker_cli_11=/usr/bin/docker run --volume /home/bamboo/xml-data/build-dir/PHPBB3-PR-JOB1:/data --workdir /data/build --rm -u=991 phpbb:php-5.6 ../phpBB/vendor/bin/phing sniff
bamboo_build_commandline_com_atlassian_bamboo_plugins_bamboo_docker_plugin_task_docker_cli_12=/usr/bin/docker run --volume /home/bamboo/xml-data/build-dir/PHPBB3-PR-JOB1:/data --workdir /data/phpBB --rm -e HOME=/home/bamboo -u=991 phpbb:php-5.6 /bin/bash -c php ../composer.phar install --dev; cd ../build; ../phpBB/vendor/bin/phing clean prepare
bamboo_planRepository_branch=3.1.x
bamboo_agentWorkingDirectory=/home/bamboo/xml-data/build-dir
bamboo_jobFailed=true
bamboo_capability_system_git_executable=/usr/bin/git
bamboo_capability_system_builder_phpunit_PHPUnit_3_4=/usr/bin/phpunit
bamboo_repository_git_username=bantu
bamboo_planRepository_1_previousRevision=dc8ff9da28b8ab4ad11c7ea94cca526f17c87fe5
bamboo_repository_75956235_revision_number=dc8ff9da28b8ab4ad11c7ea94cca526f17c87fe5
bamboo_planRepository_branchDisplayName=3.1.x
bamboo_planRepository_1_type=gitv2
bamboo_planRepository_branchName=3.1.x
bamboo_repository_75956235_previous_revision_number=dc8ff9da28b8ab4ad11c7ea94cca526f17c87fe5
bamboo_capability_system_jdk_JDK=/usr/lib/jvm/java-6-sun
bamboo_plan_storageTag=PHPBB3-PR
bamboo_hg_cache_directory=/home/bamboo/xml-data/build-dir/_hg-repositories-cache
bamboo_planRepository_1_username=bantu
bamboo_planRepository_type=gitv2
bamboo_git_cache_directory=/home/bamboo/xml-data/build-dir/_git-repositories-cache
bamboo_ManualBuildTriggerReason_userName=Build Robot
bamboo_repository_git_repositoryUrl=https://github.com/phpbb/phpbb.git
bamboo_repository_75956235_git_branch=3.1.x
bamboo_capability_system_builder_ant_Ant=/usr/share/ant
bamboo_repository_75956235_name=phpBB Ascraeus
bamboo_tmp_directory=/home/bamboo/temp
bamboo_working_directory=/home/bamboo/xml-data/build-dir/PHPBB3-PR-JOB1
bamboo_planKey=PHPBB3-PR
bamboo_capability_local=true
bamboo_planRepository_1_repositoryUrl=https://github.com/phpbb/phpbb.git
bamboo_planRepository_username=bantu
bamboo_capability_system_jdk_JDK_1_6=/usr/lib/jvm/java-6-sun
bamboo_capability_system_jdk_JDK_1_7=/usr/lib/jvm/java-7-openjdk-amd64
bamboo_planRepository_1_branchName=3.1.x
20-Jun-2018 22:20:47 From https://github.com/phpbb/phpbb
20-Jun-2018 22:20:47 * branch            refs/pull/5225/head -> FETCH_HEAD
20-Jun-2018 22:20:47       <testsuite name="phpbb_notification_group_request_test" file="/data/tests/notification/group_request_test.php" tests="1" assertions="0" failures="0" errors="1" time="0.150240">
20-Jun-2018 22:20:47       <testsuite name="phpbb_notification_test" file="/data/tests/notification/notification_test.php" tests="4" assertions="0" failures="0" errors="4" time="0.616259">
20-Jun-2018 22:20:47       <testsuite name="phpbb_notification_submit_post_type_bookmark_test" file="/data/tests/notification/submit_post_type_bookmark_test.php" tests="2" assertions="0" failures="0" errors="2" time="0.638516">
20-Jun-2018 22:20:47         <testsuite name="phpbb_notification_submit_post_type_bookmark_test::test_submit_post" tests="2" assertions="0" failures="0" errors="2" time="0.638516">
20-Jun-2018 22:20:47       <testsuite name="phpbb_notification_submit_post_type_post_in_queue_test" file="/data/tests/notification/submit_post_type_post_in_queue_test.php" tests="2" assertions="0" failures="0" errors="2" time="0.650042">
20-Jun-2018 22:20:47         <testsuite name="phpbb_notification_submit_post_type_post_in_queue_test::test_submit_post" tests="2" assertions="0" failures="0" errors="2" time="0.650042">
20-Jun-2018 22:20:47       <testsuite name="phpbb_notification_submit_post_type_post_test" file="/data/tests/notification/submit_post_type_post_test.php" tests="2" assertions="0" failures="0" errors="2" time="0.793808">
20-Jun-2018 22:20:47         <testsuite name="phpbb_notification_submit_post_type_post_test::test_submit_post" tests="2" assertions="0" failures="0" errors="2" time="0.793808">
20-Jun-2018 22:20:47       <testsuite name="phpbb_notification_submit_post_type_quote_test" file="/data/tests/notification/submit_post_type_quote_test.php" tests="2" assertions="0" failures="0" errors="2" time="0.551259">
20-Jun-2018 22:20:47         <testsuite name="phpbb_notification_submit_post_type_quote_test::test_submit_post" tests="2" assertions="0" failures="0" errors="2" time="0.551259">
20-Jun-2018 22:20:47       <testsuite name="phpbb_notification_submit_post_type_topic_test" file="/data/tests/notification/submit_post_type_topic_test.php" tests="2" assertions="0" failures="0" errors="2" time="0.594578">
20-Jun-2018 22:20:47         <testsuite name="phpbb_notification_submit_post_type_topic_test::test_submit_post" tests="2" assertions="0" failures="0" errors="2" time="0.594578">
20-Jun-2018 22:20:47   % Total    % Received % Xferd  Average Speed   Time    Time     Time  Current
20-Jun-2018 22:20:47                                  Dload  Upload   Total   Spent    Left  Speed
20-Jun-2018 22:20:47
20-Jun-2018 22:20:48   0     0    0     0    0     0      0      0 --:--:-- --:--:-- --:--:--     0
20-Jun-2018 22:20:48 100   267  100    93  100   174    189    354 --:--:-- --:--:-- --:--:--   354
20-Jun-2018 22:20:48 Finished task 'Set result build status' with result: Success
20-Jun-2018 22:20:48 Running post build plugin 'NCover Results Collector'
20-Jun-2018 22:20:48 Running post build plugin 'Artifact Copier'
20-Jun-2018 22:20:48 Running post build plugin 'npm Cache Cleanup'
20-Jun-2018 22:20:48 Running post build plugin 'Clover Results Collector'
20-Jun-2018 22:20:48 Running post build plugin 'Docker Container Cleanup'
20-Jun-2018 22:20:48 Successfully removed working directory at '/home/bamboo/xml-data/build-dir/PHPBB3-PR-JOB1'
20-Jun-2018 22:20:48 Finalising the build...
20-Jun-2018 22:20:48 Stopping timer.
20-Jun-2018 22:20:48 Build PHPBB3-PR-JOB1-8294 completed.
20-Jun-2018 22:20:48 Running on server: post build plugin 'NCover Results Collector'
20-Jun-2018 22:20:48 Running on server: post build plugin 'Build Hanging Detection Configuration'
20-Jun-2018 22:20:48 Running on server: post build plugin 'Clover Delta Calculator'
20-Jun-2018 22:20:48 Running on server: post build plugin 'Maven Dependencies Postprocessor'
20-Jun-2018 22:20:48 All post build plugins have finished
20-Jun-2018 22:20:48 Generating build results summary...
20-Jun-2018 22:20:53 Saving build results to disk...
20-Jun-2018 22:20:53 Logging substituted variables...
20-Jun-2018 22:20:53 Indexing build results...
20-Jun-2018 22:20:53 Finished building PHPBB3-PR-JOB1-8294.
20-Jun-2018 22:20:53
Substituting variable: ${bamboo.PRnumber} with 5225