Tests pending pull requests

Build: #8311 failed

Job: Build and Test Job failed

Stages & jobs

  1. Build and Test

Build log

The build generated 414 lines of output. Download or view full build log

24-Jun-2018 01:42:00 Build phpBB3 - Pull Requests - Build and Test Job #8311 (PHPBB3-PR-JOB1-8311) started building on agent Default Agent
24-Jun-2018 01:42:00
24-Jun-2018 01:42:00 Build working directory is /home/bamboo/xml-data/build-dir/PHPBB3-PR-JOB1
24-Jun-2018 01:42:00 Executing build phpBB3 - Pull Requests - Build and Test Job #8311 (PHPBB3-PR-JOB1-8311)
24-Jun-2018 01:42:00 Starting task 'Checkout develop branch' of type 'com.atlassian.bamboo.plugins.vcs:task.vcs.checkout'
24-Jun-2018 01:42:00 Build always requires a clean checkout
24-Jun-2018 01:42:00 Cleaning build directory '/home/bamboo/xml-data/build-dir/PHPBB3-PR-JOB1'
24-Jun-2018 01:42:00 Checking out into /home/bamboo/xml-data/build-dir/PHPBB3-PR-JOB1
24-Jun-2018 01:42:00 Updating source code to revision: dc8ff9da28b8ab4ad11c7ea94cca526f17c87fe5
24-Jun-2018 01:42:00 Fetching 'refs/heads/3.1.x' from 'https://github.com/phpbb/phpbb.git'.
24-Jun-2018 01:42:01 Checking out revision dc8ff9da28b8ab4ad11c7ea94cca526f17c87fe5.
24-Jun-2018 01:42:01 Creating local git repository in '/home/bamboo/xml-data/build-dir/PHPBB3-PR-JOB1/.git'.
24-Jun-2018 01:42:01 Cloning into '/home/bamboo/xml-data/build-dir/PHPBB3-PR-JOB1'...
24-Jun-2018 01:42:01 done.
24-Jun-2018 01:42:03 Branch 3.1.x set up to track remote branch 3.1.x from origin.
24-Jun-2018 01:42:03 Switched to a new branch '3.1.x'
24-Jun-2018 01:42:03 Updated source code to revision: dc8ff9da28b8ab4ad11c7ea94cca526f17c87fe5
24-Jun-2018 01:42:03 Finished task 'Checkout develop branch' with result: Success
24-Jun-2018 01:42:03 Running pre-build action: VCS Version Collector
24-Jun-2018 01:42:03
Substituting variable: ${bamboo.PRnumber} with 5225
24-Jun-2018 01:42:03
Substituting variable: ${bamboo.buildResultsUrl} with https://bamboo.phpbb.com/browse/PHPBB3-PR-JOB1-8311
24-Jun-2018 01:42:03 Starting task 'Set pending build status' of type 'com.atlassian.bamboo.plugins.scripttask:task.builder.script'
24-Jun-2018 01:42:03
Beginning to execute external process for build 'phpBB3 - Pull Requests - Build and Test Job #8311 (PHPBB3-PR-JOB1-8311)'
... running command line:
/bin/sh /home/bamboo/temp/PHPBB3-PR-JOB1-8311-ScriptBuildTask-9150250084551278438.sh
... in: /home/bamboo/xml-data/build-dir/PHPBB3-PR-JOB1
... using extra environment variables:
bamboo_planRepository_1_branch=3.1.x
bamboo_planRepository_1_branchDisplayName=3.1.x
bamboo_repository_revision_number=dc8ff9da28b8ab4ad11c7ea94cca526f17c87fe5
bamboo_PRref=master
bamboo_resultsUrl=https://bamboo.phpbb.com/browse/PHPBB3-PR-JOB1-8311
bamboo_capability_system_builder_command_Git=/usr/bin/git
bamboo_repository_75956235_git_username=bantu
bamboo_build_working_directory=/home/bamboo/xml-data/build-dir/PHPBB3-PR-JOB1
bamboo_planRepository_1_name=phpBB Ascraeus
bamboo_buildKey=PHPBB3-PR-JOB1
bamboo_capability_phpbb_tests=true
bamboo_shortPlanName=Pull Requests
bamboo_capability_system_builder_command_fop=/usr/bin/fop
bamboo_capability_dbms_sqlite_2=true
bamboo_planRepository_name=phpBB Ascraeus
bamboo_PRnumber=5225
bamboo_buildNumber=8311
bamboo_repository_75956235_git_repositoryUrl=https://github.com/phpbb/phpbb.git
bamboo_capability_system_builder_phpunit_PHPUnit=/usr/bin/phpunit
bamboo_shortJobName=Build and Test Job
bamboo_buildResultsUrl=https://bamboo.phpbb.com/browse/PHPBB3-PR-JOB1-8311
bamboo_repository_75956235_branch_name=3.1.x
bamboo_planRepository_repositoryUrl=https://github.com/phpbb/phpbb.git
bamboo_agentId=131073
bamboo_planName=phpBB3 - Pull Requests
bamboo_shortPlanKey=PR
bamboo_shortJobKey=JOB1
bamboo_capability_dbms_mysql_55=true
bamboo_capability_system_jdk_JDK_1_7_0_65=/usr/lib/jvm/java-7-openjdk-amd64
bamboo_planRepository_revision=dc8ff9da28b8ab4ad11c7ea94cca526f17c87fe5
bamboo_buildTimeStamp=2018-06-24T01:42:00.403Z
bamboo_repository_previous_revision_number=dc8ff9da28b8ab4ad11c7ea94cca526f17c87fe5
bamboo_capability_system_jdk_JDK_1_6_0_16=/usr/lib/jvm/java-6-sun-1.6.0.16
bamboo_capability_system_builder_mvn2_Maven_2=/usr/share/maven2
bamboo_planRepository_previousRevision=dc8ff9da28b8ab4ad11c7ea94cca526f17c87fe5
bamboo_repository_git_branch=3.1.x
bamboo_buildResultKey=PHPBB3-PR-JOB1-8311
bamboo_repository_branch_name=3.1.x
bamboo_buildPlanName=phpBB3 - Pull Requests - Build and Test Job
bamboo_planRepository_1_revision=dc8ff9da28b8ab4ad11c7ea94cca526f17c87fe5
bamboo_repository_name=phpBB Ascraeus
bamboo_buildFailed=false
bamboo_capability_system_docker_executable=/usr/bin/docker
bamboo_planRepository_branch=3.1.x
bamboo_agentWorkingDirectory=/home/bamboo/xml-data/build-dir
bamboo_capability_system_git_executable=/usr/bin/git
bamboo_capability_system_builder_phpunit_PHPUnit_3_4=/usr/bin/phpunit
bamboo_repository_git_username=bantu
bamboo_planRepository_1_previousRevision=dc8ff9da28b8ab4ad11c7ea94cca526f17c87fe5
bamboo_repository_75956235_revision_number=dc8ff9da28b8ab4ad11c7ea94cca526f17c87fe5
bamboo_planRepository_branchDisplayName=3.1.x
bamboo_planRepository_1_type=gitv2
bamboo_planRepository_branchName=3.1.x
bamboo_repository_75956235_previous_revision_number=dc8ff9da28b8ab4ad11c7ea94cca526f17c87fe5
bamboo_capability_system_jdk_JDK=/usr/lib/jvm/java-6-sun
bamboo_plan_storageTag=PHPBB3-PR
bamboo_hg_cache_directory=/home/bamboo/xml-data/build-dir/_hg-repositories-cache
bamboo_planRepository_1_username=bantu
bamboo_planRepository_type=gitv2
bamboo_git_cache_directory=/home/bamboo/xml-data/build-dir/_git-repositories-cache
bamboo_ManualBuildTriggerReason_userName=Build Robot
bamboo_repository_git_repositoryUrl=https://github.com/phpbb/phpbb.git
bamboo_repository_75956235_git_branch=3.1.x
bamboo_capability_system_builder_ant_Ant=/usr/share/ant
bamboo_repository_75956235_name=phpBB Ascraeus
bamboo_tmp_directory=/home/bamboo/temp
bamboo_working_directory=/home/bamboo/xml-data/build-dir/PHPBB3-PR-JOB1
bamboo_planKey=PHPBB3-PR
bamboo_capability_local=true
bamboo_planRepository_1_repositoryUrl=https://github.com/phpbb/phpbb.git
bamboo_planRepository_username=bantu
bamboo_capability_system_jdk_JDK_1_6=/usr/lib/jvm/java-6-sun
bamboo_capability_system_jdk_JDK_1_7=/usr/lib/jvm/java-7-openjdk-amd64
bamboo_planRepository_1_branchName=3.1.x
24-Jun-2018 01:42:06 From https://github.com/phpbb/phpbb
24-Jun-2018 01:42:06 * branch            refs/pull/5225/head -> FETCH_HEAD
24-Jun-2018 01:42:06   % Total    % Received % Xferd  Average Speed   Time    Time     Time  Current
24-Jun-2018 01:42:06                                  Dload  Upload   Total   Spent    Left  Speed
24-Jun-2018 01:42:06
24-Jun-2018 01:42:06   0     0    0     0    0     0      0      0 --:--:-- --:--:-- --:--:--     0
24-Jun-2018 01:42:06 100   275  100    93  100   182    317    621 --:--:-- --:--:-- --:--:--   623
24-Jun-2018 01:42:06 Finished task 'Set pending build status' with result: Success
24-Jun-2018 01:42:06
Substituting variable: ${bamboo.PRnumber} with 5225
24-Jun-2018 01:42:06 Starting task 'Fetch PR' of type 'com.atlassian.bamboo.plugins.scripttask:task.builder.script'
24-Jun-2018 01:42:06
Beginning to execute external process for build 'phpBB3 - Pull Requests - Build and Test Job #8311 (PHPBB3-PR-JOB1-8311)'
... running command line:
/bin/sh /home/bamboo/temp/PHPBB3-PR-JOB1-8311-ScriptBuildTask-6526300531534926819.sh
... in: /home/bamboo/xml-data/build-dir/PHPBB3-PR-JOB1
... using extra environment variables:
bamboo_planRepository_1_branch=3.1.x
bamboo_planRepository_1_branchDisplayName=3.1.x
bamboo_repository_revision_number=dc8ff9da28b8ab4ad11c7ea94cca526f17c87fe5
bamboo_PRref=master
bamboo_resultsUrl=https://bamboo.phpbb.com/browse/PHPBB3-PR-JOB1-8311
bamboo_capability_system_builder_command_Git=/usr/bin/git
bamboo_repository_75956235_git_username=bantu
bamboo_build_working_directory=/home/bamboo/xml-data/build-dir/PHPBB3-PR-JOB1
bamboo_planRepository_1_name=phpBB Ascraeus
bamboo_buildKey=PHPBB3-PR-JOB1
bamboo_capability_phpbb_tests=true
bamboo_shortPlanName=Pull Requests
bamboo_capability_system_builder_command_fop=/usr/bin/fop
bamboo_capability_dbms_sqlite_2=true
bamboo_planRepository_name=phpBB Ascraeus
bamboo_PRnumber=5225
bamboo_buildNumber=8311
bamboo_repository_75956235_git_repositoryUrl=https://github.com/phpbb/phpbb.git
bamboo_capability_system_builder_phpunit_PHPUnit=/usr/bin/phpunit
bamboo_shortJobName=Build and Test Job
bamboo_buildResultsUrl=https://bamboo.phpbb.com/browse/PHPBB3-PR-JOB1-8311
bamboo_repository_75956235_branch_name=3.1.x
bamboo_planRepository_repositoryUrl=https://github.com/phpbb/phpbb.git
bamboo_agentId=131073
bamboo_planName=phpBB3 - Pull Requests
bamboo_build_commandline_com_atlassian_bamboo_plugins_scripttask_task_builder_script_7=/bin/sh /home/bamboo/temp/PHPBB3-PR-JOB1-8311-ScriptBuildTask-9150250084551278438.sh
bamboo_shortPlanKey=PR
bamboo_shortJobKey=JOB1
bamboo_capability_dbms_mysql_55=true
bamboo_capability_system_jdk_JDK_1_7_0_65=/usr/lib/jvm/java-7-openjdk-amd64
bamboo_planRepository_revision=dc8ff9da28b8ab4ad11c7ea94cca526f17c87fe5
bamboo_buildTimeStamp=2018-06-24T01:42:00.403Z
bamboo_repository_previous_revision_number=dc8ff9da28b8ab4ad11c7ea94cca526f17c87fe5
bamboo_capability_system_jdk_JDK_1_6_0_16=/usr/lib/jvm/java-6-sun-1.6.0.16
bamboo_capability_system_builder_mvn2_Maven_2=/usr/share/maven2
bamboo_planRepository_previousRevision=dc8ff9da28b8ab4ad11c7ea94cca526f17c87fe5
bamboo_repository_git_branch=3.1.x
bamboo_buildResultKey=PHPBB3-PR-JOB1-8311
bamboo_repository_branch_name=3.1.x
bamboo_buildPlanName=phpBB3 - Pull Requests - Build and Test Job
bamboo_planRepository_1_revision=dc8ff9da28b8ab4ad11c7ea94cca526f17c87fe5
bamboo_repository_name=phpBB Ascraeus
bamboo_buildFailed=false
bamboo_capability_system_docker_executable=/usr/bin/docker
bamboo_planRepository_branch=3.1.x
bamboo_agentWorkingDirectory=/home/bamboo/xml-data/build-dir
bamboo_capability_system_git_executable=/usr/bin/git
bamboo_capability_system_builder_phpunit_PHPUnit_3_4=/usr/bin/phpunit
bamboo_repository_git_username=bantu
bamboo_planRepository_1_previousRevision=dc8ff9da28b8ab4ad11c7ea94cca526f17c87fe5
bamboo_repository_75956235_revision_number=dc8ff9da28b8ab4ad11c7ea94cca526f17c87fe5
bamboo_planRepository_branchDisplayName=3.1.x
bamboo_planRepository_1_type=gitv2
bamboo_planRepository_branchName=3.1.x
bamboo_repository_75956235_previous_revision_number=dc8ff9da28b8ab4ad11c7ea94cca526f17c87fe5
bamboo_capability_system_jdk_JDK=/usr/lib/jvm/java-6-sun
bamboo_plan_storageTag=PHPBB3-PR
bamboo_hg_cache_directory=/home/bamboo/xml-data/build-dir/_hg-repositories-cache
bamboo_planRepository_1_username=bantu
bamboo_planRepository_type=gitv2
bamboo_git_cache_directory=/home/bamboo/xml-data/build-dir/_git-repositories-cache
bamboo_ManualBuildTriggerReason_userName=Build Robot
bamboo_repository_git_repositoryUrl=https://github.com/phpbb/phpbb.git
bamboo_repository_75956235_git_branch=3.1.x
bamboo_capability_system_builder_ant_Ant=/usr/share/ant
bamboo_repository_75956235_name=phpBB Ascraeus
bamboo_tmp_directory=/home/bamboo/temp
bamboo_working_directory=/home/bamboo/xml-data/build-dir/PHPBB3-PR-JOB1
bamboo_planKey=PHPBB3-PR
bamboo_capability_local=true
bamboo_planRepository_1_repositoryUrl=https://github.com/phpbb/phpbb.git
bamboo_planRepository_username=bantu
bamboo_capability_system_jdk_JDK_1_6=/usr/lib/jvm/java-6-sun
bamboo_capability_system_jdk_JDK_1_7=/usr/lib/jvm/java-7-openjdk-amd64
bamboo_planRepository_1_branchName=3.1.x
24-Jun-2018 01:42:09 From https://github.com/phpbb/phpbb
24-Jun-2018 01:42:09 * branch            refs/pull/5225/merge -> FETCH_HEAD
24-Jun-2018 01:42:09 Note: checking out 'FETCH_HEAD'.
24-Jun-2018 01:42:09
24-Jun-2018 01:42:09 You are in 'detached HEAD' state. You can look around, make experimental
24-Jun-2018 01:42:09 changes and commit them, and you can discard any commits you make in this
24-Jun-2018 01:42:09 state without impacting any branches by performing another checkout.
24-Jun-2018 01:42:09
24-Jun-2018 01:42:09 If you want to create a new branch to retain commits you create, you may
24-Jun-2018 01:42:09 do so (now or later) by using -b with the checkout command again. Example:
24-Jun-2018 01:42:09
24-Jun-2018 01:42:09   git checkout -b new_branch_name
24-Jun-2018 01:42:09
24-Jun-2018 01:42:09 HEAD is now at 5e90028... Merge 2e2f81f047d8a1d184c3433b98af9dacaa545a65 into 68c6670c8b92cb43e53f9d504a900a441802e8fa
24-Jun-2018 01:42:09 Finished task 'Fetch PR' with result: Success
24-Jun-2018 01:42:09 Skipping execution of task 'Prepare directory' as it is disabled
24-Jun-2018 01:42:09
Substituting variable: ${bamboo.working.directory} with /home/bamboo/xml-data/build-dir/PHPBB3-PR-JOB1
24-Jun-2018 01:42:09 Starting task 'Prepare directory' of type 'com.atlassian.bamboo.plugins.bamboo-docker-plugin:task.docker.cli'
24-Jun-2018 01:42:09 Running image name (phpbb:php-5.6)
24-Jun-2018 01:42:09
Beginning to execute external process for build 'phpBB3 - Pull Requests - Build and Test Job #8311 (PHPBB3-PR-JOB1-8311)'
... running command line:
/usr/bin/docker run --volume /home/bamboo/xml-data/build-dir/PHPBB3-PR-JOB1:/data --workdir /data/phpBB --rm -e HOME=/home/bamboo -u=991 phpbb:php-5.6 /bin/bash -c php ../composer.phar install --dev; cd ../build; ../phpBB/vendor/bin/phing clean prepare
... in: /home/bamboo/xml-data/build-dir/PHPBB3-PR-JOB1
... using extra environment variables:
bamboo_planRepository_1_branch=3.1.x
bamboo_planRepository_1_branchDisplayName=3.1.x
bamboo_repository_revision_number=dc8ff9da28b8ab4ad11c7ea94cca526f17c87fe5
bamboo_PRref=master
bamboo_resultsUrl=https://bamboo.phpbb.com/browse/PHPBB3-PR-JOB1-8311
bamboo_capability_system_builder_command_Git=/usr/bin/git
bamboo_repository_75956235_git_username=bantu
bamboo_build_working_directory=/home/bamboo/xml-data/build-dir/PHPBB3-PR-JOB1
bamboo_planRepository_1_name=phpBB Ascraeus
bamboo_buildKey=PHPBB3-PR-JOB1
bamboo_capability_phpbb_tests=true
bamboo_shortPlanName=Pull Requests
bamboo_capability_system_builder_command_fop=/usr/bin/fop
bamboo_capability_dbms_sqlite_2=true
bamboo_planRepository_name=phpBB Ascraeus
bamboo_PRnumber=5225
bamboo_buildNumber=8311
bamboo_repository_75956235_git_repositoryUrl=https://github.com/phpbb/phpbb.git
bamboo_capability_system_builder_phpunit_PHPUnit=/usr/bin/phpunit
bamboo_shortJobName=Build and Test Job
bamboo_buildResultsUrl=https://bamboo.phpbb.com/browse/PHPBB3-PR-JOB1-8311
bamboo_repository_75956235_branch_name=3.1.x
bamboo_planRepository_repositoryUrl=https://github.com/phpbb/phpbb.git
bamboo_agentId=131073
bamboo_planName=phpBB3 - Pull Requests
bamboo_build_commandline_com_atlassian_bamboo_plugins_scripttask_task_builder_script_7=/bin/sh /home/bamboo/temp/PHPBB3-PR-JOB1-8311-ScriptBuildTask-9150250084551278438.sh
bamboo_shortPlanKey=PR
bamboo_shortJobKey=JOB1
bamboo_capability_dbms_mysql_55=true
bamboo_capability_system_jdk_JDK_1_7_0_65=/usr/lib/jvm/java-7-openjdk-amd64
bamboo_planRepository_revision=dc8ff9da28b8ab4ad11c7ea94cca526f17c87fe5
bamboo_buildTimeStamp=2018-06-24T01:42:00.403Z
bamboo_repository_previous_revision_number=dc8ff9da28b8ab4ad11c7ea94cca526f17c87fe5
bamboo_capability_system_jdk_JDK_1_6_0_16=/usr/lib/jvm/java-6-sun-1.6.0.16
bamboo_capability_system_builder_mvn2_Maven_2=/usr/share/maven2
bamboo_planRepository_previousRevision=dc8ff9da28b8ab4ad11c7ea94cca526f17c87fe5
bamboo_build_commandline_com_atlassian_bamboo_plugins_scripttask_task_builder_script_4=/bin/sh /home/bamboo/temp/PHPBB3-PR-JOB1-8311-ScriptBuildTask-6526300531534926819.sh
bamboo_repository_git_branch=3.1.x
bamboo_buildResultKey=PHPBB3-PR-JOB1-8311
bamboo_repository_branch_name=3.1.x
bamboo_buildPlanName=phpBB3 - Pull Requests - Build and Test Job
bamboo_planRepository_1_revision=dc8ff9da28b8ab4ad11c7ea94cca526f17c87fe5
bamboo_repository_name=phpBB Ascraeus
bamboo_buildFailed=false
bamboo_capability_system_docker_executable=/usr/bin/docker
bamboo_planRepository_branch=3.1.x
bamboo_agentWorkingDirectory=/home/bamboo/xml-data/build-dir
bamboo_capability_system_git_executable=/usr/bin/git
bamboo_capability_system_builder_phpunit_PHPUnit_3_4=/usr/bin/phpunit
bamboo_repository_git_username=bantu
bamboo_planRepository_1_previousRevision=dc8ff9da28b8ab4ad11c7ea94cca526f17c87fe5
bamboo_repository_75956235_revision_number=dc8ff9da28b8ab4ad11c7ea94cca526f17c87fe5
bamboo_planRepository_branchDisplayName=3.1.x
bamboo_planRepository_1_type=gitv2
bamboo_planRepository_branchName=3.1.x
bamboo_repository_75956235_previous_revision_number=dc8ff9da28b8ab4ad11c7ea94cca526f17c87fe5
bamboo_capability_system_jdk_JDK=/usr/lib/jvm/java-6-sun
bamboo_plan_storageTag=PHPBB3-PR
bamboo_hg_cache_directory=/home/bamboo/xml-data/build-dir/_hg-repositories-cache
bamboo_planRepository_1_username=bantu
bamboo_planRepository_type=gitv2
bamboo_git_cache_directory=/home/bamboo/xml-data/build-dir/_git-repositories-cache
bamboo_ManualBuildTriggerReason_userName=Build Robot
bamboo_repository_git_repositoryUrl=https://github.com/phpbb/phpbb.git
bamboo_repository_75956235_git_branch=3.1.x
bamboo_capability_system_builder_ant_Ant=/usr/share/ant
bamboo_repository_75956235_name=phpBB Ascraeus
bamboo_tmp_directory=/home/bamboo/temp
bamboo_working_directory=/home/bamboo/xml-data/build-dir/PHPBB3-PR-JOB1
bamboo_planKey=PHPBB3-PR
bamboo_capability_local=true
bamboo_planRepository_1_repositoryUrl=https://github.com/phpbb/phpbb.git
bamboo_planRepository_username=bantu
bamboo_capability_system_jdk_JDK_1_6=/usr/lib/jvm/java-6-sun
bamboo_capability_system_jdk_JDK_1_7=/usr/lib/jvm/java-7-openjdk-amd64
bamboo_planRepository_1_branchName=3.1.x
24-Jun-2018 01:42:10 Cannot create cache directory /home/bamboo/.composer/cache/repo/https---packagist.org/, or directory is not writable. Proceeding without cache
24-Jun-2018 01:42:10 Cannot create cache directory /home/bamboo/.composer/cache/files/, or directory is not writable. Proceeding without cache
24-Jun-2018 01:42:10 You are using the deprecated option "dev". Dev packages are installed by default now.
24-Jun-2018 01:42:10 Loading composer repositories with package information
24-Jun-2018 01:42:10 Installing dependencies (including require-dev) from lock file
24-Jun-2018 01:42:10 Package operations: 75 installs, 0 updates, 0 removals
24-Jun-2018 01:42:11   - Installing composer/installers (v1.5.0): Downloading (connecting...)Downloading (0%)           Downloading (5%)Downloading (20%)Downloading (40%)Downloading (45%)Downloading (50%)Downloading (65%)Downloading (70%)Downloading (75%)Downloading (90%)Downloading (95%)Downloading (100%)
24-Jun-2018 01:42:11   - Installing bantu/ini-get-wrapper (v1.0.1): Downloading (connecting...)Downloading (100%)         
24-Jun-2018 01:42:12   - Installing symfony/process (v3.4.3): Downloading (connecting...)Downloading (0%)           Downloading (5%)Downloading (20%)Downloading (45%)Downloading (50%)Downloading (70%)Downloading (85%)Downloading (90%)Downloading (95%)Downloading (100%)
24-Jun-2018 01:42:13   - Installing symfony/finder (v3.4.3): Downloading (connecting...)Downloading (0%)           Downloading (5%)Downloading (10%)Downloading (25%)Downloading (30%)Downloading (60%)Downloading (65%)Downloading (70%)Downloading (75%)Downloading (100%)
24-Jun-2018 01:42:14   - Installing symfony/filesystem (v3.4.3): Downloading (connecting...)Downloading (100%)         
24-Jun-2018 01:42:14   - Installing symfony/polyfill-mbstring (v1.7.0): Downloading (connecting...)Downloading (0%)           Downloading (20%)Downloading (40%)Downloading (100%)
24-Jun-2018 01:42:15   - Installing psr/log (1.0.2): Downloading (connecting...)Downloading (0%)           Downloading (15%)Downloading (100%)
24-Jun-2018 01:42:16   - Installing symfony/debug (v3.4.3): Downloading (connecting...)Downloading (100%)         
24-Jun-2018 01:42:17   - Installing symfony/console (v3.4.3): Downloading (connecting...)Downloading (0%)           Downloading (5%)Downloading (10%)Downloading (15%)Downloading (20%)Downloading (25%)Downloading (30%)Downloading (35%)Downloading (40%)Downloading (45%)Downloading (50%)Downloading (55%)Downloading (60%)Downloading (65%)Downloading (70%)Downloading (75%)Downloading (80%)Downloading (85%)Downloading (90%)Downloading (95%)Downloading (100%)
24-Jun-2018 01:42:18   - Installing seld/phar-utils (1.0.1): Downloading (connecting...)Downloading (0%)           Downloading (30%)Downloading (60%)Downloading (90%)Downloading (100%)
24-Jun-2018 01:42:18   - Installing seld/jsonlint (1.7.0): Downloading (connecting...)Downloading (100%)         
24-Jun-2018 01:42:19   - Installing seld/cli-prompt (1.0.3): Downloading (connecting...)Downloading (100%)         
24-Jun-2018 01:42:20   - Installing justinrainbow/json-schema (5.2.6): Downloading (connecting...)Downloading (100%)         
24-Jun-2018 01:42:21   - Installing composer/spdx-licenses (1.2.0): Downloading (connecting...)Downloading (100%)         
24-Jun-2018 01:42:21   - Installing composer/semver (1.4.2): Downloading (connecting...)Downloading (0%)           Downloading (35%)Downloading (75%)Downloading (100%)
24-Jun-2018 01:42:23   - Installing composer/ca-bundle (1.1.0): Downloading (connecting...)Downloading (0%)           Downloading (5%)Downloading (10%)Downloading (15%)Downloading (20%)Downloading (25%)Downloading (30%)Downloading (35%)Downloading (40%)Downloading (45%)Downloading (50%)Downloading (55%)Downloading (60%)Downloading (65%)Downloading (70%)Downloading (75%)Downloading (80%)Downloading (85%)Downloading (90%)Downloading (95%)Downloading (100%)
24-Jun-2018 01:42:26   - Installing composer/composer (1.6.2): Downloading (connecting...)Downloading (100%)         
24-Jun-2018 01:42:26   - Installing google/recaptcha (1.1.3): Downloading (connecting...)Downloading (100%)         
24-Jun-2018 01:42:27   - Installing guzzlehttp/promises (v1.3.1): Downloading (connecting...)Downloading (0%)           Downloading (30%)Downloading (40%)Downloading (70%)Downloading (80%)Downloading (100%)
24-Jun-2018 01:42:28   - Installing psr/http-message (1.0.1): Downloading (connecting...)Downloading (0%)           Downloading (95%)Downloading (100%)
24-Jun-2018 01:42:28   - Installing guzzlehttp/psr7 (1.4.2): Downloading (connecting...)Downloading (0%)           Downloading (5%)Downloading (10%)Downloading (15%)Downloading (35%)Downloading (40%)Downloading (45%)Downloading (50%)Downloading (55%)Downloading (60%)Downloading (65%)Downloading (70%)Downloading (100%)
24-Jun-2018 01:42:30   - Installing lusitanian/oauth (v0.8.10): Downloading (connecting...)Downloading (0%)           Downloading (5%)Downloading (10%)Downloading (15%)Downloading (30%)Downloading (35%)Downloading (45%)Downloading (50%)Downloading (55%)Downloading (60%)Downloading (65%)Downloading (70%)Downloading (75%)Downloading (80%)Downloading (85%)Downloading (90%)Downloading (95%)Downloading (100%)
24-Jun-2018 01:42:30   - Installing marc1706/fast-image-size (v1.1.4): Downloading (connecting...)Downloading (100%)         
24-Jun-2018 01:42:31   - Installing patchwork/utf8 (v1.3.1): Downloading (connecting...)Downloading (100%)         
24-Jun-2018 01:42:32   - Installing psr/container (1.0.0): Downloading (connecting...)Downloading (0%)           Downloading (75%)Downloading (100%)
24-Jun-2018 01:42:34   - Installing s9e/text-formatter (0.13.1): Downloading (connecting...)Downloading (100%)         
24-Jun-2018 01:42:35   - Installing symfony/config (v3.4.3): Downloading (connecting...)Downloading (0%)           Downloading (5%)Downloading (10%)Downloading (15%)Downloading (20%)Downloading (25%)Downloading (30%)Downloading (35%)Downloading (40%)Downloading (45%)Downloading (50%)Downloading (55%)Downloading (60%)Downloading (65%)Downloading (70%)Downloading (75%)Downloading (80%)Downloading (85%)Downloading (90%)Downloading (95%)Downloading (100%)
24-Jun-2018 01:42:36   - Installing paragonie/random_compat (v1.4.2): Downloading (connecting...)Downloading (0%)           Downloading (10%)Downloading (35%)Downloading (45%)Downloading (50%)Downloading (60%)Downloading (70%)Downloading (80%)Downloading (100%)
24-Jun-2018 01:42:36   - Installing symfony/polyfill-php70 (v1.6.0): Downloading (connecting...)Downloading (0%)           Downloading (85%)Downloading (100%)
24-Jun-2018 01:42:37   - Installing symfony/http-foundation (v3.4.3): Downloading (connecting...)Downloading (100%)         
24-Jun-2018 01:42:39   - Installing symfony/event-dispatcher (v3.4.3): Downloading (connecting...)Downloading (0%)           Downloading (5%)Downloading (45%)Downloading (50%)Downloading (100%)
24-Jun-2018 01:42:40   - Installing symfony/http-kernel (v3.4.3): Downloading (connecting...)Downloading (100%)         
24-Jun-2018 01:42:41   - Installing symfony/dependency-injection (v3.4.3): Downloading (connecting...)Downloading (100%)         
24-Jun-2018 01:42:42   - Installing zendframework/zend-eventmanager (3.2.0): Downloading (connecting...)Downloading (0%)           Downloading (25%)Downloading (35%)Downloading (50%)Downloading (75%)Downloading (100%)
24-Jun-2018 01:42:43   - Installing zendframework/zend-code (2.6.3): Downloading (connecting...)Downloading (0%)           Downloading (5%)Downloading (10%)Downloading (15%)Downloading (20%)Downloading (25%)Downloading (30%)Downloading (35%)Downloading (40%)Downloading (45%)Downloading (50%)Downloading (55%)Downloading (60%)Downloading (65%)Downloading (70%)Downloading (75%)Downloading (85%)Downloading (90%)Downloading (95%)Downloading (100%)
24-Jun-2018 01:42:44   - Installing ocramius/proxy-manager (1.0.2): Downloading (connecting...)Downloading (100%)         
24-Jun-2018 01:42:45   - Installing symfony/proxy-manager-bridge (v3.4.3): Downloading (connecting...)Downloading (100%)         
24-Jun-2018 01:42:46   - Installing symfony/routing (v3.4.3): Downloading (connecting...)Downloading (100%)         
24-Jun-2018 01:42:47   - Installing twig/twig (v1.35.0): Downloading (connecting...)Downloading (0%)           Downloading (5%)Downloading (10%)Downloading (15%)Downloading (20%)Downloading (25%)Downloading (30%)Downloading (35%)Downloading (40%)Downloading (45%)Downloading (50%)Downloading (55%)Downloading (60%)Downloading (65%)Downloading (70%)Downloading (75%)Downloading (80%)Downloading (85%)Downloading (90%)Downloading (95%)Downloading (100%)
24-Jun-2018 01:42:48   - Installing symfony/twig-bridge (v3.4.3): Downloading (connecting...)Downloading (100%)         
24-Jun-2018 01:42:49   - Installing symfony/dom-crawler (v3.4.3): Downloading (connecting...)Downloading (100%)         
24-Jun-2018 01:42:50   - Installing symfony/css-selector (v3.4.3): Downloading (connecting...)Downloading (0%)           Downloading (5%)Downloading (10%)Downloading (15%)Downloading (20%)Downloading (25%)Downloading (30%)Downloading (55%)Downloading (60%)Downloading (65%)Downloading (70%)Downloading (75%)Downloading (80%)Downloading (85%)Downloading (90%)Downloading (95%)Downloading (100%)
24-Jun-2018 01:42:50   - Installing symfony/browser-kit (v3.4.3): Downloading (connecting...)Downloading (100%)         
24-Jun-2018 01:42:51   - Installing guzzlehttp/guzzle (6.3.0): Downloading (connecting...)Downloading (0%)           Downloading (5%)Downloading (15%)Downloading (25%)Downloading (30%)Downloading (35%)Downloading (45%)Downloading (50%)Downloading (60%)Downloading (65%)Downloading (75%)Downloading (80%)Downloading (90%)Downloading (95%)Downloading (100%)
24-Jun-2018 01:42:52   - Installing fabpot/goutte (v3.2.2): Downloading (connecting...)Downloading (0%)           Downloading (55%)Downloading (100%)
24-Jun-2018 01:42:54   - Installing facebook/webdriver (1.5.0): Downloading (connecting...)Downloading (0%)           Downloading (5%)Downloading (10%)Downloading (15%)Downloading (20%)Downloading (25%)Downloading (30%)Downloading (35%)Downloading (40%)Downloading (45%)Downloading (50%)Downloading (55%)Downloading (60%)Downloading (65%)Downloading (70%)Downloading (75%)Downloading (80%)Downloading (85%)Downloading (90%)Downloading (95%)Downloading (100%)
24-Jun-2018 01:42:54   - Installing symfony/yaml (v3.4.3): Downloading (connecting...)Downloading (0%)           Downloading (5%)Downloading (10%)Downloading (35%)Downloading (40%)Downloading (45%)Downloading (50%)Downloading (55%)Downloading (60%)Downloading (65%)Downloading (70%)Downloading (75%)Downloading (80%)Downloading (85%)Downloading (90%)Downloading (95%)Downloading (100%)
24-Jun-2018 01:42:55   - Installing laravel/homestead (v7.7.0): Downloading (connecting...)Downloading (100%)         
24-Jun-2018 01:43:00   - Installing phing/phing (2.4.14): Downloading (connecting...)Downloading (100%)         
24-Jun-2018 01:43:01   - Installing webmozart/assert (1.2.0): Downloading (connecting...)Downloading (0%)           Downloading (55%)Downloading (80%)Downloading (100%)
24-Jun-2018 01:43:02   - Installing phpdocumentor/reflection-common (1.0.1): Downloading (connecting...)Downloading (0%)           Downloading (100%)
24-Jun-2018 01:43:02   - Installing phpdocumentor/type-resolver (0.4.0): Downloading (connecting...)Downloading (0%)           Downloading (5%)Downloading (35%)Downloading (100%)
24-Jun-2018 01:43:03   - Installing phpdocumentor/reflection-docblock (3.3.2): Downloading (connecting...)Downloading (0%)           Downloading (5%)Downloading (10%)Downloading (15%)Downloading (45%)Downloading (50%)Downloading (55%)Downloading (60%)Downloading (65%)Downloading (70%)Downloading (75%)Downloading (100%)
24-Jun-2018 01:43:04   - Installing sebastian/version (2.0.1): Downloading (connecting...)Downloading (0%)           Downloading (100%)
24-Jun-2018 01:43:04   - Installing sebastian/resource-operations (1.0.0): Downloading (connecting...)Downloading (0%)           Downloading (65%)Downloading (100%)
24-Jun-2018 01:43:05   - Installing sebastian/recursion-context (2.0.0): Downloading (connecting...)Downloading (0%)           Downloading (100%)
24-Jun-2018 01:43:06   - Installing sebastian/object-enumerator (2.0.1): Downloading (connecting...)Downloading (100%)         
24-Jun-2018 01:43:06   - Installing sebastian/global-state (1.1.1): Downloading (connecting...)Downloading (0%)           Downloading (40%)Downloading (70%)Downloading (100%)
24-Jun-2018 01:43:07   - Installing sebastian/exporter (2.0.0): Downloading (connecting...)Downloading (0%)           Downloading (100%)
24-Jun-2018 01:43:07   - Installing sebastian/environment (2.0.0): Downloading (connecting...)Downloading (0%)           Downloading (15%)Downloading (30%)Downloading (45%)Downloading (60%)Downloading (75%)Downloading (90%)Downloading (100%)
24-Jun-2018 01:43:08   - Installing sebastian/diff (1.4.3): Downloading (connecting...)Downloading (0%)           Downloading (35%)Downloading (40%)Downloading (75%)Downloading (100%)
24-Jun-2018 01:43:09   - Installing sebastian/comparator (1.2.4): Downloading (connecting...)Downloading (0%)           Downloading (10%)Downloading (55%)Downloading (65%)Downloading (75%)Downloading (85%)Downloading (100%)
24-Jun-2018 01:43:09   - Installing phpunit/php-text-template (1.2.1): Downloading (connecting...)Downloading (0%)           Downloading (35%)Downloading (100%)
24-Jun-2018 01:43:10   - Installing doctrine/instantiator (1.0.5): Downloading (connecting...)Downloading (0%)           Downloading (15%)Downloading (30%)Downloading (45%)Downloading (50%)Downloading (65%)Downloading (75%)Downloading (90%)Downloading (100%)
24-Jun-2018 01:43:11   - Installing phpunit/phpunit-mock-objects (3.4.4): Downloading (connecting...)Downloading (0%)           Downloading (5%)Downloading (10%)Downloading (15%)Downloading (25%)Downloading (30%)Downloading (35%)Downloading (40%)Downloading (50%)Downloading (55%)Downloading (60%)Downloading (65%)Downloading (70%)Downloading (75%)Downloading (80%)Downloading (85%)Downloading (90%)Downloading (95%)Downloading (100%)
24-Jun-2018 01:43:12   - Installing phpunit/php-timer (1.0.9): Downloading (connecting...)Downloading (0%)           Downloading (45%)Downloading (90%)Downloading (100%)
24-Jun-2018 01:43:12   - Installing phpunit/php-file-iterator (1.4.5): Downloading (connecting...)Downloading (0%)           Downloading (100%)
24-Jun-2018 01:43:13   - Installing sebastian/code-unit-reverse-lookup (1.0.1): Downloading (connecting...)Downloading (0%)           Downloading (55%)Downloading (100%)
24-Jun-2018 01:43:13   - Installing phpunit/php-token-stream (1.4.12): Downloading (connecting...)Downloading (0%)           Downloading (5%)Downloading (10%)Downloading (15%)Downloading (20%)Downloading (100%)
24-Jun-2018 01:43:15   - Installing phpunit/php-code-coverage (4.0.8): Downloading (connecting...)Downloading (0%)           Downloading (5%)Downloading (10%)Downloading (15%)Downloading (20%)Downloading (25%)Downloading (30%)Downloading (35%)Downloading (40%)Downloading (45%)Downloading (50%)Downloading (55%)Downloading (60%)Downloading (65%)Downloading (70%)Downloading (75%)Downloading (80%)Downloading (85%)Downloading (90%)Downloading (95%)Downloading (100%)
24-Jun-2018 01:43:15   - Installing phpspec/prophecy (1.7.5): Downloading (connecting...)Downloading (0%)           Downloading (10%)Downloading (15%)Downloading (20%)Downloading (25%)Downloading (30%)Downloading (40%)Downloading (50%)Downloading (55%)Downloading (60%)Downloading (65%)Downloading (70%)Downloading (75%)Downloading (85%)Downloading (95%)Downloading (100%)
24-Jun-2018 01:43:16   - Installing myclabs/deep-copy (1.7.0): Downloading (connecting...)Downloading (0%)           Downloading (15%)Downloading (20%)Downloading (35%)Downloading (40%)Downloading (45%)Downloading (50%)Downloading (65%)Downloading (70%)Downloading (85%)Downloading (90%)Downloading (100%)
24-Jun-2018 01:43:18   - Installing phpunit/phpunit (5.7.26): Downloading (connecting...)Downloading (0%)           Downloading (5%)Downloading (10%)Downloading (15%)Downloading (20%)Downloading (25%)Downloading (30%)Downloading (35%)Downloading (40%)Downloading (45%)Downloading (50%)Downloading (55%)Downloading (60%)Downloading (65%)Downloading (70%)Downloading (75%)Downloading (80%)Downloading (85%)Downloading (90%)Downloading (95%)Downloading (100%)
24-Jun-2018 01:43:19   - Installing phpunit/dbunit (2.0.3): Downloading (connecting...)Downloading (100%)         
24-Jun-2018 01:43:19   - Installing squizlabs/php_codesniffer (2.9.1): Downloading (connecting...)Downloading (0%)           Downloading (5%)Downloading (10%)Downloading (15%)Downloading (20%)Downloading (25%)Downloading (30%)Downloading (35%)Downloading (40%)Downloading (45%)Downloading (50%)Downloading (55%)Downloading (60%)Downloading (65%)Downloading (70%)Downloading (75%)Downloading (80%)Downloading (85%)Downloading (100%)
24-Jun-2018 01:43:20 symfony/console suggests installing symfony/lock ()
24-Jun-2018 01:43:20 lusitanian/oauth suggests installing predis/predis (Allows using the Redis storage backend.)
24-Jun-2018 01:43:20 patchwork/utf8 suggests installing ext-intl (Use Intl for best performance)
24-Jun-2018 01:43:20 patchwork/utf8 suggests installing ext-wfio (Use WFIO for UTF-8 filesystem access on Windows)
24-Jun-2018 01:43:20 s9e/text-formatter suggests installing ext-intl (Allows international URLs to be accepted by the URL filter)
24-Jun-2018 01:43:20 s9e/text-formatter suggests installing ext-xsl (Enables the XSLT renderer)
24-Jun-2018 01:43:20 paragonie/random_compat suggests installing ext-libsodium (Provides a modern crypto API that can be used to generate random bytes.)
24-Jun-2018 01:43:20 symfony/http-kernel suggests installing symfony/var-dumper ()
24-Jun-2018 01:43:20 symfony/dependency-injection suggests installing symfony/expression-language (For using expressions in service container configuration)
24-Jun-2018 01:43:20 zendframework/zend-eventmanager suggests installing container-interop/container-interop (^1.1.0, to use the lazy listeners feature)
24-Jun-2018 01:43:20 zendframework/zend-eventmanager suggests installing zendframework/zend-stdlib (^2.7.3 || ^3.0, to use the FilterChain feature)
24-Jun-2018 01:43:20 zendframework/zend-code suggests installing doctrine/annotations (Doctrine\Common\Annotations >=1.0 for annotation features)
24-Jun-2018 01:43:20 zendframework/zend-code suggests installing zendframework/zend-stdlib (Zend\Stdlib component)
24-Jun-2018 01:43:20 ocramius/proxy-manager suggests installing ocramius/generated-hydrator (To have very fast object to array to object conversion for ghost objects)
24-Jun-2018 01:43:20 ocramius/proxy-manager suggests installing zendframework/zend-json (To have the JsonRpc adapter (Remote Object feature))
24-Jun-2018 01:43:20 ocramius/proxy-manager suggests installing zendframework/zend-soap (To have the Soap adapter (Remote Object feature))
24-Jun-2018 01:43:20 ocramius/proxy-manager suggests installing zendframework/zend-stdlib (To use the hydrator proxy)
24-Jun-2018 01:43:20 ocramius/proxy-manager suggests installing zendframework/zend-xmlrpc (To have the XmlRpc adapter (Remote Object feature))
24-Jun-2018 01:43:20 symfony/routing suggests installing doctrine/annotations (For using the annotation loader)
24-Jun-2018 01:43:20 symfony/routing suggests installing symfony/expression-language (For using expression matching)
24-Jun-2018 01:43:20 symfony/twig-bridge suggests installing symfony/asset (For using the AssetExtension)
24-Jun-2018 01:43:20 symfony/twig-bridge suggests installing symfony/expression-language (For using the ExpressionExtension)
24-Jun-2018 01:43:20 symfony/twig-bridge suggests installing symfony/form (For using the FormExtension)
24-Jun-2018 01:43:20 symfony/twig-bridge suggests installing symfony/security (For using the SecurityExtension)
24-Jun-2018 01:43:20 symfony/twig-bridge suggests installing symfony/stopwatch (For using the StopwatchExtension)
24-Jun-2018 01:43:20 symfony/twig-bridge suggests installing symfony/templating (For using the TwigEngine)
24-Jun-2018 01:43:20 symfony/twig-bridge suggests installing symfony/translation (For using the TranslationExtension)
24-Jun-2018 01:43:20 symfony/twig-bridge suggests installing symfony/var-dumper (For using the DumpExtension)
24-Jun-2018 01:43:20 symfony/twig-bridge suggests installing symfony/web-link (For using the WebLinkExtension)
24-Jun-2018 01:43:20 sebastian/global-state suggests installing ext-uopz (*)
24-Jun-2018 01:43:20 phpunit/phpunit-mock-objects suggests installing ext-soap (*)
24-Jun-2018 01:43:20 phpunit/phpunit suggests installing phpunit/php-invoker (~1.1)
24-Jun-2018 01:43:20 Generating autoload files
24-Jun-2018 01:43:21 Buildfile: /data/build/build.xml
24-Jun-2018 01:43:21
24-Jun-2018 01:43:21 phpBB > clean:
24-Jun-2018 01:43:21
24-Jun-2018 01:43:21    [delete] Directory /data/build/logs does not exist or is not a directory.
24-Jun-2018 01:43:21    [delete] Directory /data/build/api does not exist or is not a directory.
24-Jun-2018 01:43:21    [delete] Directory /data/build/codebrowser does not exist or is not a directory.
24-Jun-2018 01:43:21    [delete] Directory /data/build/coverage does not exist or is not a directory.
24-Jun-2018 01:43:21    [delete] Directory /data/build/cpd does not exist or is not a directory.
24-Jun-2018 01:43:21    [delete] Directory /data/build/dependencies does not exist or is not a directory.
24-Jun-2018 01:43:21    [delete] Directory /data/build/new_version does not exist or is not a directory.
24-Jun-2018 01:43:21    [delete] Directory /data/build/old_versions does not exist or is not a directory.
24-Jun-2018 01:43:21    [delete] Directory /data/build/save does not exist or is not a directory.
24-Jun-2018 01:43:21
24-Jun-2018 01:43:21 phpBB > prepare:
24-Jun-2018 01:43:21
24-Jun-2018 01:43:21     [mkdir] Created dir: /data/build/logs
24-Jun-2018 01:43:21     [mkdir] Created dir: /data/build/api
24-Jun-2018 01:43:21     [mkdir] Created dir: /data/build/codebrowser
24-Jun-2018 01:43:21     [mkdir] Created dir: /data/build/coverage
24-Jun-2018 01:43:21     [mkdir] Created dir: /data/build/cpd
24-Jun-2018 01:43:21     [mkdir] Created dir: /data/build/dependencies
24-Jun-2018 01:43:21     [mkdir] Created dir: /data/build/new_version
24-Jun-2018 01:43:21     [mkdir] Created dir: /data/build/new_version/files
24-Jun-2018 01:43:21     [mkdir] Created dir: /data/build/new_version/patches
24-Jun-2018 01:43:21     [mkdir] Created dir: /data/build/new_version/release_files
24-Jun-2018 01:43:21     [mkdir] Created dir: /data/build/new_version/update
24-Jun-2018 01:43:21     [mkdir] Created dir: /data/build/old_versions
24-Jun-2018 01:43:21     [mkdir] Created dir: /data/build/save
24-Jun-2018 01:43:21
24-Jun-2018 01:43:21 BUILD FINISHED
24-Jun-2018 01:43:21
24-Jun-2018 01:43:21 Total time: 0.0989 seconds
24-Jun-2018 01:43:21
24-Jun-2018 01:43:21 Finished task 'Prepare directory' with result: Success
24-Jun-2018 01:43:21 Skipping execution of task 'Run sniffs' as it is disabled
24-Jun-2018 01:43:21
Substituting variable: ${bamboo.working.directory} with /home/bamboo/xml-data/build-dir/PHPBB3-PR-JOB1
24-Jun-2018 01:43:21 Starting task 'Run sniffs' of type 'com.atlassian.bamboo.plugins.bamboo-docker-plugin:task.docker.cli'
24-Jun-2018 01:43:21 Running image name (phpbb:php-5.6)
24-Jun-2018 01:43:21
Beginning to execute external process for build 'phpBB3 - Pull Requests - Build and Test Job #8311 (PHPBB3-PR-JOB1-8311)'
... running command line:
/usr/bin/docker run --volume /home/bamboo/xml-data/build-dir/PHPBB3-PR-JOB1:/data --workdir /data/build --rm -u=991 phpbb:php-5.6 ../phpBB/vendor/bin/phing sniff
... in: /home/bamboo/xml-data/build-dir/PHPBB3-PR-JOB1
... using extra environment variables:
bamboo_planRepository_1_branch=3.1.x
bamboo_planRepository_1_branchDisplayName=3.1.x
bamboo_repository_revision_number=dc8ff9da28b8ab4ad11c7ea94cca526f17c87fe5
bamboo_PRref=master
bamboo_resultsUrl=https://bamboo.phpbb.com/browse/PHPBB3-PR-JOB1-8311
bamboo_capability_system_builder_command_Git=/usr/bin/git
bamboo_repository_75956235_git_username=bantu
bamboo_build_working_directory=/home/bamboo/xml-data/build-dir/PHPBB3-PR-JOB1
bamboo_planRepository_1_name=phpBB Ascraeus
bamboo_buildKey=PHPBB3-PR-JOB1
bamboo_capability_phpbb_tests=true
bamboo_shortPlanName=Pull Requests
bamboo_capability_system_builder_command_fop=/usr/bin/fop
bamboo_capability_dbms_sqlite_2=true
bamboo_planRepository_name=phpBB Ascraeus
bamboo_PRnumber=5225
bamboo_buildNumber=8311
bamboo_repository_75956235_git_repositoryUrl=https://github.com/phpbb/phpbb.git
bamboo_capability_system_builder_phpunit_PHPUnit=/usr/bin/phpunit
bamboo_shortJobName=Build and Test Job
bamboo_buildResultsUrl=https://bamboo.phpbb.com/browse/PHPBB3-PR-JOB1-8311
bamboo_repository_75956235_branch_name=3.1.x
bamboo_planRepository_repositoryUrl=https://github.com/phpbb/phpbb.git
bamboo_agentId=131073
bamboo_planName=phpBB3 - Pull Requests
bamboo_build_commandline_com_atlassian_bamboo_plugins_scripttask_task_builder_script_7=/bin/sh /home/bamboo/temp/PHPBB3-PR-JOB1-8311-ScriptBuildTask-9150250084551278438.sh
bamboo_shortPlanKey=PR
bamboo_shortJobKey=JOB1
bamboo_capability_dbms_mysql_55=true
bamboo_capability_system_jdk_JDK_1_7_0_65=/usr/lib/jvm/java-7-openjdk-amd64
bamboo_planRepository_revision=dc8ff9da28b8ab4ad11c7ea94cca526f17c87fe5
bamboo_buildTimeStamp=2018-06-24T01:42:00.403Z
bamboo_repository_previous_revision_number=dc8ff9da28b8ab4ad11c7ea94cca526f17c87fe5
bamboo_capability_system_jdk_JDK_1_6_0_16=/usr/lib/jvm/java-6-sun-1.6.0.16
bamboo_capability_system_builder_mvn2_Maven_2=/usr/share/maven2
bamboo_planRepository_previousRevision=dc8ff9da28b8ab4ad11c7ea94cca526f17c87fe5
bamboo_build_commandline_com_atlassian_bamboo_plugins_scripttask_task_builder_script_4=/bin/sh /home/bamboo/temp/PHPBB3-PR-JOB1-8311-ScriptBuildTask-6526300531534926819.sh
bamboo_repository_git_branch=3.1.x
bamboo_buildResultKey=PHPBB3-PR-JOB1-8311
bamboo_repository_branch_name=3.1.x
bamboo_buildPlanName=phpBB3 - Pull Requests - Build and Test Job
bamboo_planRepository_1_revision=dc8ff9da28b8ab4ad11c7ea94cca526f17c87fe5
bamboo_repository_name=phpBB Ascraeus
bamboo_buildFailed=false
bamboo_capability_system_docker_executable=/usr/bin/docker
bamboo_build_commandline_com_atlassian_bamboo_plugins_bamboo_docker_plugin_task_docker_cli_12=/usr/bin/docker run --volume /home/bamboo/xml-data/build-dir/PHPBB3-PR-JOB1:/data --workdir /data/phpBB --rm -e HOME=/home/bamboo -u=991 phpbb:php-5.6 /bin/bash -c php ../composer.phar install --dev; cd ../build; ../phpBB/vendor/bin/phing clean prepare
bamboo_planRepository_branch=3.1.x
bamboo_agentWorkingDirectory=/home/bamboo/xml-data/build-dir
bamboo_capability_system_git_executable=/usr/bin/git
bamboo_capability_system_builder_phpunit_PHPUnit_3_4=/usr/bin/phpunit
bamboo_repository_git_username=bantu
bamboo_planRepository_1_previousRevision=dc8ff9da28b8ab4ad11c7ea94cca526f17c87fe5
bamboo_repository_75956235_revision_number=dc8ff9da28b8ab4ad11c7ea94cca526f17c87fe5
bamboo_planRepository_branchDisplayName=3.1.x
bamboo_planRepository_1_type=gitv2
bamboo_planRepository_branchName=3.1.x
bamboo_repository_75956235_previous_revision_number=dc8ff9da28b8ab4ad11c7ea94cca526f17c87fe5
bamboo_capability_system_jdk_JDK=/usr/lib/jvm/java-6-sun
bamboo_plan_storageTag=PHPBB3-PR
bamboo_hg_cache_directory=/home/bamboo/xml-data/build-dir/_hg-repositories-cache
bamboo_planRepository_1_username=bantu
bamboo_planRepository_type=gitv2
bamboo_git_cache_directory=/home/bamboo/xml-data/build-dir/_git-repositories-cache
bamboo_ManualBuildTriggerReason_userName=Build Robot
bamboo_repository_git_repositoryUrl=https://github.com/phpbb/phpbb.git
bamboo_repository_75956235_git_branch=3.1.x
bamboo_capability_system_builder_ant_Ant=/usr/share/ant
bamboo_repository_75956235_name=phpBB Ascraeus
bamboo_tmp_directory=/home/bamboo/temp
bamboo_working_directory=/home/bamboo/xml-data/build-dir/PHPBB3-PR-JOB1
bamboo_planKey=PHPBB3-PR
bamboo_capability_local=true
bamboo_planRepository_1_repositoryUrl=https://github.com/phpbb/phpbb.git
bamboo_planRepository_username=bantu
bamboo_capability_system_jdk_JDK_1_6=/usr/lib/jvm/java-6-sun
bamboo_capability_system_jdk_JDK_1_7=/usr/lib/jvm/java-7-openjdk-amd64
bamboo_planRepository_1_branchName=3.1.x
24-Jun-2018 01:43:21 Buildfile: /data/build/build.xml
24-Jun-2018 01:43:22
24-Jun-2018 01:43:22 phpBB > sniff:
24-Jun-2018 01:43:22
24-Jun-2018 01:43:29 ............................................................  60 / 766 (8%)
24-Jun-2018 01:43:30 ............................................................ 120 / 766 (16%)
24-Jun-2018 01:43:30 ............................................................ 180 / 766 (23%)
24-Jun-2018 01:43:31 ............................................................ 240 / 766 (31%)
24-Jun-2018 01:43:34 ............................................................ 300 / 766 (39%)
24-Jun-2018 01:43:39 ............................................................ 360 / 766 (47%)
24-Jun-2018 01:43:44 ............................................................ 420 / 766 (55%)
24-Jun-2018 01:43:48 ............................................................ 480 / 766 (63%)
24-Jun-2018 01:43:51 ............................................................ 540 / 766 (70%)
24-Jun-2018 01:43:54 ............................................................ 600 / 766 (78%)
24-Jun-2018 01:43:59 ............................................................ 660 / 766 (86%)
24-Jun-2018 01:44:02 ............................................................ 720 / 766 (94%)
24-Jun-2018 01:44:03 ..............................................
24-Jun-2018 01:44:03
24-Jun-2018 01:44:03 Time: 41.73 secs; Memory: 64.25Mb
24-Jun-2018 01:44:03
24-Jun-2018 01:44:11 ............................................................  60 / 209 (29%)
24-Jun-2018 01:44:28 ............................................................ 120 / 209 (57%)
24-Jun-2018 01:44:41 ............................................................ 180 / 209 (86%)
24-Jun-2018 01:44:49 .............................
24-Jun-2018 01:44:49
24-Jun-2018 01:44:49 Time: 45.19 secs; Memory: 60.75Mb
24-Jun-2018 01:44:49
24-Jun-2018 01:44:49
24-Jun-2018 01:44:49
24-Jun-2018 01:44:49 Time: 18ms; Memory: 3.75Mb
24-Jun-2018 01:44:49
24-Jun-2018 01:44:49
24-Jun-2018 01:44:49 BUILD FINISHED
24-Jun-2018 01:44:49
24-Jun-2018 01:44:49 Total time: 1 minutes  27.22 seconds
24-Jun-2018 01:44:49
24-Jun-2018 01:44:49 Finished task 'Run sniffs' with result: Success
24-Jun-2018 01:44:49 Skipping execution of task 'Run tests' as it is disabled
24-Jun-2018 01:44:49
Substituting variable: ${bamboo.working.directory} with /home/bamboo/xml-data/build-dir/PHPBB3-PR-JOB1
24-Jun-2018 01:44:49 Starting task 'Run tests' of type 'com.atlassian.bamboo.plugins.bamboo-docker-plugin:task.docker.cli'
24-Jun-2018 01:44:49 Running image name (phpbb:php-5.6)
24-Jun-2018 01:44:49
Beginning to execute external process for build 'phpBB3 - Pull Requests - Build and Test Job #8311 (PHPBB3-PR-JOB1-8311)'
... running command line:
/usr/bin/docker run --volume /home/bamboo/xml-data/build-dir/PHPBB3-PR-JOB1:/data --workdir /data --rm -u=991 -t phpbb:php-5.6 /bin/bash -c phpBB/vendor/bin/phpunit --log-junit build/logs/phpunit.xml
... in: /home/bamboo/xml-data/build-dir/PHPBB3-PR-JOB1
... using extra environment variables:
bamboo_planRepository_1_branch=3.1.x
bamboo_planRepository_1_branchDisplayName=3.1.x
bamboo_repository_revision_number=dc8ff9da28b8ab4ad11c7ea94cca526f17c87fe5
bamboo_PRref=master
bamboo_resultsUrl=https://bamboo.phpbb.com/browse/PHPBB3-PR-JOB1-8311
bamboo_capability_system_builder_command_Git=/usr/bin/git
bamboo_repository_75956235_git_username=bantu
bamboo_build_working_directory=/home/bamboo/xml-data/build-dir/PHPBB3-PR-JOB1
bamboo_planRepository_1_name=phpBB Ascraeus
bamboo_buildKey=PHPBB3-PR-JOB1
bamboo_capability_phpbb_tests=true
bamboo_shortPlanName=Pull Requests
bamboo_capability_system_builder_command_fop=/usr/bin/fop
bamboo_capability_dbms_sqlite_2=true
bamboo_planRepository_name=phpBB Ascraeus
bamboo_PRnumber=5225
bamboo_buildNumber=8311
bamboo_repository_75956235_git_repositoryUrl=https://github.com/phpbb/phpbb.git
bamboo_capability_system_builder_phpunit_PHPUnit=/usr/bin/phpunit
bamboo_shortJobName=Build and Test Job
bamboo_buildResultsUrl=https://bamboo.phpbb.com/browse/PHPBB3-PR-JOB1-8311
bamboo_repository_75956235_branch_name=3.1.x
bamboo_planRepository_repositoryUrl=https://github.com/phpbb/phpbb.git
bamboo_agentId=131073
bamboo_planName=phpBB3 - Pull Requests
bamboo_build_commandline_com_atlassian_bamboo_plugins_scripttask_task_builder_script_7=/bin/sh /home/bamboo/temp/PHPBB3-PR-JOB1-8311-ScriptBuildTask-9150250084551278438.sh
bamboo_shortPlanKey=PR
bamboo_shortJobKey=JOB1
bamboo_capability_dbms_mysql_55=true
bamboo_capability_system_jdk_JDK_1_7_0_65=/usr/lib/jvm/java-7-openjdk-amd64
bamboo_planRepository_revision=dc8ff9da28b8ab4ad11c7ea94cca526f17c87fe5
bamboo_buildTimeStamp=2018-06-24T01:42:00.403Z
bamboo_repository_previous_revision_number=dc8ff9da28b8ab4ad11c7ea94cca526f17c87fe5
bamboo_capability_system_jdk_JDK_1_6_0_16=/usr/lib/jvm/java-6-sun-1.6.0.16
bamboo_capability_system_builder_mvn2_Maven_2=/usr/share/maven2
bamboo_planRepository_previousRevision=dc8ff9da28b8ab4ad11c7ea94cca526f17c87fe5
bamboo_build_commandline_com_atlassian_bamboo_plugins_scripttask_task_builder_script_4=/bin/sh /home/bamboo/temp/PHPBB3-PR-JOB1-8311-ScriptBuildTask-6526300531534926819.sh
bamboo_repository_git_branch=3.1.x
bamboo_buildResultKey=PHPBB3-PR-JOB1-8311
bamboo_repository_branch_name=3.1.x
bamboo_buildPlanName=phpBB3 - Pull Requests - Build and Test Job
bamboo_planRepository_1_revision=dc8ff9da28b8ab4ad11c7ea94cca526f17c87fe5
bamboo_repository_name=phpBB Ascraeus
bamboo_buildFailed=false
bamboo_capability_system_docker_executable=/usr/bin/docker
bamboo_build_commandline_com_atlassian_bamboo_plugins_bamboo_docker_plugin_task_docker_cli_11=/usr/bin/docker run --volume /home/bamboo/xml-data/build-dir/PHPBB3-PR-JOB1:/data --workdir /data/build --rm -u=991 phpbb:php-5.6 ../phpBB/vendor/bin/phing sniff
bamboo_build_commandline_com_atlassian_bamboo_plugins_bamboo_docker_plugin_task_docker_cli_12=/usr/bin/docker run --volume /home/bamboo/xml-data/build-dir/PHPBB3-PR-JOB1:/data --workdir /data/phpBB --rm -e HOME=/home/bamboo -u=991 phpbb:php-5.6 /bin/bash -c php ../composer.phar install --dev; cd ../build; ../phpBB/vendor/bin/phing clean prepare
bamboo_planRepository_branch=3.1.x
bamboo_agentWorkingDirectory=/home/bamboo/xml-data/build-dir
bamboo_capability_system_git_executable=/usr/bin/git
bamboo_capability_system_builder_phpunit_PHPUnit_3_4=/usr/bin/phpunit
bamboo_repository_git_username=bantu
bamboo_planRepository_1_previousRevision=dc8ff9da28b8ab4ad11c7ea94cca526f17c87fe5
bamboo_repository_75956235_revision_number=dc8ff9da28b8ab4ad11c7ea94cca526f17c87fe5
bamboo_planRepository_branchDisplayName=3.1.x
bamboo_planRepository_1_type=gitv2
bamboo_planRepository_branchName=3.1.x
bamboo_repository_75956235_previous_revision_number=dc8ff9da28b8ab4ad11c7ea94cca526f17c87fe5
bamboo_capability_system_jdk_JDK=/usr/lib/jvm/java-6-sun
bamboo_plan_storageTag=PHPBB3-PR
bamboo_hg_cache_directory=/home/bamboo/xml-data/build-dir/_hg-repositories-cache
bamboo_planRepository_1_username=bantu
bamboo_planRepository_type=gitv2
bamboo_git_cache_directory=/home/bamboo/xml-data/build-dir/_git-repositories-cache
bamboo_ManualBuildTriggerReason_userName=Build Robot
bamboo_repository_git_repositoryUrl=https://github.com/phpbb/phpbb.git
bamboo_repository_75956235_git_branch=3.1.x
bamboo_capability_system_builder_ant_Ant=/usr/share/ant
bamboo_repository_75956235_name=phpBB Ascraeus
bamboo_tmp_directory=/home/bamboo/temp
bamboo_working_directory=/home/bamboo/xml-data/build-dir/PHPBB3-PR-JOB1
bamboo_planKey=PHPBB3-PR
bamboo_capability_local=true
bamboo_planRepository_1_repositoryUrl=https://github.com/phpbb/phpbb.git
bamboo_planRepository_username=bantu
bamboo_capability_system_jdk_JDK_1_6=/usr/lib/jvm/java-6-sun
bamboo_capability_system_jdk_JDK_1_7=/usr/lib/jvm/java-7-openjdk-amd64
bamboo_planRepository_1_branchName=3.1.x
24-Jun-2018 01:44:52 PHPUnit 5.7.26 by Sebastian Bergmann and contributors.
24-Jun-2018 01:44:52
24-Jun-2018 01:45:00 .............................................................   61 / 7199 (  0%)
24-Jun-2018 01:45:01 .............................................................  122 / 7199 (  1%)
24-Jun-2018 01:45:02 .............I.....SSSSSSSS............SSSS.........S...S....  183 / 7199 (  2%)
24-Jun-2018 01:45:03 .............................................................  244 / 7199 (  3%)
24-Jun-2018 01:45:11 .....S............W..........................................  305 / 7199 (  4%)
24-Jun-2018 01:45:12 .............................................................  366 / 7199 (  5%)
24-Jun-2018 01:45:12 .............................................................  427 / 7199 (  5%)
24-Jun-2018 01:45:13 .............................................................  488 / 7199 (  6%)
24-Jun-2018 01:45:13 .............................................................  549 / 7199 (  7%)
24-Jun-2018 01:45:14 .............................................................  610 / 7199 (  8%)
24-Jun-2018 01:45:15 .............................................................  671 / 7199 (  9%)
24-Jun-2018 01:45:16 .............................................................  732 / 7199 ( 10%)
24-Jun-2018 01:45:16 .............................................................  793 / 7199 ( 11%)
24-Jun-2018 01:45:17 .............................................................  854 / 7199 ( 11%)
24-Jun-2018 01:45:18 .............................................................  915 / 7199 ( 12%)
24-Jun-2018 01:45:18 .............................................................  976 / 7199 ( 13%)
24-Jun-2018 01:45:19 ............................................................. 1037 / 7199 ( 14%)
24-Jun-2018 01:45:23 ................................................I............ 1098 / 7199 ( 15%)
24-Jun-2018 01:45:28 ............................................................. 1159 / 7199 ( 16%)
24-Jun-2018 01:45:34 ............................................................. 1220 / 7199 ( 16%)
24-Jun-2018 01:45:37 ........................................S.S.S................ 1281 / 7199 ( 17%)
24-Jun-2018 01:45:37 ............................................................. 1342 / 7199 ( 18%)
24-Jun-2018 01:45:37 ............................................................. 1403 / 7199 ( 19%)
24-Jun-2018 01:45:38 ............................................................. 1464 / 7199 ( 20%)
24-Jun-2018 01:45:38 ............................................................. 1525 / 7199 ( 21%)
24-Jun-2018 01:45:38 ............................................................. 1586 / 7199 ( 22%)
24-Jun-2018 01:45:38 ............................................................. 1647 / 7199 ( 22%)
24-Jun-2018 01:45:38 ............................................................. 1708 / 7199 ( 23%)
24-Jun-2018 01:45:38 ............................................................. 1769 / 7199 ( 24%)
24-Jun-2018 01:45:38 ............................................................. 1830 / 7199 ( 25%)
24-Jun-2018 01:45:38 ............................................................. 1891 / 7199 ( 26%)
24-Jun-2018 01:45:38 ............................................................. 1952 / 7199 ( 27%)
24-Jun-2018 01:45:39 ............................................................. 2013 / 7199 ( 27%)
24-Jun-2018 01:45:39 ............................................................. 2074 / 7199 ( 28%)
24-Jun-2018 01:45:39 ............................................................. 2135 / 7199 ( 29%)
24-Jun-2018 01:45:40 ............................................................. 2196 / 7199 ( 30%)
24-Jun-2018 01:45:41 ............................................................. 2257 / 7199 ( 31%)
24-Jun-2018 01:45:41 ............................................................. 2318 / 7199 ( 32%)
24-Jun-2018 01:45:41 ............................................................. 2379 / 7199 ( 33%)
24-Jun-2018 01:45:43 ............................I.II............................. 2440 / 7199 ( 33%)
24-Jun-2018 01:45:45 ............................................................. 2501 / 7199 ( 34%)
24-Jun-2018 01:45:45 ............................................................. 2562 / 7199 ( 35%)
24-Jun-2018 01:45:45 ............................................................. 2623 / 7199 ( 36%)
24-Jun-2018 01:45:46 ............................................................. 2684 / 7199 ( 37%)
24-Jun-2018 01:45:49 ............................................................. 2745 / 7199 ( 38%)
24-Jun-2018 01:45:50 ............................................................. 2806 / 7199 ( 38%)
24-Jun-2018 01:45:50 ..................................................SSSSSSSSS.. 2867 / 7199 ( 39%)
24-Jun-2018 01:45:50 ............................................................. 2928 / 7199 ( 40%)
24-Jun-2018 01:46:00 ............................................................. 2989 / 7199 ( 41%)
24-Jun-2018 01:46:07 ............................................................. 3050 / 7199 ( 42%)
24-Jun-2018 01:46:11 ..........................S.................................. 3111 / 7199 ( 43%)
24-Jun-2018 01:46:12 ............................................................. 3172 / 7199 ( 44%)
24-Jun-2018 01:46:12 ...................
24-Jun-2018 01:46:12 Fatal error: Cannot use s9e\TextFormatter\Utils as Utils because the name is already in use in /data/phpBB/phpbb/textformatter/s9e/mention_helper.php on line 16
24-Jun-2018 01:46:12
24-Jun-2018 01:46:12 Call Stack:
24-Jun-2018 01:46:12     0.0002     230792   1. {main}() /data/phpBB/vendor/phpunit/phpunit/phpunit:0
24-Jun-2018 01:46:12     0.0091    1302776   2. PHPUnit_TextUI_Command::main() /data/phpBB/vendor/phpunit/phpunit/phpunit:52
24-Jun-2018 01:46:12     0.0091    1303512   3. PHPUnit_TextUI_Command->run() /data/phpBB/vendor/phpunit/phpunit/src/TextUI/Command.php:116
24-Jun-2018 01:46:12     2.6547  201991368   4. PHPUnit_TextUI_TestRunner->doRun() /data/phpBB/vendor/phpunit/phpunit/src/TextUI/Command.php:186
24-Jun-2018 01:46:12     2.8692  202384320   5. PHPUnit_Framework_TestSuite->run() /data/phpBB/vendor/phpunit/phpunit/src/TextUI/TestRunner.php:517
24-Jun-2018 01:46:12     3.3311  202428304   6. PHPUnit_Framework_TestSuite->run() /data/phpBB/vendor/phpunit/phpunit/src/Framework/TestSuite.php:733
24-Jun-2018 01:46:12    82.6425  451471976   7. PHPUnit_Framework_TestSuite->run() /data/phpBB/vendor/phpunit/phpunit/src/Framework/TestSuite.php:733
24-Jun-2018 01:46:12    82.6593  451476456   8. PHPUnit_Framework_TestCase->run() /data/phpBB/vendor/phpunit/phpunit/src/Framework/TestSuite.php:733
24-Jun-2018 01:46:12    82.6593  451477080   9. PHPUnit_Framework_TestResult->run() /data/phpBB/vendor/phpunit/phpunit/src/Framework/TestCase.php:868
24-Jun-2018 01:46:12    82.6595  451480368  10. PHPUnit_Framework_TestCase->runBare() /data/phpBB/vendor/phpunit/phpunit/src/Framework/TestResult.php:686
24-Jun-2018 01:46:12    82.6603  451551872  11. phpbb_tests_notification_base->setUp() /data/phpBB/vendor/phpunit/phpunit/src/Framework/TestCase.php:909
24-Jun-2018 01:46:12    82.7380  451875904  12. spl_autoload_call() /data/phpBB/vendor/phpunit/phpunit/src/Framework/TestCase.php:103
24-Jun-2018 01:46:12    82.7381  451876136  13. phpbb\class_loader->load_class() /data/phpBB/vendor/phpunit/phpunit/src/Framework/TestCase.php:103
24-Jun-2018 01:46:12
24-Jun-2018 01:46:13 Error occurred while running Task 'Run tests(10)' of type com.atlassian.bamboo.plugins.bamboo-docker-plugin:task.docker.cli.
24-Jun-2018 01:46:13 com.atlassian.bamboo.task.TaskException: Failed to execute task
24-Jun-2018 01:46:13         at com.atlassian.bamboo.plugins.docker.service.RunService.execute(RunService.java:75)
24-Jun-2018 01:46:13         at com.atlassian.bamboo.plugins.docker.tasks.cli.DockerCliTask.execute(DockerCliTask.java:70)
24-Jun-2018 01:46:13         at com.atlassian.bamboo.task.TaskExecutorImpl.lambda$executeTasks$3(TaskExecutorImpl.java:285)
24-Jun-2018 01:46:13         at com.atlassian.bamboo.task.TaskExecutorImpl.executeTaskWithPrePostActions(TaskExecutorImpl.java:224)
24-Jun-2018 01:46:13         at com.atlassian.bamboo.task.TaskExecutorImpl.executeTasks(TaskExecutorImpl.java:285)
24-Jun-2018 01:46:13         at com.atlassian.bamboo.task.TaskExecutorImpl.execute(TaskExecutorImpl.java:112)
24-Jun-2018 01:46:13         at com.atlassian.bamboo.build.pipeline.tasks.ExecuteBuildTask.call(ExecuteBuildTask.java:71)
24-Jun-2018 01:46:13         at com.atlassian.bamboo.v2.build.agent.DefaultBuildAgent.executeBuildPhase(DefaultBuildAgent.java:203)
24-Jun-2018 01:46:13         at com.atlassian.bamboo.v2.build.agent.DefaultBuildAgent.build(DefaultBuildAgent.java:175)
24-Jun-2018 01:46:13         at com.atlassian.bamboo.v2.build.agent.BuildAgentControllerImpl.lambda$waitAndPerformBuild$0(BuildAgentControllerImpl.java:122)
24-Jun-2018 01:46:13         at com.atlassian.bamboo.variable.CustomVariableContextImpl.withVariableSubstitutor(CustomVariableContextImpl.java:185)
24-Jun-2018 01:46:13         at com.atlassian.bamboo.v2.build.agent.BuildAgentControllerImpl.waitAndPerformBuild(BuildAgentControllerImpl.java:117)
24-Jun-2018 01:46:13         at com.atlassian.bamboo.v2.build.agent.DefaultBuildAgent$1.run(DefaultBuildAgent.java:126)
24-Jun-2018 01:46:13         at com.atlassian.bamboo.utils.BambooRunnables$1.run(BambooRunnables.java:48)
24-Jun-2018 01:46:13         at com.atlassian.bamboo.security.ImpersonationHelper.runWith(ImpersonationHelper.java:26)
24-Jun-2018 01:46:13         at com.atlassian.bamboo.security.ImpersonationHelper.runWithSystemAuthority(ImpersonationHelper.java:17)
24-Jun-2018 01:46:13         at com.atlassian.bamboo.security.ImpersonationHelper$1.run(ImpersonationHelper.java:41)
24-Jun-2018 01:46:13         at java.lang.Thread.run(Thread.java:748)
24-Jun-2018 01:46:13 Caused by: com.atlassian.bamboo.docker.DockerException: Error running Docker run command
24-Jun-2018 01:46:13         at com.atlassian.bamboo.docker.DockerContainerServiceImpl.run(DockerContainerServiceImpl.java:118)
24-Jun-2018 01:46:13         at sun.reflect.GeneratedMethodAccessor2553.invoke(Unknown Source)
24-Jun-2018 01:46:13         at sun.reflect.DelegatingMethodAccessorImpl.invoke(DelegatingMethodAccessorImpl.java:43)
24-Jun-2018 01:46:13         at java.lang.reflect.Method.invoke(Method.java:498)
24-Jun-2018 01:46:13         at com.atlassian.plugin.util.ContextClassLoaderSettingInvocationHandler.invoke(ContextClassLoaderSettingInvocationHandler.java:26)
24-Jun-2018 01:46:13         at com.sun.proxy.$Proxy401.run(Unknown Source)
24-Jun-2018 01:46:13         at sun.reflect.GeneratedMethodAccessor2553.invoke(Unknown Source)
24-Jun-2018 01:46:13         at sun.reflect.DelegatingMethodAccessorImpl.invoke(DelegatingMethodAccessorImpl.java:43)
24-Jun-2018 01:46:13         at java.lang.reflect.Method.invoke(Method.java:498)
24-Jun-2018 01:46:13         at org.springframework.aop.support.AopUtils.invokeJoinpointUsingReflection(AopUtils.java:302)
24-Jun-2018 01:46:13         at org.eclipse.gemini.blueprint.service.importer.support.internal.aop.ServiceInvoker.doInvoke(ServiceInvoker.java:56)
24-Jun-2018 01:46:13         at org.eclipse.gemini.blueprint.service.importer.support.internal.aop.ServiceInvoker.invoke(ServiceInvoker.java:60)
24-Jun-2018 01:46:13         at org.springframework.aop.framework.ReflectiveMethodInvocation.proceed(ReflectiveMethodInvocation.java:179)
24-Jun-2018 01:46:13         at org.springframework.aop.support.DelegatingIntroductionInterceptor.doProceed(DelegatingIntroductionInterceptor.java:133)
24-Jun-2018 01:46:13         at org.springframework.aop.support.DelegatingIntroductionInterceptor.invoke(DelegatingIntroductionInterceptor.java:121)
24-Jun-2018 01:46:13         at org.springframework.aop.framework.ReflectiveMethodInvocation.proceed(ReflectiveMethodInvocation.java:179)
24-Jun-2018 01:46:13         at org.eclipse.gemini.blueprint.service.util.internal.aop.ServiceTCCLInterceptor.invokeUnprivileged(ServiceTCCLInterceptor.java:70)
24-Jun-2018 01:46:13         at org.eclipse.gemini.blueprint.service.util.internal.aop.ServiceTCCLInterceptor.invoke(ServiceTCCLInterceptor.java:53)
24-Jun-2018 01:46:13         at org.springframework.aop.framework.ReflectiveMethodInvocation.proceed(ReflectiveMethodInvocation.java:179)
24-Jun-2018 01:46:13         at org.eclipse.gemini.blueprint.service.importer.support.LocalBundleContextAdvice.invoke(LocalBundleContextAdvice.java:57)
24-Jun-2018 01:46:13         at org.springframework.aop.framework.ReflectiveMethodInvocation.proceed(ReflectiveMethodInvocation.java:179)
24-Jun-2018 01:46:13         at org.springframework.aop.support.DelegatingIntroductionInterceptor.doProceed(DelegatingIntroductionInterceptor.java:133)
24-Jun-2018 01:46:13         at org.springframework.aop.support.DelegatingIntroductionInterceptor.invoke(DelegatingIntroductionInterceptor.java:121)
24-Jun-2018 01:46:13         at org.springframework.aop.framework.ReflectiveMethodInvocation.proceed(ReflectiveMethodInvocation.java:179)
24-Jun-2018 01:46:13         at org.springframework.aop.framework.JdkDynamicAopProxy.invoke(JdkDynamicAopProxy.java:207)
24-Jun-2018 01:46:13         at com.sun.proxy.$Proxy679.run(Unknown Source)
24-Jun-2018 01:46:13         at com.atlassian.bamboo.plugins.docker.client.DockerCmd.run(DockerCmd.java:51)
24-Jun-2018 01:46:13         at com.atlassian.bamboo.plugins.docker.service.RunService.execute(RunService.java:64)
24-Jun-2018 01:46:13         ... 17 more
24-Jun-2018 01:46:13 Caused by: com.atlassian.utils.process.ProcessException: Error executing /usr/bin/docker run --volume /home/bamboo/xml-data/build-dir/PHPBB3-PR-JOB1:/data --workdir /data --rm -u=991 -t phpbb:php-5.6 /bin/bash -c "phpBB/vendor/bin/phpunit --log-junit build/logs/phpunit.xml"
24-Jun-2018 01:46:13         at com.atlassian.bamboo.docker.DockerContainerServiceImpl.execute(DockerContainerServiceImpl.java:252)
24-Jun-2018 01:46:13         at com.atlassian.bamboo.docker.DockerContainerServiceImpl.run(DockerContainerServiceImpl.java:106)
24-Jun-2018 01:46:13         ... 44 more
24-Jun-2018 01:46:13 Starting task 'Parsing test results produced by script' of type 'com.atlassian.bamboo.plugins.testresultparser:task.testresultparser.junit'
24-Jun-2018 01:46:13 Parsing test results under /home/bamboo/xml-data/build-dir/PHPBB3-PR-JOB1...
24-Jun-2018 01:46:13 Failing task since test cases were expected but none were found.
24-Jun-2018 01:46:13 Finished task 'Parsing test results produced by script' with result: Failed
24-Jun-2018 01:46:13
Substituting variable: ${bamboo.PRnumber} with 5225
24-Jun-2018 01:46:13
Substituting variable: ${bamboo.buildResultsUrl} with https://bamboo.phpbb.com/browse/PHPBB3-PR-JOB1-8311
24-Jun-2018 01:46:13
Substituting variable: ${bamboo.buildResultsUrl} with https://bamboo.phpbb.com/browse/PHPBB3-PR-JOB1-8311
24-Jun-2018 01:46:13 Starting task 'Set result build status' of type 'com.atlassian.bamboo.plugins.scripttask:task.builder.script'
24-Jun-2018 01:46:13
Beginning to execute external process for build 'phpBB3 - Pull Requests - Build and Test Job #8311 (PHPBB3-PR-JOB1-8311)'
... running command line:
/bin/sh /home/bamboo/temp/PHPBB3-PR-JOB1-8311-ScriptBuildTask-7203185338394053953.sh
... in: /home/bamboo/xml-data/build-dir/PHPBB3-PR-JOB1
... using extra environment variables:
bamboo_planRepository_1_branch=3.1.x
bamboo_planRepository_1_branchDisplayName=3.1.x
bamboo_repository_revision_number=dc8ff9da28b8ab4ad11c7ea94cca526f17c87fe5
bamboo_PRref=master
bamboo_resultsUrl=https://bamboo.phpbb.com/browse/PHPBB3-PR-JOB1-8311
bamboo_capability_system_builder_command_Git=/usr/bin/git
bamboo_repository_75956235_git_username=bantu
bamboo_build_working_directory=/home/bamboo/xml-data/build-dir/PHPBB3-PR-JOB1
bamboo_planRepository_1_name=phpBB Ascraeus
bamboo_buildKey=PHPBB3-PR-JOB1
bamboo_capability_phpbb_tests=true
bamboo_shortPlanName=Pull Requests
bamboo_capability_system_builder_command_fop=/usr/bin/fop
bamboo_capability_dbms_sqlite_2=true
bamboo_planRepository_name=phpBB Ascraeus
bamboo_PRnumber=5225
bamboo_buildNumber=8311
bamboo_repository_75956235_git_repositoryUrl=https://github.com/phpbb/phpbb.git
bamboo_capability_system_builder_phpunit_PHPUnit=/usr/bin/phpunit
bamboo_shortJobName=Build and Test Job
bamboo_buildResultsUrl=https://bamboo.phpbb.com/browse/PHPBB3-PR-JOB1-8311
bamboo_repository_75956235_branch_name=3.1.x
bamboo_planRepository_repositoryUrl=https://github.com/phpbb/phpbb.git
bamboo_agentId=131073
bamboo_planName=phpBB3 - Pull Requests
bamboo_build_commandline_com_atlassian_bamboo_plugins_scripttask_task_builder_script_7=/bin/sh /home/bamboo/temp/PHPBB3-PR-JOB1-8311-ScriptBuildTask-9150250084551278438.sh
bamboo_shortPlanKey=PR
bamboo_shortJobKey=JOB1
bamboo_capability_dbms_mysql_55=true
bamboo_capability_system_jdk_JDK_1_7_0_65=/usr/lib/jvm/java-7-openjdk-amd64
bamboo_planRepository_revision=dc8ff9da28b8ab4ad11c7ea94cca526f17c87fe5
bamboo_buildTimeStamp=2018-06-24T01:42:00.403Z
bamboo_repository_previous_revision_number=dc8ff9da28b8ab4ad11c7ea94cca526f17c87fe5
bamboo_capability_system_jdk_JDK_1_6_0_16=/usr/lib/jvm/java-6-sun-1.6.0.16
bamboo_capability_system_builder_mvn2_Maven_2=/usr/share/maven2
bamboo_planRepository_previousRevision=dc8ff9da28b8ab4ad11c7ea94cca526f17c87fe5
bamboo_build_commandline_com_atlassian_bamboo_plugins_scripttask_task_builder_script_4=/bin/sh /home/bamboo/temp/PHPBB3-PR-JOB1-8311-ScriptBuildTask-6526300531534926819.sh
bamboo_repository_git_branch=3.1.x
bamboo_buildResultKey=PHPBB3-PR-JOB1-8311
bamboo_repository_branch_name=3.1.x
bamboo_buildPlanName=phpBB3 - Pull Requests - Build and Test Job
bamboo_planRepository_1_revision=dc8ff9da28b8ab4ad11c7ea94cca526f17c87fe5
bamboo_repository_name=phpBB Ascraeus
bamboo_buildFailed=true
bamboo_build_commandline_com_atlassian_bamboo_plugins_bamboo_docker_plugin_task_docker_cli_10=/usr/bin/docker run --volume /home/bamboo/xml-data/build-dir/PHPBB3-PR-JOB1:/data --workdir /data --rm -u=991 -t phpbb:php-5.6 /bin/bash -c phpBB/vendor/bin/phpunit --log-junit build/logs/phpunit.xml
bamboo_capability_system_docker_executable=/usr/bin/docker
bamboo_build_commandline_com_atlassian_bamboo_plugins_bamboo_docker_plugin_task_docker_cli_11=/usr/bin/docker run --volume /home/bamboo/xml-data/build-dir/PHPBB3-PR-JOB1:/data --workdir /data/build --rm -u=991 phpbb:php-5.6 ../phpBB/vendor/bin/phing sniff
bamboo_build_commandline_com_atlassian_bamboo_plugins_bamboo_docker_plugin_task_docker_cli_12=/usr/bin/docker run --volume /home/bamboo/xml-data/build-dir/PHPBB3-PR-JOB1:/data --workdir /data/phpBB --rm -e HOME=/home/bamboo -u=991 phpbb:php-5.6 /bin/bash -c php ../composer.phar install --dev; cd ../build; ../phpBB/vendor/bin/phing clean prepare
bamboo_planRepository_branch=3.1.x
bamboo_agentWorkingDirectory=/home/bamboo/xml-data/build-dir
bamboo_jobFailed=true
bamboo_capability_system_git_executable=/usr/bin/git
bamboo_capability_system_builder_phpunit_PHPUnit_3_4=/usr/bin/phpunit
bamboo_repository_git_username=bantu
bamboo_planRepository_1_previousRevision=dc8ff9da28b8ab4ad11c7ea94cca526f17c87fe5
bamboo_repository_75956235_revision_number=dc8ff9da28b8ab4ad11c7ea94cca526f17c87fe5
bamboo_planRepository_branchDisplayName=3.1.x
bamboo_planRepository_1_type=gitv2
bamboo_planRepository_branchName=3.1.x
bamboo_repository_75956235_previous_revision_number=dc8ff9da28b8ab4ad11c7ea94cca526f17c87fe5
bamboo_capability_system_jdk_JDK=/usr/lib/jvm/java-6-sun
bamboo_plan_storageTag=PHPBB3-PR
bamboo_hg_cache_directory=/home/bamboo/xml-data/build-dir/_hg-repositories-cache
bamboo_planRepository_1_username=bantu
bamboo_planRepository_type=gitv2
bamboo_git_cache_directory=/home/bamboo/xml-data/build-dir/_git-repositories-cache
bamboo_ManualBuildTriggerReason_userName=Build Robot
bamboo_repository_git_repositoryUrl=https://github.com/phpbb/phpbb.git
bamboo_repository_75956235_git_branch=3.1.x
bamboo_capability_system_builder_ant_Ant=/usr/share/ant
bamboo_repository_75956235_name=phpBB Ascraeus
bamboo_tmp_directory=/home/bamboo/temp
bamboo_working_directory=/home/bamboo/xml-data/build-dir/PHPBB3-PR-JOB1
bamboo_planKey=PHPBB3-PR
bamboo_capability_local=true
bamboo_planRepository_1_repositoryUrl=https://github.com/phpbb/phpbb.git
bamboo_planRepository_username=bantu
bamboo_capability_system_jdk_JDK_1_6=/usr/lib/jvm/java-6-sun
bamboo_capability_system_jdk_JDK_1_7=/usr/lib/jvm/java-7-openjdk-amd64
bamboo_planRepository_1_branchName=3.1.x
24-Jun-2018 01:46:13 From https://github.com/phpbb/phpbb
24-Jun-2018 01:46:13 * branch            refs/pull/5225/head -> FETCH_HEAD
24-Jun-2018 01:46:13   % Total    % Received % Xferd  Average Speed   Time    Time     Time  Current
24-Jun-2018 01:46:13                                  Dload  Upload   Total   Spent    Left  Speed
24-Jun-2018 01:46:13
24-Jun-2018 01:46:14   0     0    0     0    0     0      0      0 --:--:-- --:--:-- --:--:--     0
24-Jun-2018 01:46:14   0     0    0     0    0     0      0      0 --:--:-- --:--:-- --:--:--     0
24-Jun-2018 01:46:14 100   273  100    93  100   180    153    296 --:--:-- --:--:-- --:--:--   296
24-Jun-2018 01:46:14 Finished task 'Set result build status' with result: Success
24-Jun-2018 01:46:14 Running post build plugin 'NCover Results Collector'
24-Jun-2018 01:46:14 Running post build plugin 'Artifact Copier'
24-Jun-2018 01:46:14 Running post build plugin 'npm Cache Cleanup'
24-Jun-2018 01:46:14 Running post build plugin 'Clover Results Collector'
24-Jun-2018 01:46:14 Running post build plugin 'Docker Container Cleanup'
24-Jun-2018 01:46:14 Successfully removed working directory at '/home/bamboo/xml-data/build-dir/PHPBB3-PR-JOB1'
24-Jun-2018 01:46:14 Finalising the build...
24-Jun-2018 01:46:14 Stopping timer.
24-Jun-2018 01:46:14 Build PHPBB3-PR-JOB1-8311 completed.
24-Jun-2018 01:46:14 Running on server: post build plugin 'NCover Results Collector'
24-Jun-2018 01:46:14 Running on server: post build plugin 'Build Hanging Detection Configuration'
24-Jun-2018 01:46:14 Running on server: post build plugin 'Clover Delta Calculator'
24-Jun-2018 01:46:14 Running on server: post build plugin 'Maven Dependencies Postprocessor'
24-Jun-2018 01:46:14 All post build plugins have finished
24-Jun-2018 01:46:14 Generating build results summary...
24-Jun-2018 01:46:14 Saving build results to disk...
24-Jun-2018 01:46:14 Logging substituted variables...
24-Jun-2018 01:46:15 Indexing build results...
24-Jun-2018 01:46:15 Finished building PHPBB3-PR-JOB1-8311.
24-Jun-2018 01:46:15
Substituting variable: ${bamboo.PRnumber} with 5225