Tests pending pull requests

Build: #8433 failed

Job: Build and Test Job failed

Stages & jobs

  1. Build and Test

Build log

The build generated 372 lines of output. Download or view full build log

08-Jul-2018 23:56:52 Build phpBB3 - Pull Requests - Build and Test Job #8433 (PHPBB3-PR-JOB1-8433) started building on agent Default Agent
08-Jul-2018 23:56:52
08-Jul-2018 23:56:52 Build working directory is /home/bamboo/xml-data/build-dir/PHPBB3-PR-JOB1
08-Jul-2018 23:56:52 Executing build phpBB3 - Pull Requests - Build and Test Job #8433 (PHPBB3-PR-JOB1-8433)
08-Jul-2018 23:56:52 Starting task 'Checkout develop branch' of type 'com.atlassian.bamboo.plugins.vcs:task.vcs.checkout'
08-Jul-2018 23:56:52 Build always requires a clean checkout
08-Jul-2018 23:56:52 Cleaning build directory '/home/bamboo/xml-data/build-dir/PHPBB3-PR-JOB1'
08-Jul-2018 23:56:52 Checking out into /home/bamboo/xml-data/build-dir/PHPBB3-PR-JOB1
08-Jul-2018 23:56:52 Updating source code to revision: dc8ff9da28b8ab4ad11c7ea94cca526f17c87fe5
08-Jul-2018 23:56:52 Fetching 'refs/heads/3.1.x' from 'https://github.com/phpbb/phpbb.git'.
08-Jul-2018 23:56:53 Checking out revision dc8ff9da28b8ab4ad11c7ea94cca526f17c87fe5.
08-Jul-2018 23:56:53 Creating local git repository in '/home/bamboo/xml-data/build-dir/PHPBB3-PR-JOB1/.git'.
08-Jul-2018 23:56:53 Cloning into '/home/bamboo/xml-data/build-dir/PHPBB3-PR-JOB1'...
08-Jul-2018 23:56:53 done.
08-Jul-2018 23:56:55 Switched to a new branch '3.1.x'
08-Jul-2018 23:56:55 Branch 3.1.x set up to track remote branch 3.1.x from origin.
08-Jul-2018 23:56:55 Updated source code to revision: dc8ff9da28b8ab4ad11c7ea94cca526f17c87fe5
08-Jul-2018 23:56:55 Finished task 'Checkout develop branch' with result: Success
08-Jul-2018 23:56:55 Running pre-build action: VCS Version Collector
08-Jul-2018 23:56:55
Substituting variable: ${bamboo.PRnumber} with 4933
08-Jul-2018 23:56:55
Substituting variable: ${bamboo.buildResultsUrl} with https://bamboo.phpbb.com/browse/PHPBB3-PR-JOB1-8433
08-Jul-2018 23:56:55 Starting task 'Set pending build status' of type 'com.atlassian.bamboo.plugins.scripttask:task.builder.script'
08-Jul-2018 23:56:55
Beginning to execute external process for build 'phpBB3 - Pull Requests - Build and Test Job #8433 (PHPBB3-PR-JOB1-8433)'
... running command line:
/bin/sh /home/bamboo/temp/PHPBB3-PR-JOB1-8433-ScriptBuildTask-5377002763267983732.sh
... in: /home/bamboo/xml-data/build-dir/PHPBB3-PR-JOB1
... using extra environment variables:
bamboo_planRepository_1_branch=3.1.x
bamboo_planRepository_1_branchDisplayName=3.1.x
bamboo_repository_revision_number=dc8ff9da28b8ab4ad11c7ea94cca526f17c87fe5
bamboo_PRref=master
bamboo_resultsUrl=https://bamboo.phpbb.com/browse/PHPBB3-PR-JOB1-8433
bamboo_capability_system_builder_command_Git=/usr/bin/git
bamboo_repository_75956235_git_username=bantu
bamboo_build_working_directory=/home/bamboo/xml-data/build-dir/PHPBB3-PR-JOB1
bamboo_planRepository_1_name=phpBB Ascraeus
bamboo_buildKey=PHPBB3-PR-JOB1
bamboo_capability_phpbb_tests=true
bamboo_shortPlanName=Pull Requests
bamboo_capability_system_builder_command_fop=/usr/bin/fop
bamboo_capability_dbms_sqlite_2=true
bamboo_planRepository_name=phpBB Ascraeus
bamboo_PRnumber=4933
bamboo_buildNumber=8433
bamboo_repository_75956235_git_repositoryUrl=https://github.com/phpbb/phpbb.git
bamboo_capability_system_builder_phpunit_PHPUnit=/usr/bin/phpunit
bamboo_shortJobName=Build and Test Job
bamboo_buildResultsUrl=https://bamboo.phpbb.com/browse/PHPBB3-PR-JOB1-8433
bamboo_repository_75956235_branch_name=3.1.x
bamboo_planRepository_repositoryUrl=https://github.com/phpbb/phpbb.git
bamboo_agentId=131073
bamboo_planName=phpBB3 - Pull Requests
bamboo_shortPlanKey=PR
bamboo_shortJobKey=JOB1
bamboo_capability_dbms_mysql_55=true
bamboo_capability_system_jdk_JDK_1_7_0_65=/usr/lib/jvm/java-7-openjdk-amd64
bamboo_planRepository_revision=dc8ff9da28b8ab4ad11c7ea94cca526f17c87fe5
bamboo_buildTimeStamp=2018-07-08T23:56:52.837Z
bamboo_repository_previous_revision_number=dc8ff9da28b8ab4ad11c7ea94cca526f17c87fe5
bamboo_capability_system_jdk_JDK_1_6_0_16=/usr/lib/jvm/java-6-sun-1.6.0.16
bamboo_capability_system_builder_mvn2_Maven_2=/usr/share/maven2
bamboo_planRepository_previousRevision=dc8ff9da28b8ab4ad11c7ea94cca526f17c87fe5
bamboo_repository_git_branch=3.1.x
bamboo_buildResultKey=PHPBB3-PR-JOB1-8433
bamboo_repository_branch_name=3.1.x
bamboo_buildPlanName=phpBB3 - Pull Requests - Build and Test Job
bamboo_planRepository_1_revision=dc8ff9da28b8ab4ad11c7ea94cca526f17c87fe5
bamboo_repository_name=phpBB Ascraeus
bamboo_buildFailed=false
bamboo_capability_system_docker_executable=/usr/bin/docker
bamboo_planRepository_branch=3.1.x
bamboo_agentWorkingDirectory=/home/bamboo/xml-data/build-dir
bamboo_capability_system_git_executable=/usr/bin/git
bamboo_capability_system_builder_phpunit_PHPUnit_3_4=/usr/bin/phpunit
bamboo_repository_git_username=bantu
bamboo_planRepository_1_previousRevision=dc8ff9da28b8ab4ad11c7ea94cca526f17c87fe5
bamboo_repository_75956235_revision_number=dc8ff9da28b8ab4ad11c7ea94cca526f17c87fe5
bamboo_planRepository_branchDisplayName=3.1.x
bamboo_planRepository_1_type=gitv2
bamboo_planRepository_branchName=3.1.x
bamboo_repository_75956235_previous_revision_number=dc8ff9da28b8ab4ad11c7ea94cca526f17c87fe5
bamboo_capability_system_jdk_JDK=/usr/lib/jvm/java-6-sun
bamboo_plan_storageTag=PHPBB3-PR
bamboo_hg_cache_directory=/home/bamboo/xml-data/build-dir/_hg-repositories-cache
bamboo_planRepository_1_username=bantu
bamboo_planRepository_type=gitv2
bamboo_git_cache_directory=/home/bamboo/xml-data/build-dir/_git-repositories-cache
bamboo_ManualBuildTriggerReason_userName=Build Robot
bamboo_repository_git_repositoryUrl=https://github.com/phpbb/phpbb.git
bamboo_repository_75956235_git_branch=3.1.x
bamboo_capability_system_builder_ant_Ant=/usr/share/ant
bamboo_repository_75956235_name=phpBB Ascraeus
bamboo_tmp_directory=/home/bamboo/temp
bamboo_working_directory=/home/bamboo/xml-data/build-dir/PHPBB3-PR-JOB1
bamboo_planKey=PHPBB3-PR
bamboo_capability_local=true
bamboo_planRepository_1_repositoryUrl=https://github.com/phpbb/phpbb.git
bamboo_planRepository_username=bantu
bamboo_capability_system_jdk_JDK_1_6=/usr/lib/jvm/java-6-sun
bamboo_capability_system_jdk_JDK_1_7=/usr/lib/jvm/java-7-openjdk-amd64
bamboo_planRepository_1_branchName=3.1.x
08-Jul-2018 23:56:58 From https://github.com/phpbb/phpbb
08-Jul-2018 23:56:58 * branch            refs/pull/4933/head -> FETCH_HEAD
08-Jul-2018 23:56:58   % Total    % Received % Xferd  Average Speed   Time    Time     Time  Current
08-Jul-2018 23:56:58                                  Dload  Upload   Total   Spent    Left  Speed
08-Jul-2018 23:56:58
08-Jul-2018 23:56:58   0     0    0     0    0     0      0      0 --:--:-- --:--:-- --:--:--     0
08-Jul-2018 23:56:58   0     0    0     0    0     0      0      0 --:--:-- --:--:-- --:--:--     0
08-Jul-2018 23:56:58 100   275  100    93  100   182    191    374 --:--:-- --:--:-- --:--:--   373
08-Jul-2018 23:56:58 Finished task 'Set pending build status' with result: Success
08-Jul-2018 23:56:58
Substituting variable: ${bamboo.PRnumber} with 4933
08-Jul-2018 23:56:58 Starting task 'Fetch PR' of type 'com.atlassian.bamboo.plugins.scripttask:task.builder.script'
08-Jul-2018 23:56:58
Beginning to execute external process for build 'phpBB3 - Pull Requests - Build and Test Job #8433 (PHPBB3-PR-JOB1-8433)'
... running command line:
/bin/sh /home/bamboo/temp/PHPBB3-PR-JOB1-8433-ScriptBuildTask-2219516323225442804.sh
... in: /home/bamboo/xml-data/build-dir/PHPBB3-PR-JOB1
... using extra environment variables:
bamboo_planRepository_1_branch=3.1.x
bamboo_planRepository_1_branchDisplayName=3.1.x
bamboo_repository_revision_number=dc8ff9da28b8ab4ad11c7ea94cca526f17c87fe5
bamboo_PRref=master
bamboo_resultsUrl=https://bamboo.phpbb.com/browse/PHPBB3-PR-JOB1-8433
bamboo_capability_system_builder_command_Git=/usr/bin/git
bamboo_repository_75956235_git_username=bantu
bamboo_build_working_directory=/home/bamboo/xml-data/build-dir/PHPBB3-PR-JOB1
bamboo_planRepository_1_name=phpBB Ascraeus
bamboo_buildKey=PHPBB3-PR-JOB1
bamboo_capability_phpbb_tests=true
bamboo_shortPlanName=Pull Requests
bamboo_capability_system_builder_command_fop=/usr/bin/fop
bamboo_capability_dbms_sqlite_2=true
bamboo_planRepository_name=phpBB Ascraeus
bamboo_PRnumber=4933
bamboo_buildNumber=8433
bamboo_repository_75956235_git_repositoryUrl=https://github.com/phpbb/phpbb.git
bamboo_capability_system_builder_phpunit_PHPUnit=/usr/bin/phpunit
bamboo_shortJobName=Build and Test Job
bamboo_buildResultsUrl=https://bamboo.phpbb.com/browse/PHPBB3-PR-JOB1-8433
bamboo_repository_75956235_branch_name=3.1.x
bamboo_planRepository_repositoryUrl=https://github.com/phpbb/phpbb.git
bamboo_agentId=131073
bamboo_planName=phpBB3 - Pull Requests
bamboo_build_commandline_com_atlassian_bamboo_plugins_scripttask_task_builder_script_7=/bin/sh /home/bamboo/temp/PHPBB3-PR-JOB1-8433-ScriptBuildTask-5377002763267983732.sh
bamboo_shortPlanKey=PR
bamboo_shortJobKey=JOB1
bamboo_capability_dbms_mysql_55=true
bamboo_capability_system_jdk_JDK_1_7_0_65=/usr/lib/jvm/java-7-openjdk-amd64
bamboo_planRepository_revision=dc8ff9da28b8ab4ad11c7ea94cca526f17c87fe5
bamboo_buildTimeStamp=2018-07-08T23:56:52.837Z
bamboo_repository_previous_revision_number=dc8ff9da28b8ab4ad11c7ea94cca526f17c87fe5
bamboo_capability_system_jdk_JDK_1_6_0_16=/usr/lib/jvm/java-6-sun-1.6.0.16
bamboo_capability_system_builder_mvn2_Maven_2=/usr/share/maven2
bamboo_planRepository_previousRevision=dc8ff9da28b8ab4ad11c7ea94cca526f17c87fe5
bamboo_repository_git_branch=3.1.x
bamboo_buildResultKey=PHPBB3-PR-JOB1-8433
bamboo_repository_branch_name=3.1.x
bamboo_buildPlanName=phpBB3 - Pull Requests - Build and Test Job
bamboo_planRepository_1_revision=dc8ff9da28b8ab4ad11c7ea94cca526f17c87fe5
bamboo_repository_name=phpBB Ascraeus
bamboo_buildFailed=false
bamboo_capability_system_docker_executable=/usr/bin/docker
bamboo_planRepository_branch=3.1.x
bamboo_agentWorkingDirectory=/home/bamboo/xml-data/build-dir
bamboo_capability_system_git_executable=/usr/bin/git
bamboo_capability_system_builder_phpunit_PHPUnit_3_4=/usr/bin/phpunit
bamboo_repository_git_username=bantu
bamboo_planRepository_1_previousRevision=dc8ff9da28b8ab4ad11c7ea94cca526f17c87fe5
bamboo_repository_75956235_revision_number=dc8ff9da28b8ab4ad11c7ea94cca526f17c87fe5
bamboo_planRepository_branchDisplayName=3.1.x
bamboo_planRepository_1_type=gitv2
bamboo_planRepository_branchName=3.1.x
bamboo_repository_75956235_previous_revision_number=dc8ff9da28b8ab4ad11c7ea94cca526f17c87fe5
bamboo_capability_system_jdk_JDK=/usr/lib/jvm/java-6-sun
bamboo_plan_storageTag=PHPBB3-PR
bamboo_hg_cache_directory=/home/bamboo/xml-data/build-dir/_hg-repositories-cache
bamboo_planRepository_1_username=bantu
bamboo_planRepository_type=gitv2
bamboo_git_cache_directory=/home/bamboo/xml-data/build-dir/_git-repositories-cache
bamboo_ManualBuildTriggerReason_userName=Build Robot
bamboo_repository_git_repositoryUrl=https://github.com/phpbb/phpbb.git
bamboo_repository_75956235_git_branch=3.1.x
bamboo_capability_system_builder_ant_Ant=/usr/share/ant
bamboo_repository_75956235_name=phpBB Ascraeus
bamboo_tmp_directory=/home/bamboo/temp
bamboo_working_directory=/home/bamboo/xml-data/build-dir/PHPBB3-PR-JOB1
bamboo_planKey=PHPBB3-PR
bamboo_capability_local=true
bamboo_planRepository_1_repositoryUrl=https://github.com/phpbb/phpbb.git
bamboo_planRepository_username=bantu
bamboo_capability_system_jdk_JDK_1_6=/usr/lib/jvm/java-6-sun
bamboo_capability_system_jdk_JDK_1_7=/usr/lib/jvm/java-7-openjdk-amd64
bamboo_planRepository_1_branchName=3.1.x
08-Jul-2018 23:57:01 From https://github.com/phpbb/phpbb
08-Jul-2018 23:57:01 * branch            refs/pull/4933/merge -> FETCH_HEAD
08-Jul-2018 23:57:02 Note: checking out 'FETCH_HEAD'.
08-Jul-2018 23:57:02
08-Jul-2018 23:57:02 You are in 'detached HEAD' state. You can look around, make experimental
08-Jul-2018 23:57:02 changes and commit them, and you can discard any commits you make in this
08-Jul-2018 23:57:02 state without impacting any branches by performing another checkout.
08-Jul-2018 23:57:02
08-Jul-2018 23:57:02 If you want to create a new branch to retain commits you create, you may
08-Jul-2018 23:57:02 do so (now or later) by using -b with the checkout command again. Example:
08-Jul-2018 23:57:02
08-Jul-2018 23:57:02   git checkout -b new_branch_name
08-Jul-2018 23:57:02
08-Jul-2018 23:57:02 HEAD is now at 939d532... Merge 10c7c13bc8ed1b99e9d8d219eaf2fd51b191324e into 72ce0ec309b6c3ab3cf311527ba01958fb8ba7ec
08-Jul-2018 23:57:02 Finished task 'Fetch PR' with result: Success
08-Jul-2018 23:57:02 Skipping execution of task 'Prepare directory' as it is disabled
08-Jul-2018 23:57:02
Substituting variable: ${bamboo.working.directory} with /home/bamboo/xml-data/build-dir/PHPBB3-PR-JOB1
08-Jul-2018 23:57:02 Starting task 'Prepare directory' of type 'com.atlassian.bamboo.plugins.bamboo-docker-plugin:task.docker.cli'
08-Jul-2018 23:57:02 Running image name (phpbb:php-5.6)
08-Jul-2018 23:57:02
Beginning to execute external process for build 'phpBB3 - Pull Requests - Build and Test Job #8433 (PHPBB3-PR-JOB1-8433)'
... running command line:
/usr/bin/docker run --volume /home/bamboo/xml-data/build-dir/PHPBB3-PR-JOB1:/data --workdir /data/phpBB --rm -e HOME=/home/bamboo -u=991 phpbb:php-5.6 /bin/bash -c php ../composer.phar install --dev; cd ../build; ../phpBB/vendor/bin/phing clean prepare
... in: /home/bamboo/xml-data/build-dir/PHPBB3-PR-JOB1
... using extra environment variables:
bamboo_planRepository_1_branch=3.1.x
bamboo_planRepository_1_branchDisplayName=3.1.x
bamboo_repository_revision_number=dc8ff9da28b8ab4ad11c7ea94cca526f17c87fe5
bamboo_PRref=master
bamboo_resultsUrl=https://bamboo.phpbb.com/browse/PHPBB3-PR-JOB1-8433
bamboo_capability_system_builder_command_Git=/usr/bin/git
bamboo_repository_75956235_git_username=bantu
bamboo_build_working_directory=/home/bamboo/xml-data/build-dir/PHPBB3-PR-JOB1
bamboo_planRepository_1_name=phpBB Ascraeus
bamboo_buildKey=PHPBB3-PR-JOB1
bamboo_capability_phpbb_tests=true
bamboo_shortPlanName=Pull Requests
bamboo_capability_system_builder_command_fop=/usr/bin/fop
bamboo_capability_dbms_sqlite_2=true
bamboo_planRepository_name=phpBB Ascraeus
bamboo_PRnumber=4933
bamboo_buildNumber=8433
bamboo_repository_75956235_git_repositoryUrl=https://github.com/phpbb/phpbb.git
bamboo_capability_system_builder_phpunit_PHPUnit=/usr/bin/phpunit
bamboo_shortJobName=Build and Test Job
bamboo_buildResultsUrl=https://bamboo.phpbb.com/browse/PHPBB3-PR-JOB1-8433
bamboo_repository_75956235_branch_name=3.1.x
bamboo_planRepository_repositoryUrl=https://github.com/phpbb/phpbb.git
bamboo_agentId=131073
bamboo_planName=phpBB3 - Pull Requests
bamboo_build_commandline_com_atlassian_bamboo_plugins_scripttask_task_builder_script_7=/bin/sh /home/bamboo/temp/PHPBB3-PR-JOB1-8433-ScriptBuildTask-5377002763267983732.sh
bamboo_shortPlanKey=PR
bamboo_shortJobKey=JOB1
bamboo_capability_dbms_mysql_55=true
bamboo_capability_system_jdk_JDK_1_7_0_65=/usr/lib/jvm/java-7-openjdk-amd64
bamboo_planRepository_revision=dc8ff9da28b8ab4ad11c7ea94cca526f17c87fe5
bamboo_buildTimeStamp=2018-07-08T23:56:52.837Z
bamboo_repository_previous_revision_number=dc8ff9da28b8ab4ad11c7ea94cca526f17c87fe5
bamboo_capability_system_jdk_JDK_1_6_0_16=/usr/lib/jvm/java-6-sun-1.6.0.16
bamboo_capability_system_builder_mvn2_Maven_2=/usr/share/maven2
bamboo_planRepository_previousRevision=dc8ff9da28b8ab4ad11c7ea94cca526f17c87fe5
bamboo_build_commandline_com_atlassian_bamboo_plugins_scripttask_task_builder_script_4=/bin/sh /home/bamboo/temp/PHPBB3-PR-JOB1-8433-ScriptBuildTask-2219516323225442804.sh
bamboo_repository_git_branch=3.1.x
bamboo_buildResultKey=PHPBB3-PR-JOB1-8433
bamboo_repository_branch_name=3.1.x
bamboo_buildPlanName=phpBB3 - Pull Requests - Build and Test Job
bamboo_planRepository_1_revision=dc8ff9da28b8ab4ad11c7ea94cca526f17c87fe5
bamboo_repository_name=phpBB Ascraeus
bamboo_buildFailed=false
bamboo_capability_system_docker_executable=/usr/bin/docker
bamboo_planRepository_branch=3.1.x
bamboo_agentWorkingDirectory=/home/bamboo/xml-data/build-dir
bamboo_capability_system_git_executable=/usr/bin/git
bamboo_capability_system_builder_phpunit_PHPUnit_3_4=/usr/bin/phpunit
bamboo_repository_git_username=bantu
bamboo_planRepository_1_previousRevision=dc8ff9da28b8ab4ad11c7ea94cca526f17c87fe5
bamboo_repository_75956235_revision_number=dc8ff9da28b8ab4ad11c7ea94cca526f17c87fe5
bamboo_planRepository_branchDisplayName=3.1.x
bamboo_planRepository_1_type=gitv2
bamboo_planRepository_branchName=3.1.x
bamboo_repository_75956235_previous_revision_number=dc8ff9da28b8ab4ad11c7ea94cca526f17c87fe5
bamboo_capability_system_jdk_JDK=/usr/lib/jvm/java-6-sun
bamboo_plan_storageTag=PHPBB3-PR
bamboo_hg_cache_directory=/home/bamboo/xml-data/build-dir/_hg-repositories-cache
bamboo_planRepository_1_username=bantu
bamboo_planRepository_type=gitv2
bamboo_git_cache_directory=/home/bamboo/xml-data/build-dir/_git-repositories-cache
bamboo_ManualBuildTriggerReason_userName=Build Robot
bamboo_repository_git_repositoryUrl=https://github.com/phpbb/phpbb.git
bamboo_repository_75956235_git_branch=3.1.x
bamboo_capability_system_builder_ant_Ant=/usr/share/ant
bamboo_repository_75956235_name=phpBB Ascraeus
bamboo_tmp_directory=/home/bamboo/temp
bamboo_working_directory=/home/bamboo/xml-data/build-dir/PHPBB3-PR-JOB1
bamboo_planKey=PHPBB3-PR
bamboo_capability_local=true
bamboo_planRepository_1_repositoryUrl=https://github.com/phpbb/phpbb.git
bamboo_planRepository_username=bantu
bamboo_capability_system_jdk_JDK_1_6=/usr/lib/jvm/java-6-sun
bamboo_capability_system_jdk_JDK_1_7=/usr/lib/jvm/java-7-openjdk-amd64
bamboo_planRepository_1_branchName=3.1.x
08-Jul-2018 23:57:02 Cannot create cache directory /home/bamboo/.composer/cache/repo/https---packagist.org/, or directory is not writable. Proceeding without cache
08-Jul-2018 23:57:02 Cannot create cache directory /home/bamboo/.composer/cache/files/, or directory is not writable. Proceeding without cache
08-Jul-2018 23:57:02 You are using the deprecated option "dev". Dev packages are installed by default now.
08-Jul-2018 23:57:02 Loading composer repositories with package information
08-Jul-2018 23:57:02 Installing dependencies (including require-dev) from lock file
08-Jul-2018 23:57:02 Package operations: 75 installs, 0 updates, 0 removals
08-Jul-2018 23:57:03   - Installing composer/installers (v1.5.0): Downloading (connecting...)Downloading (0%)           Downloading (5%)Downloading (20%)Downloading (45%)Downloading (55%)Downloading (60%)Downloading (65%)Downloading (80%)Downloading (85%)Downloading (90%)Downloading (100%)
08-Jul-2018 23:57:04   - Installing bantu/ini-get-wrapper (v1.0.1): Downloading (connecting...)Downloading (0%)           Downloading (100%)
08-Jul-2018 23:57:04   - Installing symfony/process (v3.4.3): Downloading (connecting...)Downloading (0%)           Downloading (5%)Downloading (30%)Downloading (35%)Downloading (70%)Downloading (75%)Downloading (80%)Downloading (100%)
08-Jul-2018 23:57:05   - Installing symfony/finder (v3.4.3): Downloading (connecting...)Downloading (0%)           Downloading (5%)Downloading (10%)Downloading (40%)Downloading (45%)Downloading (50%)Downloading (55%)Downloading (90%)Downloading (95%)Downloading (100%)
08-Jul-2018 23:57:06   - Installing symfony/filesystem (v3.4.3): Downloading (connecting...)Downloading (0%)           Downloading (5%)Downloading (70%)Downloading (100%)
08-Jul-2018 23:57:07   - Installing symfony/polyfill-mbstring (v1.7.0): Downloading (connecting...)Downloading (0%)           Downloading (20%)Downloading (40%)Downloading (100%)
08-Jul-2018 23:57:08   - Installing psr/log (1.0.2): Downloading (connecting...)Downloading (0%)           Downloading (15%)Downloading (100%)
08-Jul-2018 23:57:08   - Installing symfony/debug (v3.4.3): Downloading (connecting...)Downloading (0%)           Downloading (5%)Downloading (15%)Downloading (20%)Downloading (30%)Downloading (35%)Downloading (40%)Downloading (55%)Downloading (60%)Downloading (75%)Downloading (80%)Downloading (95%)Downloading (100%)
08-Jul-2018 23:57:09   - Installing symfony/console (v3.4.3): Downloading (connecting...)Downloading (0%)           Downloading (5%)Downloading (10%)Downloading (15%)Downloading (20%)Downloading (25%)Downloading (30%)Downloading (35%)Downloading (40%)Downloading (45%)Downloading (50%)Downloading (55%)Downloading (60%)Downloading (65%)Downloading (70%)Downloading (75%)Downloading (80%)Downloading (85%)Downloading (90%)Downloading (95%)Downloading (100%)
08-Jul-2018 23:57:10   - Installing seld/phar-utils (1.0.1): Downloading (connecting...)Downloading (0%)           Downloading (30%)Downloading (60%)Downloading (90%)Downloading (100%)
08-Jul-2018 23:57:10   - Installing seld/jsonlint (1.7.0): Downloading (connecting...)Downloading (0%)           Downloading (15%)Downloading (60%)Downloading (75%)Downloading (90%)Downloading (100%)
08-Jul-2018 23:57:11   - Installing seld/cli-prompt (1.0.3): Downloading (connecting...)Downloading (0%)           Downloading (15%)Downloading (30%)Downloading (100%)
08-Jul-2018 23:57:12   - Installing justinrainbow/json-schema (5.2.6): Downloading (connecting...)Downloading (0%)           Downloading (20%)Downloading (25%)Downloading (30%)Downloading (35%)Downloading (50%)Downloading (55%)Downloading (70%)Downloading (75%)Downloading (95%)Downloading (100%)
08-Jul-2018 23:57:13   - Installing composer/spdx-licenses (1.2.0): Downloading (connecting...)Downloading (0%)           Downloading (65%)Downloading (100%)
08-Jul-2018 23:57:13   - Installing composer/semver (1.4.2): Downloading (connecting...)Downloading (0%)           Downloading (35%)Downloading (75%)Downloading (100%)
08-Jul-2018 23:57:14   - Installing composer/ca-bundle (1.1.0): Downloading (connecting...)Downloading (0%)           Downloading (5%)Downloading (10%)Downloading (15%)Downloading (20%)Downloading (25%)Downloading (30%)Downloading (35%)Downloading (40%)Downloading (45%)Downloading (50%)Downloading (55%)Downloading (60%)Downloading (65%)Downloading (70%)Downloading (75%)Downloading (80%)Downloading (85%)Downloading (90%)Downloading (95%)Downloading (100%)
08-Jul-2018 23:57:16   - Installing composer/composer (1.6.2): Downloading (connecting...)Downloading (0%)           Downloading (5%)Downloading (10%)Downloading (15%)Downloading (20%)Downloading (25%)Downloading (30%)Downloading (35%)Downloading (40%)Downloading (45%)Downloading (50%)Downloading (55%)Downloading (60%)Downloading (65%)Downloading (70%)Downloading (75%)Downloading (80%)Downloading (85%)Downloading (90%)Downloading (95%)Downloading (100%)
08-Jul-2018 23:57:16   - Installing google/recaptcha (1.1.3): Downloading (connecting...)Downloading (0%)           Downloading (25%)Downloading (30%)Downloading (55%)Downloading (80%)Downloading (95%)Downloading (100%)
08-Jul-2018 23:57:17   - Installing guzzlehttp/promises (v1.3.1): Downloading (connecting...)Downloading (0%)           Downloading (30%)Downloading (60%)Downloading (80%)Downloading (100%)
08-Jul-2018 23:57:18   - Installing psr/http-message (1.0.1): Downloading (connecting...)Downloading (0%)           Downloading (95%)Downloading (100%)
08-Jul-2018 23:57:19   - Installing guzzlehttp/psr7 (1.4.2): Downloading (connecting...)Downloading (0%)           Downloading (5%)Downloading (10%)Downloading (15%)Downloading (20%)Downloading (50%)Downloading (55%)Downloading (60%)Downloading (65%)Downloading (70%)Downloading (100%)
08-Jul-2018 23:57:21   - Installing lusitanian/oauth (v0.8.10): Downloading (connecting...)Downloading (0%)           Downloading (5%)Downloading (10%)Downloading (15%)Downloading (20%)Downloading (30%)Downloading (35%)Downloading (45%)Downloading (50%)Downloading (55%)Downloading (60%)Downloading (65%)Downloading (70%)Downloading (75%)Downloading (80%)Downloading (85%)Downloading (95%)Downloading (100%)
08-Jul-2018 23:57:22   - Installing marc1706/fast-image-size (v1.1.4): Downloading (connecting...)Downloading (0%)           Downloading (75%)Downloading (100%)
08-Jul-2018 23:57:22   - Installing patchwork/utf8 (v1.3.1): Downloading (connecting...)Downloading (0%)           Downloading (5%)Downloading (10%)Downloading (15%)Downloading (20%)Downloading (25%)Downloading (30%)Downloading (35%)Downloading (40%)Downloading (45%)Downloading (50%)Downloading (55%)Downloading (60%)Downloading (65%)Downloading (70%)Downloading (75%)Downloading (80%)Downloading (85%)Downloading (90%)Downloading (95%)Downloading (100%)
08-Jul-2018 23:57:23   - Installing psr/container (1.0.0): Downloading (connecting...)Downloading (0%)           Downloading (75%)Downloading (100%)
08-Jul-2018 23:57:24   - Installing s9e/text-formatter (0.13.1): Downloading (connecting...)Downloading (0%)           Downloading (5%)Downloading (10%)Downloading (15%)Downloading (20%)Downloading (25%)Downloading (30%)Downloading (35%)Downloading (40%)Downloading (45%)Downloading (50%)Downloading (55%)Downloading (60%)Downloading (65%)Downloading (70%)Downloading (75%)Downloading (80%)Downloading (85%)Downloading (90%)Downloading (95%)Downloading (100%)
08-Jul-2018 23:57:25   - Installing symfony/config (v3.4.3): Downloading (connecting...)Downloading (0%)           Downloading (5%)Downloading (10%)Downloading (15%)Downloading (20%)Downloading (25%)Downloading (30%)Downloading (35%)Downloading (40%)Downloading (45%)Downloading (50%)Downloading (55%)Downloading (60%)Downloading (65%)Downloading (70%)Downloading (75%)Downloading (80%)Downloading (85%)Downloading (90%)Downloading (95%)Downloading (100%)
08-Jul-2018 23:57:26   - Installing paragonie/random_compat (v1.4.2): Downloading (connecting...)Downloading (0%)           Downloading (10%)Downloading (35%)Downloading (45%)Downloading (70%)Downloading (80%)Downloading (100%)
08-Jul-2018 23:57:26   - Installing symfony/polyfill-php70 (v1.6.0): Downloading (connecting...)Downloading (0%)           Downloading (85%)Downloading (100%)
08-Jul-2018 23:57:27   - Installing symfony/http-foundation (v3.4.3): Downloading (connecting...)Downloading (0%)           Downloading (5%)Downloading (10%)Downloading (15%)Downloading (20%)Downloading (25%)Downloading (30%)Downloading (35%)Downloading (40%)Downloading (45%)Downloading (50%)Downloading (55%)Downloading (60%)Downloading (65%)Downloading (70%)Downloading (75%)Downloading (80%)Downloading (85%)Downloading (90%)Downloading (95%)Downloading (100%)
08-Jul-2018 23:57:28   - Installing symfony/event-dispatcher (v3.4.3): Downloading (connecting...)Downloading (0%)           Downloading (5%)Downloading (90%)Downloading (95%)Downloading (100%)
08-Jul-2018 23:57:30   - Installing symfony/http-kernel (v3.4.3): Downloading (connecting...)Downloading (0%)           Downloading (5%)Downloading (10%)Downloading (15%)Downloading (20%)Downloading (25%)Downloading (30%)Downloading (35%)Downloading (40%)Downloading (45%)Downloading (50%)Downloading (55%)Downloading (60%)Downloading (65%)Downloading (70%)Downloading (75%)Downloading (80%)Downloading (85%)Downloading (90%)Downloading (95%)Downloading (100%)
08-Jul-2018 23:57:31   - Installing symfony/dependency-injection (v3.4.3): Downloading (connecting...)Downloading (0%)           Downloading (5%)Downloading (10%)Downloading (15%)Downloading (20%)Downloading (25%)Downloading (30%)Downloading (35%)Downloading (40%)Downloading (45%)Downloading (50%)Downloading (55%)Downloading (60%)Downloading (65%)Downloading (70%)Downloading (75%)Downloading (95%)Downloading (100%)
08-Jul-2018 23:57:32   - Installing zendframework/zend-eventmanager (3.2.0): Downloading (connecting...)Downloading (0%)           Downloading (25%)Downloading (35%)Downloading (50%)Downloading (70%)Downloading (100%)
08-Jul-2018 23:57:33   - Installing zendframework/zend-code (2.6.3): Downloading (connecting...)Downloading (0%)           Downloading (5%)Downloading (10%)Downloading (15%)Downloading (20%)Downloading (25%)Downloading (30%)Downloading (35%)Downloading (40%)Downloading (45%)Downloading (50%)Downloading (55%)Downloading (60%)Downloading (65%)Downloading (70%)Downloading (75%)Downloading (80%)Downloading (85%)Downloading (90%)Downloading (95%)Downloading (100%)
08-Jul-2018 23:57:33   - Installing ocramius/proxy-manager (1.0.2): Downloading (connecting...)Downloading (0%)           Downloading (5%)Downloading (10%)Downloading (15%)Downloading (20%)Downloading (25%)Downloading (30%)Downloading (35%)Downloading (40%)Downloading (45%)Downloading (50%)Downloading (55%)Downloading (60%)Downloading (65%)Downloading (70%)Downloading (75%)Downloading (80%)Downloading (85%)Downloading (90%)Downloading (95%)Downloading (100%)
08-Jul-2018 23:57:34   - Installing symfony/proxy-manager-bridge (v3.4.3): Downloading (connecting...)Downloading (0%)           Downloading (75%)Downloading (100%)
08-Jul-2018 23:57:36   - Installing symfony/routing (v3.4.3): Downloading (connecting...)Downloading (0%)           Downloading (5%)Downloading (10%)Downloading (15%)Downloading (20%)Downloading (25%)Downloading (30%)Downloading (35%)Downloading (40%)Downloading (45%)Downloading (50%)Downloading (55%)Downloading (60%)Downloading (65%)Downloading (70%)Downloading (75%)Downloading (80%)Downloading (85%)Downloading (90%)Downloading (95%)Downloading (100%)
08-Jul-2018 23:57:36   - Installing twig/twig (v1.35.0): Downloading (connecting...)Downloading (0%)           Downloading (5%)Downloading (10%)Downloading (15%)Downloading (20%)Downloading (25%)Downloading (30%)Downloading (35%)Downloading (40%)Downloading (45%)Downloading (50%)Downloading (55%)Downloading (60%)Downloading (65%)Downloading (70%)Downloading (75%)Downloading (80%)Downloading (85%)Downloading (95%)Downloading (100%)
08-Jul-2018 23:57:38   - Installing symfony/twig-bridge (v3.4.3): Downloading (connecting...)Downloading (0%)           Downloading (5%)Downloading (10%)Downloading (20%)Downloading (30%)Downloading (35%)Downloading (40%)Downloading (45%)Downloading (55%)Downloading (65%)Downloading (70%)Downloading (75%)Downloading (80%)Downloading (85%)Downloading (95%)Downloading (100%)
08-Jul-2018 23:57:38   - Installing symfony/dom-crawler (v3.4.3): Downloading (connecting...)Downloading (0%)           Downloading (5%)Downloading (25%)Downloading (30%)Downloading (45%)Downloading (50%)Downloading (55%)Downloading (90%)Downloading (95%)Downloading (100%)
08-Jul-2018 23:57:39   - Installing symfony/css-selector (v3.4.3): Downloading (connecting...)Downloading (0%)           Downloading (5%)Downloading (10%)Downloading (15%)Downloading (20%)Downloading (25%)Downloading (30%)Downloading (65%)Downloading (70%)Downloading (75%)Downloading (80%)Downloading (85%)Downloading (100%)
08-Jul-2018 23:57:40   - Installing symfony/browser-kit (v3.4.3): Downloading (connecting...)Downloading (0%)           Downloading (5%)Downloading (70%)Downloading (75%)Downloading (100%)
08-Jul-2018 23:57:41   - Installing guzzlehttp/guzzle (6.3.0): Downloading (connecting...)Downloading (0%)           Downloading (5%)Downloading (15%)Downloading (25%)Downloading (30%)Downloading (40%)Downloading (45%)Downloading (55%)Downloading (60%)Downloading (70%)Downloading (75%)Downloading (90%)Downloading (95%)Downloading (100%)
08-Jul-2018 23:57:42   - Installing fabpot/goutte (v3.2.2): Downloading (connecting...)Downloading (0%)           Downloading (55%)Downloading (90%)Downloading (100%)
08-Jul-2018 23:57:43   - Installing facebook/webdriver (1.5.0): Downloading (connecting...)Downloading (0%)           Downloading (5%)Downloading (10%)Downloading (15%)Downloading (20%)Downloading (25%)Downloading (30%)Downloading (35%)Downloading (40%)Downloading (45%)Downloading (50%)Downloading (55%)Downloading (60%)Downloading (65%)Downloading (70%)Downloading (75%)Downloading (80%)Downloading (85%)Downloading (90%)Downloading (95%)Downloading (100%)
08-Jul-2018 23:57:44   - Installing symfony/yaml (v3.4.3): Downloading (connecting...)Downloading (0%)           Downloading (5%)Downloading (10%)Downloading (15%)Downloading (20%)Downloading (25%)Downloading (30%)Downloading (35%)Downloading (40%)Downloading (45%)Downloading (50%)Downloading (100%)
08-Jul-2018 23:57:45   - Installing laravel/homestead (v7.7.0): Downloading (connecting...)Downloading (0%)           Downloading (5%)Downloading (10%)Downloading (50%)Downloading (55%)Downloading (100%)
08-Jul-2018 23:57:53   - Installing phing/phing (2.4.14): Downloading (connecting...)Downloading (0%)           Downloading (5%)Downloading (10%)Downloading (15%)Downloading (20%)Downloading (25%)Downloading (30%)Downloading (35%)Downloading (40%)Downloading (45%)Downloading (50%)Downloading (55%)Downloading (60%)Downloading (65%)Downloading (70%)Downloading (75%)Downloading (80%)Downloading (85%)Downloading (90%)Downloading (95%)Downloading (100%)
08-Jul-2018 23:57:53   - Installing webmozart/assert (1.2.0): Downloading (connecting...)Downloading (0%)           Downloading (55%)Downloading (100%)
08-Jul-2018 23:57:54   - Installing phpdocumentor/reflection-common (1.0.1): Downloading (connecting...)Downloading (0%)           Downloading (100%)
08-Jul-2018 23:57:55   - Installing phpdocumentor/type-resolver (0.4.0): Downloading (connecting...)Downloading (0%)           Downloading (5%)Downloading (35%)Downloading (100%)
08-Jul-2018 23:57:56   - Installing phpdocumentor/reflection-docblock (3.3.2): Downloading (connecting...)Downloading (0%)           Downloading (5%)Downloading (10%)Downloading (15%)Downloading (20%)Downloading (25%)Downloading (30%)Downloading (45%)Downloading (50%)Downloading (55%)Downloading (60%)Downloading (65%)Downloading (70%)Downloading (75%)Downloading (100%)
08-Jul-2018 23:57:56   - Installing sebastian/version (2.0.1): Downloading (connecting...)Downloading (0%)           Downloading (100%)
08-Jul-2018 23:57:57   - Installing sebastian/resource-operations (1.0.0): Downloading (connecting...)Downloading (0%)           Downloading (65%)Downloading (100%)
08-Jul-2018 23:57:58   - Installing sebastian/recursion-context (2.0.0): Downloading (connecting...)Downloading (0%)           Downloading (100%)
08-Jul-2018 23:57:59   - Installing sebastian/object-enumerator (2.0.1): Downloading (connecting...)Downloading (0%)           Downloading (95%)Downloading (100%)
08-Jul-2018 23:58:00   - Installing sebastian/global-state (1.1.1): Downloading (connecting...)Downloading (0%)           Downloading (40%)Downloading (70%)Downloading (100%)
08-Jul-2018 23:58:01   - Installing sebastian/exporter (2.0.0): Downloading (connecting...)Downloading (0%)           Downloading (100%)
08-Jul-2018 23:58:01   - Installing sebastian/environment (2.0.0): Downloading (connecting...)Downloading (0%)           Downloading (15%)Downloading (30%)Downloading (45%)Downloading (60%)Downloading (75%)Downloading (90%)Downloading (100%)
08-Jul-2018 23:58:02   - Installing sebastian/diff (1.4.3): Downloading (connecting...)Downloading (0%)           Downloading (35%)Downloading (40%)Downloading (75%)Downloading (100%)
08-Jul-2018 23:58:03   - Installing sebastian/comparator (1.2.4): Downloading (connecting...)Downloading (0%)           Downloading (10%)Downloading (30%)Downloading (40%)Downloading (70%)Downloading (80%)Downloading (90%)Downloading (95%)Downloading (100%)
08-Jul-2018 23:58:04   - Installing phpunit/php-text-template (1.2.1): Downloading (connecting...)Downloading (0%)           Downloading (35%)Downloading (100%)
08-Jul-2018 23:58:05   - Installing doctrine/instantiator (1.0.5): Downloading (connecting...)Downloading (0%)           Downloading (15%)Downloading (30%)Downloading (45%)Downloading (50%)Downloading (65%)Downloading (80%)Downloading (95%)Downloading (100%)
08-Jul-2018 23:58:05   - Installing phpunit/phpunit-mock-objects (3.4.4): Downloading (connecting...)Downloading (0%)           Downloading (5%)Downloading (10%)Downloading (15%)Downloading (20%)Downloading (30%)Downloading (35%)Downloading (40%)Downloading (50%)Downloading (55%)Downloading (60%)Downloading (65%)Downloading (70%)Downloading (75%)Downloading (80%)Downloading (85%)Downloading (90%)Downloading (95%)Downloading (100%)
08-Jul-2018 23:58:06   - Installing phpunit/php-timer (1.0.9): Downloading (connecting...)Downloading (0%)           Downloading (45%)Downloading (90%)Downloading (100%)
08-Jul-2018 23:58:07   - Installing phpunit/php-file-iterator (1.4.5): Downloading (connecting...)Downloading (0%)           Downloading (100%)
08-Jul-2018 23:58:07   - Installing sebastian/code-unit-reverse-lookup (1.0.1): Downloading (connecting...)Downloading (0%)           Downloading (55%)Downloading (100%)
08-Jul-2018 23:58:08   - Installing phpunit/php-token-stream (1.4.12): Downloading (connecting...)Downloading (0%)           Downloading (5%)Downloading (10%)Downloading (15%)Downloading (20%)Downloading (100%)
08-Jul-2018 23:58:11   - Installing phpunit/php-code-coverage (4.0.8): Downloading (connecting...)Downloading (0%)           Downloading (5%)Downloading (10%)Downloading (15%)Downloading (20%)Downloading (25%)Downloading (30%)Downloading (35%)Downloading (40%)Downloading (45%)Downloading (50%)Downloading (55%)Downloading (60%)Downloading (65%)Downloading (70%)Downloading (75%)Downloading (80%)Downloading (85%)Downloading (90%)Downloading (95%)Downloading (100%)
08-Jul-2018 23:58:11   - Installing phpspec/prophecy (1.7.5): Downloading (connecting...)Downloading (0%)           Downloading (10%)Downloading (15%)Downloading (20%)Downloading (25%)Downloading (30%)Downloading (40%)Downloading (50%)Downloading (55%)Downloading (60%)Downloading (65%)Downloading (70%)Downloading (75%)Downloading (85%)Downloading (95%)Downloading (100%)
08-Jul-2018 23:58:12   - Installing myclabs/deep-copy (1.7.0): Downloading (connecting...)Downloading (0%)           Downloading (15%)Downloading (20%)Downloading (35%)Downloading (40%)Downloading (45%)Downloading (50%)Downloading (65%)Downloading (70%)Downloading (85%)Downloading (90%)Downloading (100%)
08-Jul-2018 23:58:15   - Installing phpunit/phpunit (5.7.26): Downloading (connecting...)Downloading (0%)           Downloading (5%)Downloading (10%)Downloading (15%)Downloading (20%)Downloading (25%)Downloading (30%)Downloading (35%)Downloading (40%)Downloading (45%)Downloading (50%)Downloading (55%)Downloading (60%)Downloading (65%)Downloading (70%)Downloading (75%)Downloading (80%)Downloading (85%)Downloading (90%)Downloading (95%)Downloading (100%)
08-Jul-2018 23:58:15   - Installing phpunit/dbunit (2.0.3): Downloading (connecting...)Downloading (0%)           Downloading (5%)Downloading (10%)Downloading (15%)Downloading (20%)Downloading (25%)Downloading (30%)Downloading (35%)Downloading (40%)Downloading (45%)Downloading (50%)Downloading (55%)Downloading (60%)Downloading (65%)Downloading (70%)Downloading (75%)Downloading (80%)Downloading (85%)Downloading (90%)Downloading (95%)Downloading (100%)
08-Jul-2018 23:58:16   - Installing squizlabs/php_codesniffer (2.9.1): Downloading (connecting...)Downloading (0%)           Downloading (5%)Downloading (10%)Downloading (15%)Downloading (20%)Downloading (25%)Downloading (30%)Downloading (35%)Downloading (40%)Downloading (45%)Downloading (50%)Downloading (55%)Downloading (60%)Downloading (65%)Downloading (70%)Downloading (75%)Downloading (80%)Downloading (85%)Downloading (90%)Downloading (95%)Downloading (100%)
08-Jul-2018 23:58:17 symfony/console suggests installing symfony/lock ()
08-Jul-2018 23:58:17 lusitanian/oauth suggests installing predis/predis (Allows using the Redis storage backend.)
08-Jul-2018 23:58:17 patchwork/utf8 suggests installing ext-intl (Use Intl for best performance)
08-Jul-2018 23:58:17 patchwork/utf8 suggests installing ext-wfio (Use WFIO for UTF-8 filesystem access on Windows)
08-Jul-2018 23:58:17 s9e/text-formatter suggests installing ext-intl (Allows international URLs to be accepted by the URL filter)
08-Jul-2018 23:58:17 s9e/text-formatter suggests installing ext-xsl (Enables the XSLT renderer)
08-Jul-2018 23:58:17 paragonie/random_compat suggests installing ext-libsodium (Provides a modern crypto API that can be used to generate random bytes.)
08-Jul-2018 23:58:17 symfony/http-kernel suggests installing symfony/var-dumper ()
08-Jul-2018 23:58:17 symfony/dependency-injection suggests installing symfony/expression-language (For using expressions in service container configuration)
08-Jul-2018 23:58:17 zendframework/zend-eventmanager suggests installing container-interop/container-interop (^1.1.0, to use the lazy listeners feature)
08-Jul-2018 23:58:17 zendframework/zend-eventmanager suggests installing zendframework/zend-stdlib (^2.7.3 || ^3.0, to use the FilterChain feature)
08-Jul-2018 23:58:17 zendframework/zend-code suggests installing doctrine/annotations (Doctrine\Common\Annotations >=1.0 for annotation features)
08-Jul-2018 23:58:17 zendframework/zend-code suggests installing zendframework/zend-stdlib (Zend\Stdlib component)
08-Jul-2018 23:58:17 ocramius/proxy-manager suggests installing ocramius/generated-hydrator (To have very fast object to array to object conversion for ghost objects)
08-Jul-2018 23:58:17 ocramius/proxy-manager suggests installing zendframework/zend-json (To have the JsonRpc adapter (Remote Object feature))
08-Jul-2018 23:58:17 ocramius/proxy-manager suggests installing zendframework/zend-soap (To have the Soap adapter (Remote Object feature))
08-Jul-2018 23:58:17 ocramius/proxy-manager suggests installing zendframework/zend-stdlib (To use the hydrator proxy)
08-Jul-2018 23:58:17 ocramius/proxy-manager suggests installing zendframework/zend-xmlrpc (To have the XmlRpc adapter (Remote Object feature))
08-Jul-2018 23:58:17 symfony/routing suggests installing doctrine/annotations (For using the annotation loader)
08-Jul-2018 23:58:17 symfony/routing suggests installing symfony/expression-language (For using expression matching)
08-Jul-2018 23:58:17 symfony/twig-bridge suggests installing symfony/asset (For using the AssetExtension)
08-Jul-2018 23:58:17 symfony/twig-bridge suggests installing symfony/expression-language (For using the ExpressionExtension)
08-Jul-2018 23:58:17 symfony/twig-bridge suggests installing symfony/form (For using the FormExtension)
08-Jul-2018 23:58:17 symfony/twig-bridge suggests installing symfony/security (For using the SecurityExtension)
08-Jul-2018 23:58:17 symfony/twig-bridge suggests installing symfony/stopwatch (For using the StopwatchExtension)
08-Jul-2018 23:58:17 symfony/twig-bridge suggests installing symfony/templating (For using the TwigEngine)
08-Jul-2018 23:58:17 symfony/twig-bridge suggests installing symfony/translation (For using the TranslationExtension)
08-Jul-2018 23:58:17 symfony/twig-bridge suggests installing symfony/var-dumper (For using the DumpExtension)
08-Jul-2018 23:58:17 symfony/twig-bridge suggests installing symfony/web-link (For using the WebLinkExtension)
08-Jul-2018 23:58:17 sebastian/global-state suggests installing ext-uopz (*)
08-Jul-2018 23:58:17 phpunit/phpunit-mock-objects suggests installing ext-soap (*)
08-Jul-2018 23:58:17 phpunit/phpunit suggests installing phpunit/php-invoker (~1.1)
08-Jul-2018 23:58:17 Generating autoload files
08-Jul-2018 23:58:17 Buildfile: /data/build/build.xml
08-Jul-2018 23:58:18
08-Jul-2018 23:58:18 phpBB > clean:
08-Jul-2018 23:58:18
08-Jul-2018 23:58:18    [delete] Directory /data/build/logs does not exist or is not a directory.
08-Jul-2018 23:58:18    [delete] Directory /data/build/api does not exist or is not a directory.
08-Jul-2018 23:58:18    [delete] Directory /data/build/codebrowser does not exist or is not a directory.
08-Jul-2018 23:58:18    [delete] Directory /data/build/coverage does not exist or is not a directory.
08-Jul-2018 23:58:18    [delete] Directory /data/build/cpd does not exist or is not a directory.
08-Jul-2018 23:58:18    [delete] Directory /data/build/dependencies does not exist or is not a directory.
08-Jul-2018 23:58:18    [delete] Directory /data/build/new_version does not exist or is not a directory.
08-Jul-2018 23:58:18    [delete] Directory /data/build/old_versions does not exist or is not a directory.
08-Jul-2018 23:58:18    [delete] Directory /data/build/save does not exist or is not a directory.
08-Jul-2018 23:58:18
08-Jul-2018 23:58:18 phpBB > prepare:
08-Jul-2018 23:58:18
08-Jul-2018 23:58:18     [mkdir] Created dir: /data/build/logs
08-Jul-2018 23:58:18     [mkdir] Created dir: /data/build/api
08-Jul-2018 23:58:18     [mkdir] Created dir: /data/build/codebrowser
08-Jul-2018 23:58:18     [mkdir] Created dir: /data/build/coverage
08-Jul-2018 23:58:18     [mkdir] Created dir: /data/build/cpd
08-Jul-2018 23:58:18     [mkdir] Created dir: /data/build/dependencies
08-Jul-2018 23:58:18     [mkdir] Created dir: /data/build/new_version
08-Jul-2018 23:58:18     [mkdir] Created dir: /data/build/new_version/files
08-Jul-2018 23:58:18     [mkdir] Created dir: /data/build/new_version/patches
08-Jul-2018 23:58:18     [mkdir] Created dir: /data/build/new_version/release_files
08-Jul-2018 23:58:18     [mkdir] Created dir: /data/build/new_version/update
08-Jul-2018 23:58:18     [mkdir] Created dir: /data/build/old_versions
08-Jul-2018 23:58:18     [mkdir] Created dir: /data/build/save
08-Jul-2018 23:58:18
08-Jul-2018 23:58:18 BUILD FINISHED
08-Jul-2018 23:58:18
08-Jul-2018 23:58:18 Total time: 0.1028 seconds
08-Jul-2018 23:58:18
08-Jul-2018 23:58:18 Finished task 'Prepare directory' with result: Success
08-Jul-2018 23:58:18 Skipping execution of task 'Run sniffs' as it is disabled
08-Jul-2018 23:58:18
Substituting variable: ${bamboo.working.directory} with /home/bamboo/xml-data/build-dir/PHPBB3-PR-JOB1
08-Jul-2018 23:58:18 Starting task 'Run sniffs' of type 'com.atlassian.bamboo.plugins.bamboo-docker-plugin:task.docker.cli'
08-Jul-2018 23:58:18 Running image name (phpbb:php-5.6)
08-Jul-2018 23:58:18
Beginning to execute external process for build 'phpBB3 - Pull Requests - Build and Test Job #8433 (PHPBB3-PR-JOB1-8433)'
... running command line:
/usr/bin/docker run --volume /home/bamboo/xml-data/build-dir/PHPBB3-PR-JOB1:/data --workdir /data/build --rm -u=991 phpbb:php-5.6 ../phpBB/vendor/bin/phing sniff
... in: /home/bamboo/xml-data/build-dir/PHPBB3-PR-JOB1
... using extra environment variables:
bamboo_planRepository_1_branch=3.1.x
bamboo_planRepository_1_branchDisplayName=3.1.x
bamboo_repository_revision_number=dc8ff9da28b8ab4ad11c7ea94cca526f17c87fe5
bamboo_PRref=master
bamboo_resultsUrl=https://bamboo.phpbb.com/browse/PHPBB3-PR-JOB1-8433
bamboo_capability_system_builder_command_Git=/usr/bin/git
bamboo_repository_75956235_git_username=bantu
bamboo_build_working_directory=/home/bamboo/xml-data/build-dir/PHPBB3-PR-JOB1
bamboo_planRepository_1_name=phpBB Ascraeus
bamboo_buildKey=PHPBB3-PR-JOB1
bamboo_capability_phpbb_tests=true
bamboo_shortPlanName=Pull Requests
bamboo_capability_system_builder_command_fop=/usr/bin/fop
bamboo_capability_dbms_sqlite_2=true
bamboo_planRepository_name=phpBB Ascraeus
bamboo_PRnumber=4933
bamboo_buildNumber=8433
bamboo_repository_75956235_git_repositoryUrl=https://github.com/phpbb/phpbb.git
bamboo_capability_system_builder_phpunit_PHPUnit=/usr/bin/phpunit
bamboo_shortJobName=Build and Test Job
bamboo_buildResultsUrl=https://bamboo.phpbb.com/browse/PHPBB3-PR-JOB1-8433
bamboo_repository_75956235_branch_name=3.1.x
bamboo_planRepository_repositoryUrl=https://github.com/phpbb/phpbb.git
bamboo_agentId=131073
bamboo_planName=phpBB3 - Pull Requests
bamboo_build_commandline_com_atlassian_bamboo_plugins_scripttask_task_builder_script_7=/bin/sh /home/bamboo/temp/PHPBB3-PR-JOB1-8433-ScriptBuildTask-5377002763267983732.sh
bamboo_shortPlanKey=PR
bamboo_shortJobKey=JOB1
bamboo_capability_dbms_mysql_55=true
bamboo_capability_system_jdk_JDK_1_7_0_65=/usr/lib/jvm/java-7-openjdk-amd64
bamboo_planRepository_revision=dc8ff9da28b8ab4ad11c7ea94cca526f17c87fe5
bamboo_buildTimeStamp=2018-07-08T23:56:52.837Z
bamboo_repository_previous_revision_number=dc8ff9da28b8ab4ad11c7ea94cca526f17c87fe5
bamboo_capability_system_jdk_JDK_1_6_0_16=/usr/lib/jvm/java-6-sun-1.6.0.16
bamboo_capability_system_builder_mvn2_Maven_2=/usr/share/maven2
bamboo_planRepository_previousRevision=dc8ff9da28b8ab4ad11c7ea94cca526f17c87fe5
bamboo_build_commandline_com_atlassian_bamboo_plugins_scripttask_task_builder_script_4=/bin/sh /home/bamboo/temp/PHPBB3-PR-JOB1-8433-ScriptBuildTask-2219516323225442804.sh
bamboo_repository_git_branch=3.1.x
bamboo_buildResultKey=PHPBB3-PR-JOB1-8433
bamboo_repository_branch_name=3.1.x
bamboo_buildPlanName=phpBB3 - Pull Requests - Build and Test Job
bamboo_planRepository_1_revision=dc8ff9da28b8ab4ad11c7ea94cca526f17c87fe5
bamboo_repository_name=phpBB Ascraeus
bamboo_buildFailed=false
bamboo_capability_system_docker_executable=/usr/bin/docker
bamboo_build_commandline_com_atlassian_bamboo_plugins_bamboo_docker_plugin_task_docker_cli_12=/usr/bin/docker run --volume /home/bamboo/xml-data/build-dir/PHPBB3-PR-JOB1:/data --workdir /data/phpBB --rm -e HOME=/home/bamboo -u=991 phpbb:php-5.6 /bin/bash -c php ../composer.phar install --dev; cd ../build; ../phpBB/vendor/bin/phing clean prepare
bamboo_planRepository_branch=3.1.x
bamboo_agentWorkingDirectory=/home/bamboo/xml-data/build-dir
bamboo_capability_system_git_executable=/usr/bin/git
bamboo_capability_system_builder_phpunit_PHPUnit_3_4=/usr/bin/phpunit
bamboo_repository_git_username=bantu
bamboo_planRepository_1_previousRevision=dc8ff9da28b8ab4ad11c7ea94cca526f17c87fe5
bamboo_repository_75956235_revision_number=dc8ff9da28b8ab4ad11c7ea94cca526f17c87fe5
bamboo_planRepository_branchDisplayName=3.1.x
bamboo_planRepository_1_type=gitv2
bamboo_planRepository_branchName=3.1.x
bamboo_repository_75956235_previous_revision_number=dc8ff9da28b8ab4ad11c7ea94cca526f17c87fe5
bamboo_capability_system_jdk_JDK=/usr/lib/jvm/java-6-sun
bamboo_plan_storageTag=PHPBB3-PR
bamboo_hg_cache_directory=/home/bamboo/xml-data/build-dir/_hg-repositories-cache
bamboo_planRepository_1_username=bantu
bamboo_planRepository_type=gitv2
bamboo_git_cache_directory=/home/bamboo/xml-data/build-dir/_git-repositories-cache
bamboo_ManualBuildTriggerReason_userName=Build Robot
bamboo_repository_git_repositoryUrl=https://github.com/phpbb/phpbb.git
bamboo_repository_75956235_git_branch=3.1.x
bamboo_capability_system_builder_ant_Ant=/usr/share/ant
bamboo_repository_75956235_name=phpBB Ascraeus
bamboo_tmp_directory=/home/bamboo/temp
bamboo_working_directory=/home/bamboo/xml-data/build-dir/PHPBB3-PR-JOB1
bamboo_planKey=PHPBB3-PR
bamboo_capability_local=true
bamboo_planRepository_1_repositoryUrl=https://github.com/phpbb/phpbb.git
bamboo_planRepository_username=bantu
bamboo_capability_system_jdk_JDK_1_6=/usr/lib/jvm/java-6-sun
bamboo_capability_system_jdk_JDK_1_7=/usr/lib/jvm/java-7-openjdk-amd64
bamboo_planRepository_1_branchName=3.1.x
08-Jul-2018 23:58:18 Buildfile: /data/build/build.xml
08-Jul-2018 23:58:18
08-Jul-2018 23:58:18 phpBB > sniff:
08-Jul-2018 23:58:18
08-Jul-2018 23:58:25 ............................................................  60 / 754 (8%)
08-Jul-2018 23:58:26 ............................................................ 120 / 754 (16%)
08-Jul-2018 23:58:27 ............................................................ 180 / 754 (24%)
08-Jul-2018 23:58:28 ............................................................ 240 / 754 (32%)
08-Jul-2018 23:58:31 ............................................................ 300 / 754 (40%)
08-Jul-2018 23:58:36 ............................................................ 360 / 754 (48%)
08-Jul-2018 23:58:42 ............................................................ 420 / 754 (56%)
08-Jul-2018 23:58:45 ............................................................ 480 / 754 (64%)
08-Jul-2018 23:58:49 ............................................................ 540 / 754 (72%)
08-Jul-2018 23:58:52 ............................................................ 600 / 754 (80%)
08-Jul-2018 23:58:57 ............................................................ 660 / 754 (88%)
08-Jul-2018 23:59:00 ............................................................ 720 / 754 (95%)
08-Jul-2018 23:59:01 ..................................
08-Jul-2018 23:59:01
08-Jul-2018 23:59:01 Time: 42.57 secs; Memory: 64Mb
08-Jul-2018 23:59:01
08-Jul-2018 23:59:09 ............................................................  60 / 209 (29%)
08-Jul-2018 23:59:27 ............................................................ 120 / 209 (57%)
08-Jul-2018 23:59:39 ............................................................ 180 / 209 (86%)
08-Jul-2018 23:59:47 .............................
08-Jul-2018 23:59:47
08-Jul-2018 23:59:47 Time: 46.26 secs; Memory: 60.75Mb
08-Jul-2018 23:59:47
08-Jul-2018 23:59:47
08-Jul-2018 23:59:47
08-Jul-2018 23:59:47 Time: 18ms; Memory: 3.75Mb
08-Jul-2018 23:59:47
08-Jul-2018 23:59:47
08-Jul-2018 23:59:47 BUILD FINISHED
08-Jul-2018 23:59:47
08-Jul-2018 23:59:47 Total time: 1 minutes  29.15 seconds
08-Jul-2018 23:59:47
08-Jul-2018 23:59:47 Finished task 'Run sniffs' with result: Success
08-Jul-2018 23:59:47 Skipping execution of task 'Run tests' as it is disabled
08-Jul-2018 23:59:47
Substituting variable: ${bamboo.working.directory} with /home/bamboo/xml-data/build-dir/PHPBB3-PR-JOB1
08-Jul-2018 23:59:47 Starting task 'Run tests' of type 'com.atlassian.bamboo.plugins.bamboo-docker-plugin:task.docker.cli'
08-Jul-2018 23:59:47 Running image name (phpbb:php-5.6)
08-Jul-2018 23:59:47
Beginning to execute external process for build 'phpBB3 - Pull Requests - Build and Test Job #8433 (PHPBB3-PR-JOB1-8433)'
... running command line:
/usr/bin/docker run --volume /home/bamboo/xml-data/build-dir/PHPBB3-PR-JOB1:/data --workdir /data --rm -u=991 -t phpbb:php-5.6 /bin/bash -c phpBB/vendor/bin/phpunit --log-junit build/logs/phpunit.xml
... in: /home/bamboo/xml-data/build-dir/PHPBB3-PR-JOB1
... using extra environment variables:
bamboo_planRepository_1_branch=3.1.x
bamboo_planRepository_1_branchDisplayName=3.1.x
bamboo_repository_revision_number=dc8ff9da28b8ab4ad11c7ea94cca526f17c87fe5
bamboo_PRref=master
bamboo_resultsUrl=https://bamboo.phpbb.com/browse/PHPBB3-PR-JOB1-8433
bamboo_capability_system_builder_command_Git=/usr/bin/git
bamboo_repository_75956235_git_username=bantu
bamboo_build_working_directory=/home/bamboo/xml-data/build-dir/PHPBB3-PR-JOB1
bamboo_planRepository_1_name=phpBB Ascraeus
bamboo_buildKey=PHPBB3-PR-JOB1
bamboo_capability_phpbb_tests=true
bamboo_shortPlanName=Pull Requests
bamboo_capability_system_builder_command_fop=/usr/bin/fop
bamboo_capability_dbms_sqlite_2=true
bamboo_planRepository_name=phpBB Ascraeus
bamboo_PRnumber=4933
bamboo_buildNumber=8433
bamboo_repository_75956235_git_repositoryUrl=https://github.com/phpbb/phpbb.git
bamboo_capability_system_builder_phpunit_PHPUnit=/usr/bin/phpunit
bamboo_shortJobName=Build and Test Job
bamboo_buildResultsUrl=https://bamboo.phpbb.com/browse/PHPBB3-PR-JOB1-8433
bamboo_repository_75956235_branch_name=3.1.x
bamboo_planRepository_repositoryUrl=https://github.com/phpbb/phpbb.git
bamboo_agentId=131073
bamboo_planName=phpBB3 - Pull Requests
bamboo_build_commandline_com_atlassian_bamboo_plugins_scripttask_task_builder_script_7=/bin/sh /home/bamboo/temp/PHPBB3-PR-JOB1-8433-ScriptBuildTask-5377002763267983732.sh
bamboo_shortPlanKey=PR
bamboo_shortJobKey=JOB1
bamboo_capability_dbms_mysql_55=true
bamboo_capability_system_jdk_JDK_1_7_0_65=/usr/lib/jvm/java-7-openjdk-amd64
bamboo_planRepository_revision=dc8ff9da28b8ab4ad11c7ea94cca526f17c87fe5
bamboo_buildTimeStamp=2018-07-08T23:56:52.837Z
bamboo_repository_previous_revision_number=dc8ff9da28b8ab4ad11c7ea94cca526f17c87fe5
bamboo_capability_system_jdk_JDK_1_6_0_16=/usr/lib/jvm/java-6-sun-1.6.0.16
bamboo_capability_system_builder_mvn2_Maven_2=/usr/share/maven2
bamboo_planRepository_previousRevision=dc8ff9da28b8ab4ad11c7ea94cca526f17c87fe5
bamboo_build_commandline_com_atlassian_bamboo_plugins_scripttask_task_builder_script_4=/bin/sh /home/bamboo/temp/PHPBB3-PR-JOB1-8433-ScriptBuildTask-2219516323225442804.sh
bamboo_repository_git_branch=3.1.x
bamboo_buildResultKey=PHPBB3-PR-JOB1-8433
bamboo_repository_branch_name=3.1.x
bamboo_buildPlanName=phpBB3 - Pull Requests - Build and Test Job
bamboo_planRepository_1_revision=dc8ff9da28b8ab4ad11c7ea94cca526f17c87fe5
bamboo_repository_name=phpBB Ascraeus
bamboo_buildFailed=false
bamboo_capability_system_docker_executable=/usr/bin/docker
bamboo_build_commandline_com_atlassian_bamboo_plugins_bamboo_docker_plugin_task_docker_cli_11=/usr/bin/docker run --volume /home/bamboo/xml-data/build-dir/PHPBB3-PR-JOB1:/data --workdir /data/build --rm -u=991 phpbb:php-5.6 ../phpBB/vendor/bin/phing sniff
bamboo_build_commandline_com_atlassian_bamboo_plugins_bamboo_docker_plugin_task_docker_cli_12=/usr/bin/docker run --volume /home/bamboo/xml-data/build-dir/PHPBB3-PR-JOB1:/data --workdir /data/phpBB --rm -e HOME=/home/bamboo -u=991 phpbb:php-5.6 /bin/bash -c php ../composer.phar install --dev; cd ../build; ../phpBB/vendor/bin/phing clean prepare
bamboo_planRepository_branch=3.1.x
bamboo_agentWorkingDirectory=/home/bamboo/xml-data/build-dir
bamboo_capability_system_git_executable=/usr/bin/git
bamboo_capability_system_builder_phpunit_PHPUnit_3_4=/usr/bin/phpunit
bamboo_repository_git_username=bantu
bamboo_planRepository_1_previousRevision=dc8ff9da28b8ab4ad11c7ea94cca526f17c87fe5
bamboo_repository_75956235_revision_number=dc8ff9da28b8ab4ad11c7ea94cca526f17c87fe5
bamboo_planRepository_branchDisplayName=3.1.x
bamboo_planRepository_1_type=gitv2
bamboo_planRepository_branchName=3.1.x
bamboo_repository_75956235_previous_revision_number=dc8ff9da28b8ab4ad11c7ea94cca526f17c87fe5
bamboo_capability_system_jdk_JDK=/usr/lib/jvm/java-6-sun
bamboo_plan_storageTag=PHPBB3-PR
bamboo_hg_cache_directory=/home/bamboo/xml-data/build-dir/_hg-repositories-cache
bamboo_planRepository_1_username=bantu
bamboo_planRepository_type=gitv2
bamboo_git_cache_directory=/home/bamboo/xml-data/build-dir/_git-repositories-cache
bamboo_ManualBuildTriggerReason_userName=Build Robot
bamboo_repository_git_repositoryUrl=https://github.com/phpbb/phpbb.git
bamboo_repository_75956235_git_branch=3.1.x
bamboo_capability_system_builder_ant_Ant=/usr/share/ant
bamboo_repository_75956235_name=phpBB Ascraeus
bamboo_tmp_directory=/home/bamboo/temp
bamboo_working_directory=/home/bamboo/xml-data/build-dir/PHPBB3-PR-JOB1
bamboo_planKey=PHPBB3-PR
bamboo_capability_local=true
bamboo_planRepository_1_repositoryUrl=https://github.com/phpbb/phpbb.git
bamboo_planRepository_username=bantu
bamboo_capability_system_jdk_JDK_1_6=/usr/lib/jvm/java-6-sun
bamboo_capability_system_jdk_JDK_1_7=/usr/lib/jvm/java-7-openjdk-amd64
bamboo_planRepository_1_branchName=3.1.x
08-Jul-2018 23:59:49
08-Jul-2018 23:59:49 Parse error: syntax error, unexpected '{', expecting function (T_FUNCTION) in /data/phpBB/phpbb/db/driver/driver.php on line 111
08-Jul-2018 23:59:49
08-Jul-2018 23:59:49 Call Stack:
08-Jul-2018 23:59:49     0.0002     230792   1. {main}() /data/phpBB/vendor/phpunit/phpunit/phpunit:0
08-Jul-2018 23:59:49     0.0091    1302776   2. PHPUnit_TextUI_Command::main() /data/phpBB/vendor/phpunit/phpunit/phpunit:52
08-Jul-2018 23:59:49     0.0091    1303512   3. PHPUnit_TextUI_Command->run() /data/phpBB/vendor/phpunit/phpunit/src/TextUI/Command.php:116
08-Jul-2018 23:59:49     0.0091    1306736   4. PHPUnit_TextUI_Command->handleArguments() /data/phpBB/vendor/phpunit/phpunit/src/TextUI/Command.php:127
08-Jul-2018 23:59:49     0.0351    5513328   5. PHPUnit_Util_Configuration->getTestSuiteConfiguration() /data/phpBB/vendor/phpunit/phpunit/src/TextUI/Command.php:784
08-Jul-2018 23:59:49     0.0362    5695192   6. PHPUnit_Util_Configuration->getTestSuite() /data/phpBB/vendor/phpunit/phpunit/src/Util/Configuration.php:851
08-Jul-2018 23:59:49     0.1275    5839112   7. PHPUnit_Framework_TestSuite->addTestFiles() /data/phpBB/vendor/phpunit/phpunit/src/Util/Configuration.php:946
08-Jul-2018 23:59:49     0.9637   82373192   8. PHPUnit_Framework_TestSuite->addTestFile() /data/phpBB/vendor/phpunit/phpunit/src/Framework/TestSuite.php:393
08-Jul-2018 23:59:49     0.9647   82514408   9. PHPUnit_Framework_TestSuite->addTestSuite() /data/phpBB/vendor/phpunit/phpunit/src/Framework/TestSuite.php:367
08-Jul-2018 23:59:49     0.9647   82514672  10. PHPUnit_Framework_TestSuite->__construct() /data/phpBB/vendor/phpunit/phpunit/src/Framework/TestSuite.php:281
08-Jul-2018 23:59:49     0.9649   82735680  11. PHPUnit_Framework_TestSuite->addTestMethod() /data/phpBB/vendor/phpunit/phpunit/src/Framework/TestSuite.php:175
08-Jul-2018 23:59:49     0.9649   82736112  12. PHPUnit_Framework_TestSuite::createTest() /data/phpBB/vendor/phpunit/phpunit/src/Framework/TestSuite.php:860
08-Jul-2018 23:59:49     0.9650   82740752  13. PHPUnit_Util_Test::getProvidedData() /data/phpBB/vendor/phpunit/phpunit/src/Framework/TestSuite.php:468
08-Jul-2018 23:59:49     0.9650   82741224  14. PHPUnit_Util_Test::getDataFromDataProviderAnnotation() /data/phpBB/vendor/phpunit/phpunit/src/Util/Test.php:378
08-Jul-2018 23:59:49     0.9651   82747888  15. ReflectionMethod->invoke() /data/phpBB/vendor/phpunit/phpunit/src/Util/Test.php:450
08-Jul-2018 23:59:49     0.9651   82748040  16. phpbb_notification_submit_post_type_quote_test->submit_post_data() /data/phpBB/vendor/phpunit/phpunit/src/Util/Test.php:450
08-Jul-2018 23:59:49     0.9656   82787400  17. phpbb_test_case_helpers->set_s9e_services() /data/tests/notification/submit_post_type_quote_test.php:55
08-Jul-2018 23:59:49     0.9689   83149856  18. PHPUnit_Framework_MockObject_MockBuilder->getMock() /data/tests/test_framework/phpbb_test_case_helpers.php:395
08-Jul-2018 23:59:49     0.9689   83150256  19. PHPUnit_Framework_MockObject_Generator->getMock() /data/phpBB/vendor/phpunit/phpunit-mock-objects/src/Framework/MockObject/MockBuilder.php:118
08-Jul-2018 23:59:49     0.9689   83150304  20. class_exists() /data/phpBB/vendor/phpunit/phpunit-mock-objects/src/Framework/MockObject/Generator.php:201
08-Jul-2018 23:59:49     0.9689   83150584  21. spl_autoload_call() /data/phpBB/vendor/phpunit/phpunit-mock-objects/src/Framework/MockObject/Generator.php:201
08-Jul-2018 23:59:49     0.9690   83150784  22. phpbb\class_loader->load_class() /data/phpBB/vendor/phpunit/phpunit-mock-objects/src/Framework/MockObject/Generator.php:201
08-Jul-2018 23:59:49
08-Jul-2018 23:59:49 Error occurred while running Task 'Run tests(10)' of type com.atlassian.bamboo.plugins.bamboo-docker-plugin:task.docker.cli.
08-Jul-2018 23:59:49 com.atlassian.bamboo.task.TaskException: Failed to execute task
08-Jul-2018 23:59:49         at com.atlassian.bamboo.plugins.docker.service.RunService.execute(RunService.java:75)
08-Jul-2018 23:59:49         at com.atlassian.bamboo.plugins.docker.tasks.cli.DockerCliTask.execute(DockerCliTask.java:70)
08-Jul-2018 23:59:49         at com.atlassian.bamboo.task.TaskExecutorImpl.lambda$executeTasks$3(TaskExecutorImpl.java:285)
08-Jul-2018 23:59:49         at com.atlassian.bamboo.task.TaskExecutorImpl.executeTaskWithPrePostActions(TaskExecutorImpl.java:224)
08-Jul-2018 23:59:49         at com.atlassian.bamboo.task.TaskExecutorImpl.executeTasks(TaskExecutorImpl.java:285)
08-Jul-2018 23:59:49         at com.atlassian.bamboo.task.TaskExecutorImpl.execute(TaskExecutorImpl.java:112)
08-Jul-2018 23:59:49         at com.atlassian.bamboo.build.pipeline.tasks.ExecuteBuildTask.call(ExecuteBuildTask.java:71)
08-Jul-2018 23:59:49         at com.atlassian.bamboo.v2.build.agent.DefaultBuildAgent.executeBuildPhase(DefaultBuildAgent.java:203)
08-Jul-2018 23:59:49         at com.atlassian.bamboo.v2.build.agent.DefaultBuildAgent.build(DefaultBuildAgent.java:175)
08-Jul-2018 23:59:49         at com.atlassian.bamboo.v2.build.agent.BuildAgentControllerImpl.lambda$waitAndPerformBuild$0(BuildAgentControllerImpl.java:122)
08-Jul-2018 23:59:49         at com.atlassian.bamboo.variable.CustomVariableContextImpl.withVariableSubstitutor(CustomVariableContextImpl.java:185)
08-Jul-2018 23:59:49         at com.atlassian.bamboo.v2.build.agent.BuildAgentControllerImpl.waitAndPerformBuild(BuildAgentControllerImpl.java:117)
08-Jul-2018 23:59:49         at com.atlassian.bamboo.v2.build.agent.DefaultBuildAgent$1.run(DefaultBuildAgent.java:126)
08-Jul-2018 23:59:49         at com.atlassian.bamboo.utils.BambooRunnables$1.run(BambooRunnables.java:48)
08-Jul-2018 23:59:49         at com.atlassian.bamboo.security.ImpersonationHelper.runWith(ImpersonationHelper.java:26)
08-Jul-2018 23:59:49         at com.atlassian.bamboo.security.ImpersonationHelper.runWithSystemAuthority(ImpersonationHelper.java:17)
08-Jul-2018 23:59:49         at com.atlassian.bamboo.security.ImpersonationHelper$1.run(ImpersonationHelper.java:41)
08-Jul-2018 23:59:49         at java.lang.Thread.run(Thread.java:748)
08-Jul-2018 23:59:49 Caused by: com.atlassian.bamboo.docker.DockerException: Error running Docker run command
08-Jul-2018 23:59:49         at com.atlassian.bamboo.docker.DockerContainerServiceImpl.run(DockerContainerServiceImpl.java:118)
08-Jul-2018 23:59:49         at sun.reflect.GeneratedMethodAccessor2553.invoke(Unknown Source)
08-Jul-2018 23:59:49         at sun.reflect.DelegatingMethodAccessorImpl.invoke(DelegatingMethodAccessorImpl.java:43)
08-Jul-2018 23:59:49         at java.lang.reflect.Method.invoke(Method.java:498)
08-Jul-2018 23:59:49         at com.atlassian.plugin.util.ContextClassLoaderSettingInvocationHandler.invoke(ContextClassLoaderSettingInvocationHandler.java:26)
08-Jul-2018 23:59:49         at com.sun.proxy.$Proxy401.run(Unknown Source)
08-Jul-2018 23:59:49         at sun.reflect.GeneratedMethodAccessor2553.invoke(Unknown Source)
08-Jul-2018 23:59:49         at sun.reflect.DelegatingMethodAccessorImpl.invoke(DelegatingMethodAccessorImpl.java:43)
08-Jul-2018 23:59:49         at java.lang.reflect.Method.invoke(Method.java:498)
08-Jul-2018 23:59:49         at org.springframework.aop.support.AopUtils.invokeJoinpointUsingReflection(AopUtils.java:302)
08-Jul-2018 23:59:49         at org.eclipse.gemini.blueprint.service.importer.support.internal.aop.ServiceInvoker.doInvoke(ServiceInvoker.java:56)
08-Jul-2018 23:59:49         at org.eclipse.gemini.blueprint.service.importer.support.internal.aop.ServiceInvoker.invoke(ServiceInvoker.java:60)
08-Jul-2018 23:59:49         at org.springframework.aop.framework.ReflectiveMethodInvocation.proceed(ReflectiveMethodInvocation.java:179)
08-Jul-2018 23:59:49         at org.springframework.aop.support.DelegatingIntroductionInterceptor.doProceed(DelegatingIntroductionInterceptor.java:133)
08-Jul-2018 23:59:49         at org.springframework.aop.support.DelegatingIntroductionInterceptor.invoke(DelegatingIntroductionInterceptor.java:121)
08-Jul-2018 23:59:49         at org.springframework.aop.framework.ReflectiveMethodInvocation.proceed(ReflectiveMethodInvocation.java:179)
08-Jul-2018 23:59:49         at org.eclipse.gemini.blueprint.service.util.internal.aop.ServiceTCCLInterceptor.invokeUnprivileged(ServiceTCCLInterceptor.java:70)
08-Jul-2018 23:59:49         at org.eclipse.gemini.blueprint.service.util.internal.aop.ServiceTCCLInterceptor.invoke(ServiceTCCLInterceptor.java:53)
08-Jul-2018 23:59:49         at org.springframework.aop.framework.ReflectiveMethodInvocation.proceed(ReflectiveMethodInvocation.java:179)
08-Jul-2018 23:59:49         at org.eclipse.gemini.blueprint.service.importer.support.LocalBundleContextAdvice.invoke(LocalBundleContextAdvice.java:57)
08-Jul-2018 23:59:49         at org.springframework.aop.framework.ReflectiveMethodInvocation.proceed(ReflectiveMethodInvocation.java:179)
08-Jul-2018 23:59:49         at org.springframework.aop.support.DelegatingIntroductionInterceptor.doProceed(DelegatingIntroductionInterceptor.java:133)
08-Jul-2018 23:59:49         at org.springframework.aop.support.DelegatingIntroductionInterceptor.invoke(DelegatingIntroductionInterceptor.java:121)
08-Jul-2018 23:59:49         at org.springframework.aop.framework.ReflectiveMethodInvocation.proceed(ReflectiveMethodInvocation.java:179)
08-Jul-2018 23:59:49         at org.springframework.aop.framework.JdkDynamicAopProxy.invoke(JdkDynamicAopProxy.java:207)
08-Jul-2018 23:59:49         at com.sun.proxy.$Proxy679.run(Unknown Source)
08-Jul-2018 23:59:49         at com.atlassian.bamboo.plugins.docker.client.DockerCmd.run(DockerCmd.java:51)
08-Jul-2018 23:59:49         at com.atlassian.bamboo.plugins.docker.service.RunService.execute(RunService.java:64)
08-Jul-2018 23:59:49         ... 17 more
08-Jul-2018 23:59:49 Caused by: com.atlassian.utils.process.ProcessException: Error executing /usr/bin/docker run --volume /home/bamboo/xml-data/build-dir/PHPBB3-PR-JOB1:/data --workdir /data --rm -u=991 -t phpbb:php-5.6 /bin/bash -c "phpBB/vendor/bin/phpunit --log-junit build/logs/phpunit.xml"
08-Jul-2018 23:59:49         at com.atlassian.bamboo.docker.DockerContainerServiceImpl.execute(DockerContainerServiceImpl.java:252)
08-Jul-2018 23:59:49         at com.atlassian.bamboo.docker.DockerContainerServiceImpl.run(DockerContainerServiceImpl.java:106)
08-Jul-2018 23:59:49         ... 44 more
08-Jul-2018 23:59:49 Starting task 'Parsing test results produced by script' of type 'com.atlassian.bamboo.plugins.testresultparser:task.testresultparser.junit'
08-Jul-2018 23:59:49 Parsing test results under /home/bamboo/xml-data/build-dir/PHPBB3-PR-JOB1...
08-Jul-2018 23:59:49 Failing task since test cases were expected but none were found.
08-Jul-2018 23:59:49 Finished task 'Parsing test results produced by script' with result: Failed
08-Jul-2018 23:59:49
Substituting variable: ${bamboo.PRnumber} with 4933
08-Jul-2018 23:59:49
Substituting variable: ${bamboo.buildResultsUrl} with https://bamboo.phpbb.com/browse/PHPBB3-PR-JOB1-8433
08-Jul-2018 23:59:49
Substituting variable: ${bamboo.buildResultsUrl} with https://bamboo.phpbb.com/browse/PHPBB3-PR-JOB1-8433
08-Jul-2018 23:59:49 Starting task 'Set result build status' of type 'com.atlassian.bamboo.plugins.scripttask:task.builder.script'
08-Jul-2018 23:59:49
Beginning to execute external process for build 'phpBB3 - Pull Requests - Build and Test Job #8433 (PHPBB3-PR-JOB1-8433)'
... running command line:
/bin/sh /home/bamboo/temp/PHPBB3-PR-JOB1-8433-ScriptBuildTask-1055560059992774155.sh
... in: /home/bamboo/xml-data/build-dir/PHPBB3-PR-JOB1
... using extra environment variables:
bamboo_planRepository_1_branch=3.1.x
bamboo_planRepository_1_branchDisplayName=3.1.x
bamboo_repository_revision_number=dc8ff9da28b8ab4ad11c7ea94cca526f17c87fe5
bamboo_PRref=master
bamboo_resultsUrl=https://bamboo.phpbb.com/browse/PHPBB3-PR-JOB1-8433
bamboo_capability_system_builder_command_Git=/usr/bin/git
bamboo_repository_75956235_git_username=bantu
bamboo_build_working_directory=/home/bamboo/xml-data/build-dir/PHPBB3-PR-JOB1
bamboo_planRepository_1_name=phpBB Ascraeus
bamboo_buildKey=PHPBB3-PR-JOB1
bamboo_capability_phpbb_tests=true
bamboo_shortPlanName=Pull Requests
bamboo_capability_system_builder_command_fop=/usr/bin/fop
bamboo_capability_dbms_sqlite_2=true
bamboo_planRepository_name=phpBB Ascraeus
bamboo_PRnumber=4933
bamboo_buildNumber=8433
bamboo_repository_75956235_git_repositoryUrl=https://github.com/phpbb/phpbb.git
bamboo_capability_system_builder_phpunit_PHPUnit=/usr/bin/phpunit
bamboo_shortJobName=Build and Test Job
bamboo_buildResultsUrl=https://bamboo.phpbb.com/browse/PHPBB3-PR-JOB1-8433
bamboo_repository_75956235_branch_name=3.1.x
bamboo_planRepository_repositoryUrl=https://github.com/phpbb/phpbb.git
bamboo_agentId=131073
bamboo_planName=phpBB3 - Pull Requests
bamboo_build_commandline_com_atlassian_bamboo_plugins_scripttask_task_builder_script_7=/bin/sh /home/bamboo/temp/PHPBB3-PR-JOB1-8433-ScriptBuildTask-5377002763267983732.sh
bamboo_shortPlanKey=PR
bamboo_shortJobKey=JOB1
bamboo_capability_dbms_mysql_55=true
bamboo_capability_system_jdk_JDK_1_7_0_65=/usr/lib/jvm/java-7-openjdk-amd64
bamboo_planRepository_revision=dc8ff9da28b8ab4ad11c7ea94cca526f17c87fe5
bamboo_buildTimeStamp=2018-07-08T23:56:52.837Z
bamboo_repository_previous_revision_number=dc8ff9da28b8ab4ad11c7ea94cca526f17c87fe5
bamboo_capability_system_jdk_JDK_1_6_0_16=/usr/lib/jvm/java-6-sun-1.6.0.16
bamboo_capability_system_builder_mvn2_Maven_2=/usr/share/maven2
bamboo_planRepository_previousRevision=dc8ff9da28b8ab4ad11c7ea94cca526f17c87fe5
bamboo_build_commandline_com_atlassian_bamboo_plugins_scripttask_task_builder_script_4=/bin/sh /home/bamboo/temp/PHPBB3-PR-JOB1-8433-ScriptBuildTask-2219516323225442804.sh
bamboo_repository_git_branch=3.1.x
bamboo_buildResultKey=PHPBB3-PR-JOB1-8433
bamboo_repository_branch_name=3.1.x
bamboo_buildPlanName=phpBB3 - Pull Requests - Build and Test Job
bamboo_planRepository_1_revision=dc8ff9da28b8ab4ad11c7ea94cca526f17c87fe5
bamboo_repository_name=phpBB Ascraeus
bamboo_buildFailed=true
bamboo_build_commandline_com_atlassian_bamboo_plugins_bamboo_docker_plugin_task_docker_cli_10=/usr/bin/docker run --volume /home/bamboo/xml-data/build-dir/PHPBB3-PR-JOB1:/data --workdir /data --rm -u=991 -t phpbb:php-5.6 /bin/bash -c phpBB/vendor/bin/phpunit --log-junit build/logs/phpunit.xml
bamboo_capability_system_docker_executable=/usr/bin/docker
bamboo_build_commandline_com_atlassian_bamboo_plugins_bamboo_docker_plugin_task_docker_cli_11=/usr/bin/docker run --volume /home/bamboo/xml-data/build-dir/PHPBB3-PR-JOB1:/data --workdir /data/build --rm -u=991 phpbb:php-5.6 ../phpBB/vendor/bin/phing sniff
bamboo_build_commandline_com_atlassian_bamboo_plugins_bamboo_docker_plugin_task_docker_cli_12=/usr/bin/docker run --volume /home/bamboo/xml-data/build-dir/PHPBB3-PR-JOB1:/data --workdir /data/phpBB --rm -e HOME=/home/bamboo -u=991 phpbb:php-5.6 /bin/bash -c php ../composer.phar install --dev; cd ../build; ../phpBB/vendor/bin/phing clean prepare
bamboo_planRepository_branch=3.1.x
bamboo_agentWorkingDirectory=/home/bamboo/xml-data/build-dir
bamboo_jobFailed=true
bamboo_capability_system_git_executable=/usr/bin/git
bamboo_capability_system_builder_phpunit_PHPUnit_3_4=/usr/bin/phpunit
bamboo_repository_git_username=bantu
bamboo_planRepository_1_previousRevision=dc8ff9da28b8ab4ad11c7ea94cca526f17c87fe5
bamboo_repository_75956235_revision_number=dc8ff9da28b8ab4ad11c7ea94cca526f17c87fe5
bamboo_planRepository_branchDisplayName=3.1.x
bamboo_planRepository_1_type=gitv2
bamboo_planRepository_branchName=3.1.x
bamboo_repository_75956235_previous_revision_number=dc8ff9da28b8ab4ad11c7ea94cca526f17c87fe5
bamboo_capability_system_jdk_JDK=/usr/lib/jvm/java-6-sun
bamboo_plan_storageTag=PHPBB3-PR
bamboo_hg_cache_directory=/home/bamboo/xml-data/build-dir/_hg-repositories-cache
bamboo_planRepository_1_username=bantu
bamboo_planRepository_type=gitv2
bamboo_git_cache_directory=/home/bamboo/xml-data/build-dir/_git-repositories-cache
bamboo_ManualBuildTriggerReason_userName=Build Robot
bamboo_repository_git_repositoryUrl=https://github.com/phpbb/phpbb.git
bamboo_repository_75956235_git_branch=3.1.x
bamboo_capability_system_builder_ant_Ant=/usr/share/ant
bamboo_repository_75956235_name=phpBB Ascraeus
bamboo_tmp_directory=/home/bamboo/temp
bamboo_working_directory=/home/bamboo/xml-data/build-dir/PHPBB3-PR-JOB1
bamboo_planKey=PHPBB3-PR
bamboo_capability_local=true
bamboo_planRepository_1_repositoryUrl=https://github.com/phpbb/phpbb.git
bamboo_planRepository_username=bantu
bamboo_capability_system_jdk_JDK_1_6=/usr/lib/jvm/java-6-sun
bamboo_capability_system_jdk_JDK_1_7=/usr/lib/jvm/java-7-openjdk-amd64
bamboo_planRepository_1_branchName=3.1.x
08-Jul-2018 23:59:49 From https://github.com/phpbb/phpbb
08-Jul-2018 23:59:49 * branch            refs/pull/4933/head -> FETCH_HEAD
08-Jul-2018 23:59:49 grep: build/logs/phpunit.xml: No such file or directory
08-Jul-2018 23:59:49 grep: build/logs/phpunit.xml: No such file or directory
08-Jul-2018 23:59:49   % Total    % Received % Xferd  Average Speed   Time    Time     Time  Current
08-Jul-2018 23:59:49                                  Dload  Upload   Total   Spent    Left  Speed
08-Jul-2018 23:59:49
08-Jul-2018 23:59:50   0     0    0     0    0     0      0      0 --:--:-- --:--:-- --:--:--     0
08-Jul-2018 23:59:50 100   273  100    93  100   180    171    332 --:--:-- --:--:-- --:--:--   332
08-Jul-2018 23:59:50 100   273  100    93  100   180    171    332 --:--:-- --:--:-- --:--:--   332
08-Jul-2018 23:59:50 Finished task 'Set result build status' with result: Success
08-Jul-2018 23:59:50 Running post build plugin 'NCover Results Collector'
08-Jul-2018 23:59:50 Running post build plugin 'Artifact Copier'
08-Jul-2018 23:59:50 Running post build plugin 'npm Cache Cleanup'
08-Jul-2018 23:59:50 Running post build plugin 'Clover Results Collector'
08-Jul-2018 23:59:50 Running post build plugin 'Docker Container Cleanup'
08-Jul-2018 23:59:50 Successfully removed working directory at '/home/bamboo/xml-data/build-dir/PHPBB3-PR-JOB1'
08-Jul-2018 23:59:50 Finalising the build...
08-Jul-2018 23:59:50 Stopping timer.
08-Jul-2018 23:59:50 Build PHPBB3-PR-JOB1-8433 completed.
08-Jul-2018 23:59:50 Running on server: post build plugin 'NCover Results Collector'
08-Jul-2018 23:59:50 Running on server: post build plugin 'Build Hanging Detection Configuration'
08-Jul-2018 23:59:50 Running on server: post build plugin 'Clover Delta Calculator'
08-Jul-2018 23:59:50 Running on server: post build plugin 'Maven Dependencies Postprocessor'
08-Jul-2018 23:59:50 All post build plugins have finished
08-Jul-2018 23:59:50 Generating build results summary...
08-Jul-2018 23:59:50 Saving build results to disk...
08-Jul-2018 23:59:50 Logging substituted variables...
08-Jul-2018 23:59:50 Indexing build results...
08-Jul-2018 23:59:50 Finished building PHPBB3-PR-JOB1-8433.
08-Jul-2018 23:59:51
Substituting variable: ${bamboo.PRnumber} with 4933