Tests pending pull requests

Build: #8645 failed

Job: Build and Test Job failed

Stages & jobs

  1. Build and Test

Build log

The build generated 361 lines of output. Download or view full build log

10-Aug-2018 11:21:33 Build phpBB3 - Pull Requests - Build and Test Job #8645 (PHPBB3-PR-JOB1-8645) started building on agent Default Agent
10-Aug-2018 11:21:33
10-Aug-2018 11:21:33 Build working directory is /home/bamboo/xml-data/build-dir/PHPBB3-PR-JOB1
10-Aug-2018 11:21:33 Executing build phpBB3 - Pull Requests - Build and Test Job #8645 (PHPBB3-PR-JOB1-8645)
10-Aug-2018 11:21:33 Starting task 'Checkout develop branch' of type 'com.atlassian.bamboo.plugins.vcs:task.vcs.checkout'
10-Aug-2018 11:21:33 Build always requires a clean checkout
10-Aug-2018 11:21:33 Cleaning build directory '/home/bamboo/xml-data/build-dir/PHPBB3-PR-JOB1'
10-Aug-2018 11:21:33 Checking out into /home/bamboo/xml-data/build-dir/PHPBB3-PR-JOB1
10-Aug-2018 11:21:33 Updating source code to revision: dc8ff9da28b8ab4ad11c7ea94cca526f17c87fe5
10-Aug-2018 11:21:33 Fetching 'refs/heads/3.1.x' from 'https://github.com/phpbb/phpbb.git'.
10-Aug-2018 11:21:35 Checking out revision dc8ff9da28b8ab4ad11c7ea94cca526f17c87fe5.
10-Aug-2018 11:21:35 Creating local git repository in '/home/bamboo/xml-data/build-dir/PHPBB3-PR-JOB1/.git'.
10-Aug-2018 11:21:35 Cloning into '/home/bamboo/xml-data/build-dir/PHPBB3-PR-JOB1'...
10-Aug-2018 11:21:35 done.
10-Aug-2018 11:21:43 Switched to a new branch '3.1.x'
10-Aug-2018 11:21:43 Branch 3.1.x set up to track remote branch 3.1.x from origin.
10-Aug-2018 11:21:43 Updated source code to revision: dc8ff9da28b8ab4ad11c7ea94cca526f17c87fe5
10-Aug-2018 11:21:43 Finished task 'Checkout develop branch' with result: Success
10-Aug-2018 11:21:43 Running pre-build action: VCS Version Collector
10-Aug-2018 11:21:43
Substituting variable: ${bamboo.PRnumber} with 5235
10-Aug-2018 11:21:43
Substituting variable: ${bamboo.buildResultsUrl} with https://bamboo.phpbb.com/browse/PHPBB3-PR-JOB1-8645
10-Aug-2018 11:21:43 Starting task 'Set pending build status' of type 'com.atlassian.bamboo.plugins.scripttask:task.builder.script'
10-Aug-2018 11:21:43
Beginning to execute external process for build 'phpBB3 - Pull Requests - Build and Test Job #8645 (PHPBB3-PR-JOB1-8645)'
... running command line:
/bin/sh /home/bamboo/temp/PHPBB3-PR-JOB1-8645-ScriptBuildTask-2951208179326564409.sh
... in: /home/bamboo/xml-data/build-dir/PHPBB3-PR-JOB1
... using extra environment variables:
bamboo_planRepository_1_branch=3.1.x
bamboo_planRepository_1_branchDisplayName=3.1.x
bamboo_repository_revision_number=dc8ff9da28b8ab4ad11c7ea94cca526f17c87fe5
bamboo_PRref=feature/gsoc-pm
bamboo_resultsUrl=https://bamboo.phpbb.com/browse/PHPBB3-PR-JOB1-8645
bamboo_capability_system_builder_command_Git=/usr/bin/git
bamboo_repository_75956235_git_username=bantu
bamboo_build_working_directory=/home/bamboo/xml-data/build-dir/PHPBB3-PR-JOB1
bamboo_planRepository_1_name=phpBB Ascraeus
bamboo_buildKey=PHPBB3-PR-JOB1
bamboo_capability_phpbb_tests=true
bamboo_shortPlanName=Pull Requests
bamboo_capability_system_builder_command_fop=/usr/bin/fop
bamboo_capability_dbms_sqlite_2=true
bamboo_planRepository_name=phpBB Ascraeus
bamboo_PRnumber=5235
bamboo_buildNumber=8645
bamboo_repository_75956235_git_repositoryUrl=https://github.com/phpbb/phpbb.git
bamboo_capability_system_builder_phpunit_PHPUnit=/usr/bin/phpunit
bamboo_shortJobName=Build and Test Job
bamboo_buildResultsUrl=https://bamboo.phpbb.com/browse/PHPBB3-PR-JOB1-8645
bamboo_repository_75956235_branch_name=3.1.x
bamboo_planRepository_repositoryUrl=https://github.com/phpbb/phpbb.git
bamboo_agentId=131073
bamboo_planName=phpBB3 - Pull Requests
bamboo_shortPlanKey=PR
bamboo_shortJobKey=JOB1
bamboo_capability_dbms_mysql_55=true
bamboo_capability_system_jdk_JDK_1_7_0_65=/usr/lib/jvm/java-7-openjdk-amd64
bamboo_planRepository_revision=dc8ff9da28b8ab4ad11c7ea94cca526f17c87fe5
bamboo_buildTimeStamp=2018-08-10T11:21:33.775Z
bamboo_repository_previous_revision_number=dc8ff9da28b8ab4ad11c7ea94cca526f17c87fe5
bamboo_capability_system_jdk_JDK_1_6_0_16=/usr/lib/jvm/java-6-sun-1.6.0.16
bamboo_capability_system_builder_mvn2_Maven_2=/usr/share/maven2
bamboo_planRepository_previousRevision=dc8ff9da28b8ab4ad11c7ea94cca526f17c87fe5
bamboo_repository_git_branch=3.1.x
bamboo_buildResultKey=PHPBB3-PR-JOB1-8645
bamboo_repository_branch_name=3.1.x
bamboo_buildPlanName=phpBB3 - Pull Requests - Build and Test Job
bamboo_planRepository_1_revision=dc8ff9da28b8ab4ad11c7ea94cca526f17c87fe5
bamboo_repository_name=phpBB Ascraeus
bamboo_buildFailed=false
bamboo_capability_system_docker_executable=/usr/bin/docker
bamboo_planRepository_branch=3.1.x
bamboo_agentWorkingDirectory=/home/bamboo/xml-data/build-dir
bamboo_capability_system_git_executable=/usr/bin/git
bamboo_capability_system_builder_phpunit_PHPUnit_3_4=/usr/bin/phpunit
bamboo_repository_git_username=bantu
bamboo_planRepository_1_previousRevision=dc8ff9da28b8ab4ad11c7ea94cca526f17c87fe5
bamboo_repository_75956235_revision_number=dc8ff9da28b8ab4ad11c7ea94cca526f17c87fe5
bamboo_planRepository_branchDisplayName=3.1.x
bamboo_planRepository_1_type=gitv2
bamboo_planRepository_branchName=3.1.x
bamboo_repository_75956235_previous_revision_number=dc8ff9da28b8ab4ad11c7ea94cca526f17c87fe5
bamboo_capability_system_jdk_JDK=/usr/lib/jvm/java-6-sun
bamboo_plan_storageTag=PHPBB3-PR
bamboo_hg_cache_directory=/home/bamboo/xml-data/build-dir/_hg-repositories-cache
bamboo_planRepository_1_username=bantu
bamboo_planRepository_type=gitv2
bamboo_git_cache_directory=/home/bamboo/xml-data/build-dir/_git-repositories-cache
bamboo_ManualBuildTriggerReason_userName=Build Robot
bamboo_repository_git_repositoryUrl=https://github.com/phpbb/phpbb.git
bamboo_repository_75956235_git_branch=3.1.x
bamboo_capability_system_builder_ant_Ant=/usr/share/ant
bamboo_repository_75956235_name=phpBB Ascraeus
bamboo_tmp_directory=/home/bamboo/temp
bamboo_working_directory=/home/bamboo/xml-data/build-dir/PHPBB3-PR-JOB1
bamboo_planKey=PHPBB3-PR
bamboo_capability_local=true
bamboo_planRepository_1_repositoryUrl=https://github.com/phpbb/phpbb.git
bamboo_planRepository_username=bantu
bamboo_capability_system_jdk_JDK_1_6=/usr/lib/jvm/java-6-sun
bamboo_capability_system_jdk_JDK_1_7=/usr/lib/jvm/java-7-openjdk-amd64
bamboo_planRepository_1_branchName=3.1.x
10-Aug-2018 11:21:45 From https://github.com/phpbb/phpbb
10-Aug-2018 11:21:45 * branch            refs/pull/5235/head -> FETCH_HEAD
10-Aug-2018 11:21:46   % Total    % Received % Xferd  Average Speed   Time    Time     Time  Current
10-Aug-2018 11:21:46                                  Dload  Upload   Total   Spent    Left  Speed
10-Aug-2018 11:21:46
10-Aug-2018 11:21:46   0     0    0     0    0     0      0      0 --:--:-- --:--:-- --:--:--     0
10-Aug-2018 11:21:46   0     0    0     0    0     0      0      0 --:--:-- --:--:-- --:--:--     0
10-Aug-2018 11:21:46 100   275  100    93  100   182    177    347 --:--:-- --:--:-- --:--:--   347
10-Aug-2018 11:21:46 Finished task 'Set pending build status' with result: Success
10-Aug-2018 11:21:46
Substituting variable: ${bamboo.PRnumber} with 5235
10-Aug-2018 11:21:46 Starting task 'Fetch PR' of type 'com.atlassian.bamboo.plugins.scripttask:task.builder.script'
10-Aug-2018 11:21:46
Beginning to execute external process for build 'phpBB3 - Pull Requests - Build and Test Job #8645 (PHPBB3-PR-JOB1-8645)'
... running command line:
/bin/sh /home/bamboo/temp/PHPBB3-PR-JOB1-8645-ScriptBuildTask-5744901830101255629.sh
... in: /home/bamboo/xml-data/build-dir/PHPBB3-PR-JOB1
... using extra environment variables:
bamboo_planRepository_1_branch=3.1.x
bamboo_planRepository_1_branchDisplayName=3.1.x
bamboo_repository_revision_number=dc8ff9da28b8ab4ad11c7ea94cca526f17c87fe5
bamboo_PRref=feature/gsoc-pm
bamboo_resultsUrl=https://bamboo.phpbb.com/browse/PHPBB3-PR-JOB1-8645
bamboo_capability_system_builder_command_Git=/usr/bin/git
bamboo_repository_75956235_git_username=bantu
bamboo_build_working_directory=/home/bamboo/xml-data/build-dir/PHPBB3-PR-JOB1
bamboo_planRepository_1_name=phpBB Ascraeus
bamboo_buildKey=PHPBB3-PR-JOB1
bamboo_capability_phpbb_tests=true
bamboo_shortPlanName=Pull Requests
bamboo_capability_system_builder_command_fop=/usr/bin/fop
bamboo_capability_dbms_sqlite_2=true
bamboo_planRepository_name=phpBB Ascraeus
bamboo_PRnumber=5235
bamboo_buildNumber=8645
bamboo_repository_75956235_git_repositoryUrl=https://github.com/phpbb/phpbb.git
bamboo_capability_system_builder_phpunit_PHPUnit=/usr/bin/phpunit
bamboo_shortJobName=Build and Test Job
bamboo_buildResultsUrl=https://bamboo.phpbb.com/browse/PHPBB3-PR-JOB1-8645
bamboo_repository_75956235_branch_name=3.1.x
bamboo_planRepository_repositoryUrl=https://github.com/phpbb/phpbb.git
bamboo_agentId=131073
bamboo_planName=phpBB3 - Pull Requests
bamboo_build_commandline_com_atlassian_bamboo_plugins_scripttask_task_builder_script_7=/bin/sh /home/bamboo/temp/PHPBB3-PR-JOB1-8645-ScriptBuildTask-2951208179326564409.sh
bamboo_shortPlanKey=PR
bamboo_shortJobKey=JOB1
bamboo_capability_dbms_mysql_55=true
bamboo_capability_system_jdk_JDK_1_7_0_65=/usr/lib/jvm/java-7-openjdk-amd64
bamboo_planRepository_revision=dc8ff9da28b8ab4ad11c7ea94cca526f17c87fe5
bamboo_buildTimeStamp=2018-08-10T11:21:33.775Z
bamboo_repository_previous_revision_number=dc8ff9da28b8ab4ad11c7ea94cca526f17c87fe5
bamboo_capability_system_jdk_JDK_1_6_0_16=/usr/lib/jvm/java-6-sun-1.6.0.16
bamboo_capability_system_builder_mvn2_Maven_2=/usr/share/maven2
bamboo_planRepository_previousRevision=dc8ff9da28b8ab4ad11c7ea94cca526f17c87fe5
bamboo_repository_git_branch=3.1.x
bamboo_buildResultKey=PHPBB3-PR-JOB1-8645
bamboo_repository_branch_name=3.1.x
bamboo_buildPlanName=phpBB3 - Pull Requests - Build and Test Job
bamboo_planRepository_1_revision=dc8ff9da28b8ab4ad11c7ea94cca526f17c87fe5
bamboo_repository_name=phpBB Ascraeus
bamboo_buildFailed=false
bamboo_capability_system_docker_executable=/usr/bin/docker
bamboo_planRepository_branch=3.1.x
bamboo_agentWorkingDirectory=/home/bamboo/xml-data/build-dir
bamboo_capability_system_git_executable=/usr/bin/git
bamboo_capability_system_builder_phpunit_PHPUnit_3_4=/usr/bin/phpunit
bamboo_repository_git_username=bantu
bamboo_planRepository_1_previousRevision=dc8ff9da28b8ab4ad11c7ea94cca526f17c87fe5
bamboo_repository_75956235_revision_number=dc8ff9da28b8ab4ad11c7ea94cca526f17c87fe5
bamboo_planRepository_branchDisplayName=3.1.x
bamboo_planRepository_1_type=gitv2
bamboo_planRepository_branchName=3.1.x
bamboo_repository_75956235_previous_revision_number=dc8ff9da28b8ab4ad11c7ea94cca526f17c87fe5
bamboo_capability_system_jdk_JDK=/usr/lib/jvm/java-6-sun
bamboo_plan_storageTag=PHPBB3-PR
bamboo_hg_cache_directory=/home/bamboo/xml-data/build-dir/_hg-repositories-cache
bamboo_planRepository_1_username=bantu
bamboo_planRepository_type=gitv2
bamboo_git_cache_directory=/home/bamboo/xml-data/build-dir/_git-repositories-cache
bamboo_ManualBuildTriggerReason_userName=Build Robot
bamboo_repository_git_repositoryUrl=https://github.com/phpbb/phpbb.git
bamboo_repository_75956235_git_branch=3.1.x
bamboo_capability_system_builder_ant_Ant=/usr/share/ant
bamboo_repository_75956235_name=phpBB Ascraeus
bamboo_tmp_directory=/home/bamboo/temp
bamboo_working_directory=/home/bamboo/xml-data/build-dir/PHPBB3-PR-JOB1
bamboo_planKey=PHPBB3-PR
bamboo_capability_local=true
bamboo_planRepository_1_repositoryUrl=https://github.com/phpbb/phpbb.git
bamboo_planRepository_username=bantu
bamboo_capability_system_jdk_JDK_1_6=/usr/lib/jvm/java-6-sun
bamboo_capability_system_jdk_JDK_1_7=/usr/lib/jvm/java-7-openjdk-amd64
bamboo_planRepository_1_branchName=3.1.x
10-Aug-2018 11:21:49 From https://github.com/phpbb/phpbb
10-Aug-2018 11:21:49 * branch            refs/pull/5235/merge -> FETCH_HEAD
10-Aug-2018 11:21:49 Note: checking out 'FETCH_HEAD'.
10-Aug-2018 11:21:49
10-Aug-2018 11:21:49 You are in 'detached HEAD' state. You can look around, make experimental
10-Aug-2018 11:21:49 changes and commit them, and you can discard any commits you make in this
10-Aug-2018 11:21:49 state without impacting any branches by performing another checkout.
10-Aug-2018 11:21:49
10-Aug-2018 11:21:49 If you want to create a new branch to retain commits you create, you may
10-Aug-2018 11:21:49 do so (now or later) by using -b with the checkout command again. Example:
10-Aug-2018 11:21:49
10-Aug-2018 11:21:49   git checkout -b new_branch_name
10-Aug-2018 11:21:49
10-Aug-2018 11:21:49 HEAD is now at 8f220f1... Merge 8789cdca44caaee65c053f7d2558968ecb5cbc7f into 1b110139888dbe5ba6338d348287e43bdc193c2a
10-Aug-2018 11:21:49 Finished task 'Fetch PR' with result: Success
10-Aug-2018 11:21:49 Skipping execution of task 'Prepare directory' as it is disabled
10-Aug-2018 11:21:49
Substituting variable: ${bamboo.working.directory} with /home/bamboo/xml-data/build-dir/PHPBB3-PR-JOB1
10-Aug-2018 11:21:49 Starting task 'Prepare directory' of type 'com.atlassian.bamboo.plugins.bamboo-docker-plugin:task.docker.cli'
10-Aug-2018 11:21:49 Running image name (phpbb:php-5.6)
10-Aug-2018 11:21:49
Beginning to execute external process for build 'phpBB3 - Pull Requests - Build and Test Job #8645 (PHPBB3-PR-JOB1-8645)'
... running command line:
/usr/bin/docker run --volume /home/bamboo/xml-data/build-dir/PHPBB3-PR-JOB1:/data --workdir /data/phpBB --rm -e HOME=/home/bamboo -u=991 phpbb:php-5.6 /bin/bash -c php ../composer.phar install --dev; cd ../build; ../phpBB/vendor/bin/phing clean prepare
... in: /home/bamboo/xml-data/build-dir/PHPBB3-PR-JOB1
... using extra environment variables:
bamboo_planRepository_1_branch=3.1.x
bamboo_planRepository_1_branchDisplayName=3.1.x
bamboo_repository_revision_number=dc8ff9da28b8ab4ad11c7ea94cca526f17c87fe5
bamboo_PRref=feature/gsoc-pm
bamboo_resultsUrl=https://bamboo.phpbb.com/browse/PHPBB3-PR-JOB1-8645
bamboo_capability_system_builder_command_Git=/usr/bin/git
bamboo_repository_75956235_git_username=bantu
bamboo_build_working_directory=/home/bamboo/xml-data/build-dir/PHPBB3-PR-JOB1
bamboo_planRepository_1_name=phpBB Ascraeus
bamboo_buildKey=PHPBB3-PR-JOB1
bamboo_capability_phpbb_tests=true
bamboo_shortPlanName=Pull Requests
bamboo_capability_system_builder_command_fop=/usr/bin/fop
bamboo_capability_dbms_sqlite_2=true
bamboo_planRepository_name=phpBB Ascraeus
bamboo_PRnumber=5235
bamboo_buildNumber=8645
bamboo_repository_75956235_git_repositoryUrl=https://github.com/phpbb/phpbb.git
bamboo_capability_system_builder_phpunit_PHPUnit=/usr/bin/phpunit
bamboo_shortJobName=Build and Test Job
bamboo_buildResultsUrl=https://bamboo.phpbb.com/browse/PHPBB3-PR-JOB1-8645
bamboo_repository_75956235_branch_name=3.1.x
bamboo_planRepository_repositoryUrl=https://github.com/phpbb/phpbb.git
bamboo_agentId=131073
bamboo_planName=phpBB3 - Pull Requests
bamboo_build_commandline_com_atlassian_bamboo_plugins_scripttask_task_builder_script_7=/bin/sh /home/bamboo/temp/PHPBB3-PR-JOB1-8645-ScriptBuildTask-2951208179326564409.sh
bamboo_shortPlanKey=PR
bamboo_shortJobKey=JOB1
bamboo_capability_dbms_mysql_55=true
bamboo_capability_system_jdk_JDK_1_7_0_65=/usr/lib/jvm/java-7-openjdk-amd64
bamboo_planRepository_revision=dc8ff9da28b8ab4ad11c7ea94cca526f17c87fe5
bamboo_buildTimeStamp=2018-08-10T11:21:33.775Z
bamboo_repository_previous_revision_number=dc8ff9da28b8ab4ad11c7ea94cca526f17c87fe5
bamboo_capability_system_jdk_JDK_1_6_0_16=/usr/lib/jvm/java-6-sun-1.6.0.16
bamboo_capability_system_builder_mvn2_Maven_2=/usr/share/maven2
bamboo_planRepository_previousRevision=dc8ff9da28b8ab4ad11c7ea94cca526f17c87fe5
bamboo_build_commandline_com_atlassian_bamboo_plugins_scripttask_task_builder_script_4=/bin/sh /home/bamboo/temp/PHPBB3-PR-JOB1-8645-ScriptBuildTask-5744901830101255629.sh
bamboo_repository_git_branch=3.1.x
bamboo_buildResultKey=PHPBB3-PR-JOB1-8645
bamboo_repository_branch_name=3.1.x
bamboo_buildPlanName=phpBB3 - Pull Requests - Build and Test Job
bamboo_planRepository_1_revision=dc8ff9da28b8ab4ad11c7ea94cca526f17c87fe5
bamboo_repository_name=phpBB Ascraeus
bamboo_buildFailed=false
bamboo_capability_system_docker_executable=/usr/bin/docker
bamboo_planRepository_branch=3.1.x
bamboo_agentWorkingDirectory=/home/bamboo/xml-data/build-dir
bamboo_capability_system_git_executable=/usr/bin/git
bamboo_capability_system_builder_phpunit_PHPUnit_3_4=/usr/bin/phpunit
bamboo_repository_git_username=bantu
bamboo_planRepository_1_previousRevision=dc8ff9da28b8ab4ad11c7ea94cca526f17c87fe5
bamboo_repository_75956235_revision_number=dc8ff9da28b8ab4ad11c7ea94cca526f17c87fe5
bamboo_planRepository_branchDisplayName=3.1.x
bamboo_planRepository_1_type=gitv2
bamboo_planRepository_branchName=3.1.x
bamboo_repository_75956235_previous_revision_number=dc8ff9da28b8ab4ad11c7ea94cca526f17c87fe5
bamboo_capability_system_jdk_JDK=/usr/lib/jvm/java-6-sun
bamboo_plan_storageTag=PHPBB3-PR
bamboo_hg_cache_directory=/home/bamboo/xml-data/build-dir/_hg-repositories-cache
bamboo_planRepository_1_username=bantu
bamboo_planRepository_type=gitv2
bamboo_git_cache_directory=/home/bamboo/xml-data/build-dir/_git-repositories-cache
bamboo_ManualBuildTriggerReason_userName=Build Robot
bamboo_repository_git_repositoryUrl=https://github.com/phpbb/phpbb.git
bamboo_repository_75956235_git_branch=3.1.x
bamboo_capability_system_builder_ant_Ant=/usr/share/ant
bamboo_repository_75956235_name=phpBB Ascraeus
bamboo_tmp_directory=/home/bamboo/temp
bamboo_working_directory=/home/bamboo/xml-data/build-dir/PHPBB3-PR-JOB1
bamboo_planKey=PHPBB3-PR
bamboo_capability_local=true
bamboo_planRepository_1_repositoryUrl=https://github.com/phpbb/phpbb.git
bamboo_planRepository_username=bantu
bamboo_capability_system_jdk_JDK_1_6=/usr/lib/jvm/java-6-sun
bamboo_capability_system_jdk_JDK_1_7=/usr/lib/jvm/java-7-openjdk-amd64
bamboo_planRepository_1_branchName=3.1.x
10-Aug-2018 11:21:51 Cannot create cache directory /home/bamboo/.composer/cache/repo/https---packagist.org/, or directory is not writable. Proceeding without cache
10-Aug-2018 11:21:51 Cannot create cache directory /home/bamboo/.composer/cache/files/, or directory is not writable. Proceeding without cache
10-Aug-2018 11:21:51 You are using the deprecated option "dev". Dev packages are installed by default now.
10-Aug-2018 11:21:51 Loading composer repositories with package information
10-Aug-2018 11:21:51 Installing dependencies (including require-dev) from lock file
10-Aug-2018 11:21:51 Package operations: 75 installs, 0 updates, 0 removals
10-Aug-2018 11:21:52   - Installing composer/installers (v1.5.0): Downloading (connecting...)Downloading (0%)           Downloading (5%)Downloading (20%)Downloading (40%)Downloading (45%)Downloading (55%)Downloading (60%)Downloading (65%)Downloading (80%)Downloading (85%)Downloading (90%)Downloading (100%)
10-Aug-2018 11:21:53   - Installing bantu/ini-get-wrapper (v1.0.1): Downloading (connecting...)Downloading (100%)         
10-Aug-2018 11:21:53   - Installing symfony/process (v3.4.3): Downloading (connecting...)Downloading (100%)         
10-Aug-2018 11:21:55   - Installing symfony/finder (v3.4.3): Downloading (connecting...)Downloading (0%)           Downloading (5%)Downloading (10%)Downloading (50%)Downloading (55%)Downloading (60%)Downloading (95%)Downloading (100%)
10-Aug-2018 11:21:55   - Installing symfony/filesystem (v3.4.3): Downloading (connecting...)Downloading (0%)           Downloading (5%)Downloading (35%)Downloading (40%)Downloading (70%)Downloading (75%)Downloading (100%)
10-Aug-2018 11:21:56   - Installing symfony/polyfill-mbstring (v1.7.0): Downloading (connecting...)Downloading (0%)           Downloading (20%)Downloading (40%)Downloading (60%)Downloading (80%)Downloading (100%)
10-Aug-2018 11:21:56   - Installing psr/log (1.0.2): Downloading (connecting...)Downloading (0%)           Downloading (15%)Downloading (100%)
10-Aug-2018 11:21:57   - Installing symfony/debug (v3.4.3): Downloading (connecting...)Downloading (100%)         
10-Aug-2018 11:21:58   - Installing symfony/console (v3.4.3): Downloading (connecting...)Downloading (100%)         
10-Aug-2018 11:21:59   - Installing seld/phar-utils (1.0.1): Downloading (connecting...)Downloading (0%)           Downloading (30%)Downloading (60%)Downloading (90%)Downloading (100%)
10-Aug-2018 11:21:59   - Installing seld/jsonlint (1.7.0): Downloading (connecting...)Downloading (100%)         
10-Aug-2018 11:22:00   - Installing seld/cli-prompt (1.0.3): Downloading (connecting...)Downloading (0%)           Downloading (15%)Downloading (30%)Downloading (100%)
10-Aug-2018 11:22:01   - Installing justinrainbow/json-schema (5.2.6): Downloading (connecting...)Downloading (0%)           Downloading (25%)Downloading (30%)Downloading (45%)Downloading (50%)Downloading (65%)Downloading (70%)Downloading (90%)Downloading (95%)Downloading (100%)
10-Aug-2018 11:22:01   - Installing composer/spdx-licenses (1.2.0): Downloading (connecting...)Downloading (100%)         
10-Aug-2018 11:22:02   - Installing composer/semver (1.4.2): Downloading (connecting...)Downloading (0%)           Downloading (35%)Downloading (75%)Downloading (100%)
10-Aug-2018 11:22:03   - Installing composer/ca-bundle (1.1.0): Downloading (connecting...)Downloading (0%)           Downloading (5%)Downloading (10%)Downloading (15%)Downloading (20%)Downloading (25%)Downloading (30%)Downloading (35%)Downloading (40%)Downloading (45%)Downloading (50%)Downloading (55%)Downloading (60%)Downloading (65%)Downloading (70%)Downloading (75%)Downloading (80%)Downloading (85%)Downloading (90%)Downloading (95%)Downloading (100%)
10-Aug-2018 11:22:04   - Installing composer/composer (1.6.2): Downloading (connecting...)Downloading (100%)         
10-Aug-2018 11:22:04   - Installing google/recaptcha (1.1.3): Downloading (connecting...)Downloading (0%)           Downloading (25%)Downloading (30%)Downloading (55%)Downloading (80%)Downloading (95%)Downloading (100%)
10-Aug-2018 11:22:05   - Installing guzzlehttp/promises (v1.3.1): Downloading (connecting...)Downloading (0%)           Downloading (30%)Downloading (60%)Downloading (95%)Downloading (100%)
10-Aug-2018 11:22:06   - Installing psr/http-message (1.0.1): Downloading (connecting...)Downloading (0%)           Downloading (100%)
10-Aug-2018 11:22:06   - Installing guzzlehttp/psr7 (1.4.2): Downloading (connecting...)Downloading (0%)           Downloading (5%)Downloading (10%)Downloading (15%)Downloading (20%)Downloading (50%)Downloading (55%)Downloading (60%)Downloading (65%)Downloading (70%)Downloading (100%)
10-Aug-2018 11:22:08   - Installing lusitanian/oauth (v0.8.10): Downloading (connecting...)Downloading (100%)         
10-Aug-2018 11:22:08   - Installing marc1706/fast-image-size (v1.1.4): Downloading (connecting...)Downloading (100%)         
10-Aug-2018 11:22:09   - Installing patchwork/utf8 (v1.3.1): Downloading (connecting...)Downloading (0%)           Downloading (5%)Downloading (10%)Downloading (15%)Downloading (20%)Downloading (25%)Downloading (30%)Downloading (35%)Downloading (40%)Downloading (45%)Downloading (50%)Downloading (55%)Downloading (60%)Downloading (65%)Downloading (70%)Downloading (75%)Downloading (80%)Downloading (85%)Downloading (90%)Downloading (95%)Downloading (100%)
10-Aug-2018 11:22:10   - Installing psr/container (1.0.0): Downloading (connecting...)Downloading (0%)           Downloading (75%)Downloading (100%)
10-Aug-2018 11:22:10   - Installing s9e/text-formatter (0.13.1): Downloading (connecting...)Downloading (100%)         
10-Aug-2018 11:22:11   - Installing symfony/config (v3.4.3): Downloading (connecting...)Downloading (100%)         
10-Aug-2018 11:22:12   - Installing paragonie/random_compat (v1.4.2): Downloading (connecting...)Downloading (0%)           Downloading (10%)Downloading (35%)Downloading (45%)Downloading (55%)Downloading (80%)Downloading (90%)Downloading (100%)
10-Aug-2018 11:22:12   - Installing symfony/polyfill-php70 (v1.6.0): Downloading (connecting...)Downloading (0%)           Downloading (85%)Downloading (100%)
10-Aug-2018 11:22:14   - Installing symfony/http-foundation (v3.4.3): Downloading (connecting...)Downloading (100%)         
10-Aug-2018 11:22:15   - Installing symfony/event-dispatcher (v3.4.3): Downloading (connecting...)Downloading (0%)           Downloading (5%)Downloading (90%)Downloading (95%)Downloading (100%)
10-Aug-2018 11:22:15   - Installing symfony/http-kernel (v3.4.3): Downloading (connecting...)Downloading (100%)         
10-Aug-2018 11:22:16   - Installing symfony/dependency-injection (v3.4.3): Downloading (connecting...)Downloading (100%)         
10-Aug-2018 11:22:17   - Installing zendframework/zend-eventmanager (3.2.0): Downloading (connecting...)Downloading (0%)           Downloading (25%)Downloading (35%)Downloading (50%)Downloading (70%)Downloading (100%)
10-Aug-2018 11:22:18   - Installing zendframework/zend-code (2.6.3): Downloading (connecting...)Downloading (0%)           Downloading (5%)Downloading (10%)Downloading (15%)Downloading (20%)Downloading (25%)Downloading (30%)Downloading (35%)Downloading (40%)Downloading (45%)Downloading (50%)Downloading (55%)Downloading (60%)Downloading (65%)Downloading (75%)Downloading (80%)Downloading (85%)Downloading (90%)Downloading (95%)Downloading (100%)
10-Aug-2018 11:22:18   - Installing ocramius/proxy-manager (1.0.2): Downloading (connecting...)Downloading (0%)           Downloading (5%)Downloading (10%)Downloading (15%)Downloading (20%)Downloading (25%)Downloading (30%)Downloading (35%)Downloading (40%)Downloading (45%)Downloading (50%)Downloading (55%)Downloading (60%)Downloading (70%)Downloading (75%)Downloading (85%)Downloading (90%)Downloading (100%)
10-Aug-2018 11:22:19   - Installing symfony/proxy-manager-bridge (v3.4.3): Downloading (connecting...)Downloading (100%)         
10-Aug-2018 11:22:20   - Installing symfony/routing (v3.4.3): Downloading (connecting...)Downloading (100%)         
10-Aug-2018 11:22:20   - Installing twig/twig (v1.35.0): Downloading (connecting...)Downloading (0%)           Downloading (5%)Downloading (10%)Downloading (15%)Downloading (20%)Downloading (25%)Downloading (30%)Downloading (35%)Downloading (40%)Downloading (45%)Downloading (50%)Downloading (55%)Downloading (65%)Downloading (70%)Downloading (80%)Downloading (85%)Downloading (95%)Downloading (100%)
10-Aug-2018 11:22:22   - Installing symfony/twig-bridge (v3.4.3): Downloading (connecting...)Downloading (100%)         
10-Aug-2018 11:22:22   - Installing symfony/dom-crawler (v3.4.3): Downloading (connecting...)Downloading (100%)         
10-Aug-2018 11:22:23   - Installing symfony/css-selector (v3.4.3): Downloading (connecting...)Downloading (100%)         
10-Aug-2018 11:22:24   - Installing symfony/browser-kit (v3.4.3): Downloading (connecting...)Downloading (0%)           Downloading (5%)Downloading (70%)Downloading (100%)
10-Aug-2018 11:22:24   - Installing guzzlehttp/guzzle (6.3.0): Downloading (connecting...)Downloading (0%)           Downloading (5%)Downloading (10%)Downloading (20%)Downloading (25%)Downloading (35%)Downloading (40%)Downloading (50%)Downloading (55%)Downloading (65%)Downloading (70%)Downloading (80%)Downloading (85%)Downloading (90%)Downloading (100%)
10-Aug-2018 11:22:25   - Installing fabpot/goutte (v3.2.2): Downloading (connecting...)Downloading (0%)           Downloading (55%)Downloading (90%)Downloading (100%)
10-Aug-2018 11:22:26   - Installing facebook/webdriver (1.5.0): Downloading (connecting...)Downloading (0%)           Downloading (5%)Downloading (10%)Downloading (15%)Downloading (20%)Downloading (25%)Downloading (30%)Downloading (35%)Downloading (40%)Downloading (45%)Downloading (50%)Downloading (55%)Downloading (60%)Downloading (65%)Downloading (70%)Downloading (75%)Downloading (80%)Downloading (85%)Downloading (90%)Downloading (95%)Downloading (100%)
10-Aug-2018 11:22:27   - Installing laravel/homestead (v4.0.5): Downloading (connecting...)Downloading (100%)         
10-Aug-2018 11:22:28   - Installing phing/phing (2.4.14): Downloading (connecting...)Downloading (100%)         
10-Aug-2018 11:22:29   - Installing webmozart/assert (1.2.0): Downloading (connecting...)Downloading (0%)           Downloading (55%)Downloading (75%)Downloading (95%)Downloading (100%)
10-Aug-2018 11:22:29   - Installing phpdocumentor/reflection-common (1.0.1): Downloading (connecting...)Downloading (0%)           Downloading (100%)
10-Aug-2018 11:22:30   - Installing phpdocumentor/type-resolver (0.4.0): Downloading (connecting...)Downloading (0%)           Downloading (5%)Downloading (80%)Downloading (85%)Downloading (90%)Downloading (100%)
10-Aug-2018 11:22:31   - Installing phpdocumentor/reflection-docblock (3.3.2): Downloading (connecting...)Downloading (0%)           Downloading (5%)Downloading (10%)Downloading (15%)Downloading (45%)Downloading (50%)Downloading (55%)Downloading (60%)Downloading (65%)Downloading (70%)Downloading (75%)Downloading (100%)
10-Aug-2018 11:22:31   - Installing symfony/yaml (v3.4.3): Downloading (connecting...)Downloading (100%)         
10-Aug-2018 11:22:32   - Installing sebastian/version (2.0.1): Downloading (connecting...)Downloading (0%)           Downloading (100%)
10-Aug-2018 11:22:33   - Installing sebastian/resource-operations (1.0.0): Downloading (connecting...)Downloading (0%)           Downloading (65%)Downloading (100%)
10-Aug-2018 11:22:33   - Installing sebastian/recursion-context (2.0.0): Downloading (connecting...)Downloading (0%)           Downloading (100%)
10-Aug-2018 11:22:33   - Installing sebastian/object-enumerator (2.0.1): Downloading (connecting...)Downloading (0%)           Downloading (95%)Downloading (100%)
10-Aug-2018 11:22:34   - Installing sebastian/global-state (1.1.1): Downloading (connecting...)Downloading (0%)           Downloading (40%)Downloading (70%)Downloading (100%)
10-Aug-2018 11:22:35   - Installing sebastian/exporter (2.0.0): Downloading (connecting...)Downloading (0%)           Downloading (100%)
10-Aug-2018 11:22:35   - Installing sebastian/environment (2.0.0): Downloading (connecting...)Downloading (0%)           Downloading (15%)Downloading (30%)Downloading (45%)Downloading (60%)Downloading (75%)Downloading (90%)Downloading (100%)
10-Aug-2018 11:22:36   - Installing sebastian/diff (1.4.3): Downloading (connecting...)Downloading (0%)           Downloading (35%)Downloading (50%)Downloading (85%)Downloading (90%)Downloading (100%)
10-Aug-2018 11:22:37   - Installing sebastian/comparator (1.2.4): Downloading (connecting...)Downloading (0%)           Downloading (10%)Downloading (45%)Downloading (55%)Downloading (65%)Downloading (70%)Downloading (100%)
10-Aug-2018 11:22:37   - Installing phpunit/php-text-template (1.2.1): Downloading (connecting...)Downloading (0%)           Downloading (35%)Downloading (100%)
10-Aug-2018 11:22:38   - Installing doctrine/instantiator (1.0.5): Downloading (connecting...)Downloading (0%)           Downloading (15%)Downloading (30%)Downloading (45%)Downloading (50%)Downloading (65%)Downloading (75%)Downloading (90%)Downloading (100%)
10-Aug-2018 11:22:38   - Installing phpunit/phpunit-mock-objects (3.4.4): Downloading (connecting...)Downloading (0%)           Downloading (5%)Downloading (10%)Downloading (15%)Downloading (20%)Downloading (30%)Downloading (35%)Downloading (40%)Downloading (45%)Downloading (50%)Downloading (55%)Downloading (60%)Downloading (65%)Downloading (70%)Downloading (80%)Downloading (85%)Downloading (90%)Downloading (95%)Downloading (100%)
10-Aug-2018 11:22:39   - Installing phpunit/php-timer (1.0.9): Downloading (connecting...)Downloading (0%)           Downloading (45%)Downloading (90%)Downloading (100%)
10-Aug-2018 11:22:40   - Installing phpunit/php-file-iterator (1.4.5): Downloading (connecting...)Downloading (0%)           Downloading (100%)
10-Aug-2018 11:22:40   - Installing sebastian/code-unit-reverse-lookup (1.0.1): Downloading (connecting...)Downloading (0%)           Downloading (55%)Downloading (100%)
10-Aug-2018 11:22:41   - Installing phpunit/php-token-stream (1.4.12): Downloading (connecting...)Downloading (0%)           Downloading (5%)Downloading (10%)Downloading (15%)Downloading (20%)Downloading (100%)
10-Aug-2018 11:22:43   - Installing phpunit/php-code-coverage (4.0.8): Downloading (connecting...)Downloading (0%)           Downloading (5%)Downloading (10%)Downloading (15%)Downloading (20%)Downloading (25%)Downloading (30%)Downloading (35%)Downloading (40%)Downloading (45%)Downloading (50%)Downloading (55%)Downloading (60%)Downloading (65%)Downloading (70%)Downloading (75%)Downloading (80%)Downloading (85%)Downloading (90%)Downloading (95%)Downloading (100%)
10-Aug-2018 11:22:43   - Installing phpspec/prophecy (1.7.5): Downloading (connecting...)Downloading (0%)           Downloading (10%)Downloading (15%)Downloading (20%)Downloading (25%)Downloading (35%)Downloading (45%)Downloading (55%)Downloading (60%)Downloading (65%)Downloading (70%)Downloading (80%)Downloading (90%)Downloading (100%)
10-Aug-2018 11:22:44   - Installing myclabs/deep-copy (1.7.0): Downloading (connecting...)Downloading (0%)           Downloading (15%)Downloading (20%)Downloading (35%)Downloading (40%)Downloading (55%)Downloading (60%)Downloading (85%)Downloading (90%)Downloading (100%)
10-Aug-2018 11:22:46   - Installing phpunit/phpunit (5.7.26): Downloading (connecting...)Downloading (0%)           Downloading (5%)Downloading (10%)Downloading (15%)Downloading (20%)Downloading (25%)Downloading (30%)Downloading (35%)Downloading (40%)Downloading (45%)Downloading (50%)Downloading (55%)Downloading (60%)Downloading (65%)Downloading (70%)Downloading (75%)Downloading (80%)Downloading (85%)Downloading (90%)Downloading (95%)Downloading (100%)
10-Aug-2018 11:22:47   - Installing phpunit/dbunit (2.0.3): Downloading (connecting...)Downloading (100%)         
10-Aug-2018 11:22:48   - Installing squizlabs/php_codesniffer (2.9.1): Downloading (connecting...)Downloading (0%)           Downloading (5%)Downloading (10%)Downloading (15%)Downloading (20%)Downloading (25%)Downloading (30%)Downloading (35%)Downloading (40%)Downloading (45%)Downloading (50%)Downloading (55%)Downloading (60%)Downloading (65%)Downloading (70%)Downloading (75%)Downloading (80%)Downloading (85%)Downloading (90%)Downloading (95%)Downloading (100%)
10-Aug-2018 11:22:48 symfony/console suggests installing symfony/lock ()
10-Aug-2018 11:22:48 lusitanian/oauth suggests installing predis/predis (Allows using the Redis storage backend.)
10-Aug-2018 11:22:48 patchwork/utf8 suggests installing ext-intl (Use Intl for best performance)
10-Aug-2018 11:22:48 patchwork/utf8 suggests installing ext-wfio (Use WFIO for UTF-8 filesystem access on Windows)
10-Aug-2018 11:22:48 s9e/text-formatter suggests installing ext-intl (Allows international URLs to be accepted by the URL filter)
10-Aug-2018 11:22:48 s9e/text-formatter suggests installing ext-xsl (Enables the XSLT renderer)
10-Aug-2018 11:22:48 paragonie/random_compat suggests installing ext-libsodium (Provides a modern crypto API that can be used to generate random bytes.)
10-Aug-2018 11:22:48 symfony/http-kernel suggests installing symfony/var-dumper ()
10-Aug-2018 11:22:48 symfony/dependency-injection suggests installing symfony/expression-language (For using expressions in service container configuration)
10-Aug-2018 11:22:48 zendframework/zend-eventmanager suggests installing container-interop/container-interop (^1.1.0, to use the lazy listeners feature)
10-Aug-2018 11:22:48 zendframework/zend-eventmanager suggests installing zendframework/zend-stdlib (^2.7.3 || ^3.0, to use the FilterChain feature)
10-Aug-2018 11:22:48 zendframework/zend-code suggests installing doctrine/annotations (Doctrine\Common\Annotations >=1.0 for annotation features)
10-Aug-2018 11:22:48 zendframework/zend-code suggests installing zendframework/zend-stdlib (Zend\Stdlib component)
10-Aug-2018 11:22:48 ocramius/proxy-manager suggests installing ocramius/generated-hydrator (To have very fast object to array to object conversion for ghost objects)
10-Aug-2018 11:22:48 ocramius/proxy-manager suggests installing zendframework/zend-json (To have the JsonRpc adapter (Remote Object feature))
10-Aug-2018 11:22:48 ocramius/proxy-manager suggests installing zendframework/zend-soap (To have the Soap adapter (Remote Object feature))
10-Aug-2018 11:22:48 ocramius/proxy-manager suggests installing zendframework/zend-stdlib (To use the hydrator proxy)
10-Aug-2018 11:22:48 ocramius/proxy-manager suggests installing zendframework/zend-xmlrpc (To have the XmlRpc adapter (Remote Object feature))
10-Aug-2018 11:22:48 symfony/routing suggests installing doctrine/annotations (For using the annotation loader)
10-Aug-2018 11:22:48 symfony/routing suggests installing symfony/expression-language (For using expression matching)
10-Aug-2018 11:22:48 symfony/twig-bridge suggests installing symfony/asset (For using the AssetExtension)
10-Aug-2018 11:22:48 symfony/twig-bridge suggests installing symfony/expression-language (For using the ExpressionExtension)
10-Aug-2018 11:22:48 symfony/twig-bridge suggests installing symfony/form (For using the FormExtension)
10-Aug-2018 11:22:48 symfony/twig-bridge suggests installing symfony/security (For using the SecurityExtension)
10-Aug-2018 11:22:48 symfony/twig-bridge suggests installing symfony/stopwatch (For using the StopwatchExtension)
10-Aug-2018 11:22:48 symfony/twig-bridge suggests installing symfony/templating (For using the TwigEngine)
10-Aug-2018 11:22:48 symfony/twig-bridge suggests installing symfony/translation (For using the TranslationExtension)
10-Aug-2018 11:22:48 symfony/twig-bridge suggests installing symfony/var-dumper (For using the DumpExtension)
10-Aug-2018 11:22:48 symfony/twig-bridge suggests installing symfony/web-link (For using the WebLinkExtension)
10-Aug-2018 11:22:48 sebastian/global-state suggests installing ext-uopz (*)
10-Aug-2018 11:22:48 phpunit/phpunit-mock-objects suggests installing ext-soap (*)
10-Aug-2018 11:22:48 phpunit/phpunit suggests installing phpunit/php-invoker (~1.1)
10-Aug-2018 11:22:48 Generating autoload files
10-Aug-2018 11:22:49 Buildfile: /data/build/build.xml
10-Aug-2018 11:22:49
10-Aug-2018 11:22:49 phpBB > clean:
10-Aug-2018 11:22:49
10-Aug-2018 11:22:49    [delete] Directory /data/build/logs does not exist or is not a directory.
10-Aug-2018 11:22:49    [delete] Directory /data/build/api does not exist or is not a directory.
10-Aug-2018 11:22:49    [delete] Directory /data/build/codebrowser does not exist or is not a directory.
10-Aug-2018 11:22:49    [delete] Directory /data/build/coverage does not exist or is not a directory.
10-Aug-2018 11:22:49    [delete] Directory /data/build/cpd does not exist or is not a directory.
10-Aug-2018 11:22:49    [delete] Directory /data/build/dependencies does not exist or is not a directory.
10-Aug-2018 11:22:49    [delete] Directory /data/build/new_version does not exist or is not a directory.
10-Aug-2018 11:22:49    [delete] Directory /data/build/old_versions does not exist or is not a directory.
10-Aug-2018 11:22:49    [delete] Directory /data/build/save does not exist or is not a directory.
10-Aug-2018 11:22:49
10-Aug-2018 11:22:49 phpBB > prepare:
10-Aug-2018 11:22:49
10-Aug-2018 11:22:49     [mkdir] Created dir: /data/build/logs
10-Aug-2018 11:22:49     [mkdir] Created dir: /data/build/api
10-Aug-2018 11:22:49     [mkdir] Created dir: /data/build/codebrowser
10-Aug-2018 11:22:49     [mkdir] Created dir: /data/build/coverage
10-Aug-2018 11:22:49     [mkdir] Created dir: /data/build/cpd
10-Aug-2018 11:22:49     [mkdir] Created dir: /data/build/dependencies
10-Aug-2018 11:22:49     [mkdir] Created dir: /data/build/new_version
10-Aug-2018 11:22:49     [mkdir] Created dir: /data/build/new_version/files
10-Aug-2018 11:22:49     [mkdir] Created dir: /data/build/new_version/patches
10-Aug-2018 11:22:49     [mkdir] Created dir: /data/build/new_version/release_files
10-Aug-2018 11:22:49     [mkdir] Created dir: /data/build/new_version/update
10-Aug-2018 11:22:49     [mkdir] Created dir: /data/build/old_versions
10-Aug-2018 11:22:49     [mkdir] Created dir: /data/build/save
10-Aug-2018 11:22:49
10-Aug-2018 11:22:49 BUILD FINISHED
10-Aug-2018 11:22:49
10-Aug-2018 11:22:49 Total time: 0.1068 seconds
10-Aug-2018 11:22:49
10-Aug-2018 11:22:49 Finished task 'Prepare directory' with result: Success
10-Aug-2018 11:22:49 Skipping execution of task 'Run sniffs' as it is disabled
10-Aug-2018 11:22:49
Substituting variable: ${bamboo.working.directory} with /home/bamboo/xml-data/build-dir/PHPBB3-PR-JOB1
10-Aug-2018 11:22:49 Starting task 'Run sniffs' of type 'com.atlassian.bamboo.plugins.bamboo-docker-plugin:task.docker.cli'
10-Aug-2018 11:22:49 Running image name (phpbb:php-5.6)
10-Aug-2018 11:22:49
Beginning to execute external process for build 'phpBB3 - Pull Requests - Build and Test Job #8645 (PHPBB3-PR-JOB1-8645)'
... running command line:
/usr/bin/docker run --volume /home/bamboo/xml-data/build-dir/PHPBB3-PR-JOB1:/data --workdir /data/build --rm -u=991 phpbb:php-5.6 ../phpBB/vendor/bin/phing sniff
... in: /home/bamboo/xml-data/build-dir/PHPBB3-PR-JOB1
... using extra environment variables:
bamboo_planRepository_1_branch=3.1.x
bamboo_planRepository_1_branchDisplayName=3.1.x
bamboo_repository_revision_number=dc8ff9da28b8ab4ad11c7ea94cca526f17c87fe5
bamboo_PRref=feature/gsoc-pm
bamboo_resultsUrl=https://bamboo.phpbb.com/browse/PHPBB3-PR-JOB1-8645
bamboo_capability_system_builder_command_Git=/usr/bin/git
bamboo_repository_75956235_git_username=bantu
bamboo_build_working_directory=/home/bamboo/xml-data/build-dir/PHPBB3-PR-JOB1
bamboo_planRepository_1_name=phpBB Ascraeus
bamboo_buildKey=PHPBB3-PR-JOB1
bamboo_capability_phpbb_tests=true
bamboo_shortPlanName=Pull Requests
bamboo_capability_system_builder_command_fop=/usr/bin/fop
bamboo_capability_dbms_sqlite_2=true
bamboo_planRepository_name=phpBB Ascraeus
bamboo_PRnumber=5235
bamboo_buildNumber=8645
bamboo_repository_75956235_git_repositoryUrl=https://github.com/phpbb/phpbb.git
bamboo_capability_system_builder_phpunit_PHPUnit=/usr/bin/phpunit
bamboo_shortJobName=Build and Test Job
bamboo_buildResultsUrl=https://bamboo.phpbb.com/browse/PHPBB3-PR-JOB1-8645
bamboo_repository_75956235_branch_name=3.1.x
bamboo_planRepository_repositoryUrl=https://github.com/phpbb/phpbb.git
bamboo_agentId=131073
bamboo_planName=phpBB3 - Pull Requests
bamboo_build_commandline_com_atlassian_bamboo_plugins_scripttask_task_builder_script_7=/bin/sh /home/bamboo/temp/PHPBB3-PR-JOB1-8645-ScriptBuildTask-2951208179326564409.sh
bamboo_shortPlanKey=PR
bamboo_shortJobKey=JOB1
bamboo_capability_dbms_mysql_55=true
bamboo_capability_system_jdk_JDK_1_7_0_65=/usr/lib/jvm/java-7-openjdk-amd64
bamboo_planRepository_revision=dc8ff9da28b8ab4ad11c7ea94cca526f17c87fe5
bamboo_buildTimeStamp=2018-08-10T11:21:33.775Z
bamboo_repository_previous_revision_number=dc8ff9da28b8ab4ad11c7ea94cca526f17c87fe5
bamboo_capability_system_jdk_JDK_1_6_0_16=/usr/lib/jvm/java-6-sun-1.6.0.16
bamboo_capability_system_builder_mvn2_Maven_2=/usr/share/maven2
bamboo_planRepository_previousRevision=dc8ff9da28b8ab4ad11c7ea94cca526f17c87fe5
bamboo_build_commandline_com_atlassian_bamboo_plugins_scripttask_task_builder_script_4=/bin/sh /home/bamboo/temp/PHPBB3-PR-JOB1-8645-ScriptBuildTask-5744901830101255629.sh
bamboo_repository_git_branch=3.1.x
bamboo_buildResultKey=PHPBB3-PR-JOB1-8645
bamboo_repository_branch_name=3.1.x
bamboo_buildPlanName=phpBB3 - Pull Requests - Build and Test Job
bamboo_planRepository_1_revision=dc8ff9da28b8ab4ad11c7ea94cca526f17c87fe5
bamboo_repository_name=phpBB Ascraeus
bamboo_buildFailed=false
bamboo_capability_system_docker_executable=/usr/bin/docker
bamboo_build_commandline_com_atlassian_bamboo_plugins_bamboo_docker_plugin_task_docker_cli_12=/usr/bin/docker run --volume /home/bamboo/xml-data/build-dir/PHPBB3-PR-JOB1:/data --workdir /data/phpBB --rm -e HOME=/home/bamboo -u=991 phpbb:php-5.6 /bin/bash -c php ../composer.phar install --dev; cd ../build; ../phpBB/vendor/bin/phing clean prepare
bamboo_planRepository_branch=3.1.x
bamboo_agentWorkingDirectory=/home/bamboo/xml-data/build-dir
bamboo_capability_system_git_executable=/usr/bin/git
bamboo_capability_system_builder_phpunit_PHPUnit_3_4=/usr/bin/phpunit
bamboo_repository_git_username=bantu
bamboo_planRepository_1_previousRevision=dc8ff9da28b8ab4ad11c7ea94cca526f17c87fe5
bamboo_repository_75956235_revision_number=dc8ff9da28b8ab4ad11c7ea94cca526f17c87fe5
bamboo_planRepository_branchDisplayName=3.1.x
bamboo_planRepository_1_type=gitv2
bamboo_planRepository_branchName=3.1.x
bamboo_repository_75956235_previous_revision_number=dc8ff9da28b8ab4ad11c7ea94cca526f17c87fe5
bamboo_capability_system_jdk_JDK=/usr/lib/jvm/java-6-sun
bamboo_plan_storageTag=PHPBB3-PR
bamboo_hg_cache_directory=/home/bamboo/xml-data/build-dir/_hg-repositories-cache
bamboo_planRepository_1_username=bantu
bamboo_planRepository_type=gitv2
bamboo_git_cache_directory=/home/bamboo/xml-data/build-dir/_git-repositories-cache
bamboo_ManualBuildTriggerReason_userName=Build Robot
bamboo_repository_git_repositoryUrl=https://github.com/phpbb/phpbb.git
bamboo_repository_75956235_git_branch=3.1.x
bamboo_capability_system_builder_ant_Ant=/usr/share/ant
bamboo_repository_75956235_name=phpBB Ascraeus
bamboo_tmp_directory=/home/bamboo/temp
bamboo_working_directory=/home/bamboo/xml-data/build-dir/PHPBB3-PR-JOB1
bamboo_planKey=PHPBB3-PR
bamboo_capability_local=true
bamboo_planRepository_1_repositoryUrl=https://github.com/phpbb/phpbb.git
bamboo_planRepository_username=bantu
bamboo_capability_system_jdk_JDK_1_6=/usr/lib/jvm/java-6-sun
bamboo_capability_system_jdk_JDK_1_7=/usr/lib/jvm/java-7-openjdk-amd64
bamboo_planRepository_1_branchName=3.1.x
10-Aug-2018 11:22:50 Buildfile: /data/build/build.xml
10-Aug-2018 11:22:50
10-Aug-2018 11:22:50 phpBB > sniff:
10-Aug-2018 11:22:50
10-Aug-2018 11:22:57 ............................................................  60 / 750 (8%)
10-Aug-2018 11:22:58 ............................................................ 120 / 750 (16%)
10-Aug-2018 11:22:59 ............................................................ 180 / 750 (24%)
10-Aug-2018 11:23:00 ............................................................ 240 / 750 (32%)
10-Aug-2018 11:23:03 ............................................................ 300 / 750 (40%)
10-Aug-2018 11:23:08 ............................................................ 360 / 750 (48%)
10-Aug-2018 11:23:14 ............................................................ 420 / 750 (56%)
10-Aug-2018 11:23:18 ............................................................ 480 / 750 (64%)
10-Aug-2018 11:23:21 ............................................................ 540 / 750 (72%)
10-Aug-2018 11:23:25 ............................................................ 600 / 750 (80%)
10-Aug-2018 11:23:29 ............................................................ 660 / 750 (88%)
10-Aug-2018 11:23:32 ............................................................ 720 / 750 (96%)
10-Aug-2018 11:23:33 ..............................
10-Aug-2018 11:23:33
10-Aug-2018 11:23:33 Time: 43.47 secs; Memory: 63.75Mb
10-Aug-2018 11:23:33
10-Aug-2018 11:23:41 ............................................................  60 / 209 (29%)
10-Aug-2018 11:24:00 .......E.................................................... 120 / 209 (57%)
10-Aug-2018 11:24:14 ............................................................ 180 / 209 (86%)
10-Aug-2018 11:24:21 ......................E......
10-Aug-2018 11:24:21
10-Aug-2018 11:24:21
10-Aug-2018 11:24:21 FILE: /data/phpBB/includes/functions_privmsgs.php
10-Aug-2018 11:24:21 ----------------------------------------------------------------------
10-Aug-2018 11:24:21 FOUND 1 ERROR AFFECTING 1 LINE
10-Aug-2018 11:24:21 ----------------------------------------------------------------------
10-Aug-2018 11:24:21 934 | ERROR | There should be exactly one space between the keyword and
10-Aug-2018 11:24:21      |       | opening parenthesis
10-Aug-2018 11:24:21      |       | (phpbb.ControlStructures.OpeningParenthesis.NoSpaceBeforeOpeningParenthesis)
10-Aug-2018 11:24:21 ----------------------------------------------------------------------
10-Aug-2018 11:24:21
10-Aug-2018 11:24:21
10-Aug-2018 11:24:21 FILE: /data/phpBB/includes/ucp/ucp_pm_viewfolder.php
10-Aug-2018 11:24:21 ----------------------------------------------------------------------
10-Aug-2018 11:24:21 FOUND 1 ERROR AFFECTING 1 LINE
10-Aug-2018 11:24:21 ----------------------------------------------------------------------
10-Aug-2018 11:24:21 590 | ERROR | [x] Whitespace found at end of line
10-Aug-2018 11:24:21      |       |     (Squiz.WhiteSpace.SuperfluousWhitespace.EndLine)
10-Aug-2018 11:24:21 ----------------------------------------------------------------------
10-Aug-2018 11:24:21 PHPCBF CAN FIX THE 1 MARKED SNIFF VIOLATIONS AUTOMATICALLY
10-Aug-2018 11:24:21 ----------------------------------------------------------------------
10-Aug-2018 11:24:21
10-Aug-2018 11:24:21 Time: 48.06 secs; Memory: 60.5Mb
10-Aug-2018 11:24:21
10-Aug-2018 11:24:22
10-Aug-2018 11:24:22
10-Aug-2018 11:24:22 Time: 18ms; Memory: 3.75Mb
10-Aug-2018 11:24:22
10-Aug-2018 11:24:22        [if] Error in IfTask
10-Aug-2018 11:24:22 Execution of target "sniff" failed for the following reason: /data/build/build.xml:109:6: /data/build/build.xml:115:9: PHP Code Sniffer failed.
10-Aug-2018 11:24:22
10-Aug-2018 11:24:22 BUILD FAILED
10-Aug-2018 11:24:22 /data/build/build.xml:109:6: /data/build/build.xml:115:9: PHP Code Sniffer failed.
10-Aug-2018 11:24:22 Total time: 2 minutes  31.85 seconds
10-Aug-2018 11:24:22
10-Aug-2018 11:24:22 Error occurred while running Task 'Run sniffs(11)' of type com.atlassian.bamboo.plugins.bamboo-docker-plugin:task.docker.cli.
10-Aug-2018 11:24:22 com.atlassian.bamboo.task.TaskException: Failed to execute task
10-Aug-2018 11:24:22         at com.atlassian.bamboo.plugins.docker.service.RunService.execute(RunService.java:75)
10-Aug-2018 11:24:22         at com.atlassian.bamboo.plugins.docker.tasks.cli.DockerCliTask.execute(DockerCliTask.java:70)
10-Aug-2018 11:24:22         at com.atlassian.bamboo.task.TaskExecutorImpl.lambda$executeTasks$3(TaskExecutorImpl.java:285)
10-Aug-2018 11:24:22         at com.atlassian.bamboo.task.TaskExecutorImpl.executeTaskWithPrePostActions(TaskExecutorImpl.java:224)
10-Aug-2018 11:24:22         at com.atlassian.bamboo.task.TaskExecutorImpl.executeTasks(TaskExecutorImpl.java:285)
10-Aug-2018 11:24:22         at com.atlassian.bamboo.task.TaskExecutorImpl.execute(TaskExecutorImpl.java:112)
10-Aug-2018 11:24:22         at com.atlassian.bamboo.build.pipeline.tasks.ExecuteBuildTask.call(ExecuteBuildTask.java:71)
10-Aug-2018 11:24:22         at com.atlassian.bamboo.v2.build.agent.DefaultBuildAgent.executeBuildPhase(DefaultBuildAgent.java:203)
10-Aug-2018 11:24:22         at com.atlassian.bamboo.v2.build.agent.DefaultBuildAgent.build(DefaultBuildAgent.java:175)
10-Aug-2018 11:24:22         at com.atlassian.bamboo.v2.build.agent.BuildAgentControllerImpl.lambda$waitAndPerformBuild$0(BuildAgentControllerImpl.java:122)
10-Aug-2018 11:24:22         at com.atlassian.bamboo.variable.CustomVariableContextImpl.withVariableSubstitutor(CustomVariableContextImpl.java:185)
10-Aug-2018 11:24:22         at com.atlassian.bamboo.v2.build.agent.BuildAgentControllerImpl.waitAndPerformBuild(BuildAgentControllerImpl.java:117)
10-Aug-2018 11:24:22         at com.atlassian.bamboo.v2.build.agent.DefaultBuildAgent$1.run(DefaultBuildAgent.java:126)
10-Aug-2018 11:24:22         at com.atlassian.bamboo.utils.BambooRunnables$1.run(BambooRunnables.java:48)
10-Aug-2018 11:24:22         at com.atlassian.bamboo.security.ImpersonationHelper.runWith(ImpersonationHelper.java:26)
10-Aug-2018 11:24:22         at com.atlassian.bamboo.security.ImpersonationHelper.runWithSystemAuthority(ImpersonationHelper.java:17)
10-Aug-2018 11:24:22         at com.atlassian.bamboo.security.ImpersonationHelper$1.run(ImpersonationHelper.java:41)
10-Aug-2018 11:24:22         at java.lang.Thread.run(Thread.java:748)
10-Aug-2018 11:24:22 Caused by: com.atlassian.bamboo.docker.DockerException: Error running Docker run command
10-Aug-2018 11:24:22         at com.atlassian.bamboo.docker.DockerContainerServiceImpl.run(DockerContainerServiceImpl.java:118)
10-Aug-2018 11:24:22         at sun.reflect.GeneratedMethodAccessor2599.invoke(Unknown Source)
10-Aug-2018 11:24:22         at sun.reflect.DelegatingMethodAccessorImpl.invoke(DelegatingMethodAccessorImpl.java:43)
10-Aug-2018 11:24:22         at java.lang.reflect.Method.invoke(Method.java:498)
10-Aug-2018 11:24:22         at com.atlassian.plugin.util.ContextClassLoaderSettingInvocationHandler.invoke(ContextClassLoaderSettingInvocationHandler.java:26)
10-Aug-2018 11:24:22         at com.sun.proxy.$Proxy401.run(Unknown Source)
10-Aug-2018 11:24:22         at sun.reflect.GeneratedMethodAccessor2599.invoke(Unknown Source)
10-Aug-2018 11:24:22         at sun.reflect.DelegatingMethodAccessorImpl.invoke(DelegatingMethodAccessorImpl.java:43)
10-Aug-2018 11:24:22         at java.lang.reflect.Method.invoke(Method.java:498)
10-Aug-2018 11:24:22         at org.springframework.aop.support.AopUtils.invokeJoinpointUsingReflection(AopUtils.java:302)
10-Aug-2018 11:24:22         at org.eclipse.gemini.blueprint.service.importer.support.internal.aop.ServiceInvoker.doInvoke(ServiceInvoker.java:56)
10-Aug-2018 11:24:22         at org.eclipse.gemini.blueprint.service.importer.support.internal.aop.ServiceInvoker.invoke(ServiceInvoker.java:60)
10-Aug-2018 11:24:22         at org.springframework.aop.framework.ReflectiveMethodInvocation.proceed(ReflectiveMethodInvocation.java:179)
10-Aug-2018 11:24:22         at org.springframework.aop.support.DelegatingIntroductionInterceptor.doProceed(DelegatingIntroductionInterceptor.java:133)
10-Aug-2018 11:24:22         at org.springframework.aop.support.DelegatingIntroductionInterceptor.invoke(DelegatingIntroductionInterceptor.java:121)
10-Aug-2018 11:24:22         at org.springframework.aop.framework.ReflectiveMethodInvocation.proceed(ReflectiveMethodInvocation.java:179)
10-Aug-2018 11:24:22         at org.eclipse.gemini.blueprint.service.util.internal.aop.ServiceTCCLInterceptor.invokeUnprivileged(ServiceTCCLInterceptor.java:70)
10-Aug-2018 11:24:22         at org.eclipse.gemini.blueprint.service.util.internal.aop.ServiceTCCLInterceptor.invoke(ServiceTCCLInterceptor.java:53)
10-Aug-2018 11:24:22         at org.springframework.aop.framework.ReflectiveMethodInvocation.proceed(ReflectiveMethodInvocation.java:179)
10-Aug-2018 11:24:22         at org.eclipse.gemini.blueprint.service.importer.support.LocalBundleContextAdvice.invoke(LocalBundleContextAdvice.java:57)
10-Aug-2018 11:24:22         at org.springframework.aop.framework.ReflectiveMethodInvocation.proceed(ReflectiveMethodInvocation.java:179)
10-Aug-2018 11:24:22         at org.springframework.aop.support.DelegatingIntroductionInterceptor.doProceed(DelegatingIntroductionInterceptor.java:133)
10-Aug-2018 11:24:22         at org.springframework.aop.support.DelegatingIntroductionInterceptor.invoke(DelegatingIntroductionInterceptor.java:121)
10-Aug-2018 11:24:22         at org.springframework.aop.framework.ReflectiveMethodInvocation.proceed(ReflectiveMethodInvocation.java:179)
10-Aug-2018 11:24:22         at org.springframework.aop.framework.JdkDynamicAopProxy.invoke(JdkDynamicAopProxy.java:207)
10-Aug-2018 11:24:22         at com.sun.proxy.$Proxy695.run(Unknown Source)
10-Aug-2018 11:24:22         at com.atlassian.bamboo.plugins.docker.client.DockerCmd.run(DockerCmd.java:51)
10-Aug-2018 11:24:22         at com.atlassian.bamboo.plugins.docker.service.RunService.execute(RunService.java:64)
10-Aug-2018 11:24:22         ... 17 more
10-Aug-2018 11:24:22 Caused by: com.atlassian.utils.process.ProcessException: Error executing /usr/bin/docker run --volume /home/bamboo/xml-data/build-dir/PHPBB3-PR-JOB1:/data --workdir /data/build --rm -u=991 phpbb:php-5.6 ../phpBB/vendor/bin/phing sniff
10-Aug-2018 11:24:22         at com.atlassian.bamboo.docker.DockerContainerServiceImpl.execute(DockerContainerServiceImpl.java:252)
10-Aug-2018 11:24:22         at com.atlassian.bamboo.docker.DockerContainerServiceImpl.run(DockerContainerServiceImpl.java:106)
10-Aug-2018 11:24:22         ... 44 more
10-Aug-2018 11:24:22 Starting task 'Parsing test results produced by script' of type 'com.atlassian.bamboo.plugins.testresultparser:task.testresultparser.junit'
10-Aug-2018 11:24:22 Parsing test results under /home/bamboo/xml-data/build-dir/PHPBB3-PR-JOB1...
10-Aug-2018 11:24:22 Failing task since test cases were expected but none were found.
10-Aug-2018 11:24:22 Finished task 'Parsing test results produced by script' with result: Failed
10-Aug-2018 11:24:22
Substituting variable: ${bamboo.PRnumber} with 5235
10-Aug-2018 11:24:22
Substituting variable: ${bamboo.buildResultsUrl} with https://bamboo.phpbb.com/browse/PHPBB3-PR-JOB1-8645
10-Aug-2018 11:24:22
Substituting variable: ${bamboo.buildResultsUrl} with https://bamboo.phpbb.com/browse/PHPBB3-PR-JOB1-8645
10-Aug-2018 11:24:22 Starting task 'Set result build status' of type 'com.atlassian.bamboo.plugins.scripttask:task.builder.script'
10-Aug-2018 11:24:22
Beginning to execute external process for build 'phpBB3 - Pull Requests - Build and Test Job #8645 (PHPBB3-PR-JOB1-8645)'
... running command line:
/bin/sh /home/bamboo/temp/PHPBB3-PR-JOB1-8645-ScriptBuildTask-2817175527238004757.sh
... in: /home/bamboo/xml-data/build-dir/PHPBB3-PR-JOB1
... using extra environment variables:
bamboo_planRepository_1_branch=3.1.x
bamboo_planRepository_1_branchDisplayName=3.1.x
bamboo_repository_revision_number=dc8ff9da28b8ab4ad11c7ea94cca526f17c87fe5
bamboo_PRref=feature/gsoc-pm
bamboo_resultsUrl=https://bamboo.phpbb.com/browse/PHPBB3-PR-JOB1-8645
bamboo_capability_system_builder_command_Git=/usr/bin/git
bamboo_repository_75956235_git_username=bantu
bamboo_build_working_directory=/home/bamboo/xml-data/build-dir/PHPBB3-PR-JOB1
bamboo_planRepository_1_name=phpBB Ascraeus
bamboo_buildKey=PHPBB3-PR-JOB1
bamboo_capability_phpbb_tests=true
bamboo_shortPlanName=Pull Requests
bamboo_capability_system_builder_command_fop=/usr/bin/fop
bamboo_capability_dbms_sqlite_2=true
bamboo_planRepository_name=phpBB Ascraeus
bamboo_PRnumber=5235
bamboo_buildNumber=8645
bamboo_repository_75956235_git_repositoryUrl=https://github.com/phpbb/phpbb.git
bamboo_capability_system_builder_phpunit_PHPUnit=/usr/bin/phpunit
bamboo_shortJobName=Build and Test Job
bamboo_buildResultsUrl=https://bamboo.phpbb.com/browse/PHPBB3-PR-JOB1-8645
bamboo_repository_75956235_branch_name=3.1.x
bamboo_planRepository_repositoryUrl=https://github.com/phpbb/phpbb.git
bamboo_agentId=131073
bamboo_planName=phpBB3 - Pull Requests
bamboo_build_commandline_com_atlassian_bamboo_plugins_scripttask_task_builder_script_7=/bin/sh /home/bamboo/temp/PHPBB3-PR-JOB1-8645-ScriptBuildTask-2951208179326564409.sh
bamboo_shortPlanKey=PR
bamboo_shortJobKey=JOB1
bamboo_capability_dbms_mysql_55=true
bamboo_capability_system_jdk_JDK_1_7_0_65=/usr/lib/jvm/java-7-openjdk-amd64
bamboo_planRepository_revision=dc8ff9da28b8ab4ad11c7ea94cca526f17c87fe5
bamboo_buildTimeStamp=2018-08-10T11:21:33.775Z
bamboo_repository_previous_revision_number=dc8ff9da28b8ab4ad11c7ea94cca526f17c87fe5
bamboo_capability_system_jdk_JDK_1_6_0_16=/usr/lib/jvm/java-6-sun-1.6.0.16
bamboo_capability_system_builder_mvn2_Maven_2=/usr/share/maven2
bamboo_planRepository_previousRevision=dc8ff9da28b8ab4ad11c7ea94cca526f17c87fe5
bamboo_build_commandline_com_atlassian_bamboo_plugins_scripttask_task_builder_script_4=/bin/sh /home/bamboo/temp/PHPBB3-PR-JOB1-8645-ScriptBuildTask-5744901830101255629.sh
bamboo_repository_git_branch=3.1.x
bamboo_buildResultKey=PHPBB3-PR-JOB1-8645
bamboo_repository_branch_name=3.1.x
bamboo_buildPlanName=phpBB3 - Pull Requests - Build and Test Job
bamboo_planRepository_1_revision=dc8ff9da28b8ab4ad11c7ea94cca526f17c87fe5
bamboo_repository_name=phpBB Ascraeus
bamboo_buildFailed=true
bamboo_capability_system_docker_executable=/usr/bin/docker
bamboo_build_commandline_com_atlassian_bamboo_plugins_bamboo_docker_plugin_task_docker_cli_11=/usr/bin/docker run --volume /home/bamboo/xml-data/build-dir/PHPBB3-PR-JOB1:/data --workdir /data/build --rm -u=991 phpbb:php-5.6 ../phpBB/vendor/bin/phing sniff
bamboo_build_commandline_com_atlassian_bamboo_plugins_bamboo_docker_plugin_task_docker_cli_12=/usr/bin/docker run --volume /home/bamboo/xml-data/build-dir/PHPBB3-PR-JOB1:/data --workdir /data/phpBB --rm -e HOME=/home/bamboo -u=991 phpbb:php-5.6 /bin/bash -c php ../composer.phar install --dev; cd ../build; ../phpBB/vendor/bin/phing clean prepare
bamboo_planRepository_branch=3.1.x
bamboo_agentWorkingDirectory=/home/bamboo/xml-data/build-dir
bamboo_jobFailed=true
bamboo_capability_system_git_executable=/usr/bin/git
bamboo_capability_system_builder_phpunit_PHPUnit_3_4=/usr/bin/phpunit
bamboo_repository_git_username=bantu
bamboo_planRepository_1_previousRevision=dc8ff9da28b8ab4ad11c7ea94cca526f17c87fe5
bamboo_repository_75956235_revision_number=dc8ff9da28b8ab4ad11c7ea94cca526f17c87fe5
bamboo_planRepository_branchDisplayName=3.1.x
bamboo_planRepository_1_type=gitv2
bamboo_planRepository_branchName=3.1.x
bamboo_repository_75956235_previous_revision_number=dc8ff9da28b8ab4ad11c7ea94cca526f17c87fe5
bamboo_capability_system_jdk_JDK=/usr/lib/jvm/java-6-sun
bamboo_plan_storageTag=PHPBB3-PR
bamboo_hg_cache_directory=/home/bamboo/xml-data/build-dir/_hg-repositories-cache
bamboo_planRepository_1_username=bantu
bamboo_planRepository_type=gitv2
bamboo_git_cache_directory=/home/bamboo/xml-data/build-dir/_git-repositories-cache
bamboo_ManualBuildTriggerReason_userName=Build Robot
bamboo_repository_git_repositoryUrl=https://github.com/phpbb/phpbb.git
bamboo_repository_75956235_git_branch=3.1.x
bamboo_capability_system_builder_ant_Ant=/usr/share/ant
bamboo_repository_75956235_name=phpBB Ascraeus
bamboo_tmp_directory=/home/bamboo/temp
bamboo_working_directory=/home/bamboo/xml-data/build-dir/PHPBB3-PR-JOB1
bamboo_planKey=PHPBB3-PR
bamboo_capability_local=true
bamboo_planRepository_1_repositoryUrl=https://github.com/phpbb/phpbb.git
bamboo_planRepository_username=bantu
bamboo_capability_system_jdk_JDK_1_6=/usr/lib/jvm/java-6-sun
bamboo_capability_system_jdk_JDK_1_7=/usr/lib/jvm/java-7-openjdk-amd64
bamboo_planRepository_1_branchName=3.1.x
10-Aug-2018 11:24:23 From https://github.com/phpbb/phpbb
10-Aug-2018 11:24:23 * branch            refs/pull/5235/head -> FETCH_HEAD
10-Aug-2018 11:24:23 grep: build/logs/phpunit.xml: No such file or directory
10-Aug-2018 11:24:23 grep: build/logs/phpunit.xml: No such file or directory
10-Aug-2018 11:24:23   % Total    % Received % Xferd  Average Speed   Time    Time     Time  Current
10-Aug-2018 11:24:23                                  Dload  Upload   Total   Spent    Left  Speed
10-Aug-2018 11:24:23
10-Aug-2018 11:24:23   0     0    0     0    0     0      0      0 --:--:-- --:--:-- --:--:--     0
10-Aug-2018 11:24:23 100   273  100    93  100   180    142    276 --:--:-- --:--:-- --:--:--   276
10-Aug-2018 11:24:23 Finished task 'Set result build status' with result: Success
10-Aug-2018 11:24:23 Running post build plugin 'NCover Results Collector'
10-Aug-2018 11:24:23 Running post build plugin 'Artifact Copier'
10-Aug-2018 11:24:23 Running post build plugin 'npm Cache Cleanup'
10-Aug-2018 11:24:23 Running post build plugin 'Clover Results Collector'
10-Aug-2018 11:24:23 Running post build plugin 'Docker Container Cleanup'
10-Aug-2018 11:24:24 Successfully removed working directory at '/home/bamboo/xml-data/build-dir/PHPBB3-PR-JOB1'
10-Aug-2018 11:24:24 Finalising the build...
10-Aug-2018 11:24:24 Stopping timer.
10-Aug-2018 11:24:24 Build PHPBB3-PR-JOB1-8645 completed.
10-Aug-2018 11:24:24 Running on server: post build plugin 'NCover Results Collector'
10-Aug-2018 11:24:24 Running on server: post build plugin 'Build Hanging Detection Configuration'
10-Aug-2018 11:24:24 Running on server: post build plugin 'Clover Delta Calculator'
10-Aug-2018 11:24:24 Running on server: post build plugin 'Maven Dependencies Postprocessor'
10-Aug-2018 11:24:24 All post build plugins have finished
10-Aug-2018 11:24:24 Generating build results summary...
10-Aug-2018 11:24:24 Saving build results to disk...
10-Aug-2018 11:24:24 Logging substituted variables...
10-Aug-2018 11:24:24 Indexing build results...
10-Aug-2018 11:24:24 Finished building PHPBB3-PR-JOB1-8645.
10-Aug-2018 11:24:24
Substituting variable: ${bamboo.PRnumber} with 5235