Tests pending pull requests

Build: #8649 failed

Job: Build and Test Job failed

Stages & jobs

  1. Build and Test

Build log

The build generated 361 lines of output. Download or view full build log

11-Aug-2018 07:10:38 Build phpBB3 - Pull Requests - Build and Test Job #8649 (PHPBB3-PR-JOB1-8649) started building on agent Default Agent
11-Aug-2018 07:10:38
11-Aug-2018 07:10:38 Build working directory is /home/bamboo/xml-data/build-dir/PHPBB3-PR-JOB1
11-Aug-2018 07:10:38 Executing build phpBB3 - Pull Requests - Build and Test Job #8649 (PHPBB3-PR-JOB1-8649)
11-Aug-2018 07:10:38 Starting task 'Checkout develop branch' of type 'com.atlassian.bamboo.plugins.vcs:task.vcs.checkout'
11-Aug-2018 07:10:38 Build always requires a clean checkout
11-Aug-2018 07:10:38 Cleaning build directory '/home/bamboo/xml-data/build-dir/PHPBB3-PR-JOB1'
11-Aug-2018 07:10:38 Checking out into /home/bamboo/xml-data/build-dir/PHPBB3-PR-JOB1
11-Aug-2018 07:10:38 Updating source code to revision: dc8ff9da28b8ab4ad11c7ea94cca526f17c87fe5
11-Aug-2018 07:10:38 Fetching 'refs/heads/3.1.x' from 'https://github.com/phpbb/phpbb.git'.
11-Aug-2018 07:10:39 Checking out revision dc8ff9da28b8ab4ad11c7ea94cca526f17c87fe5.
11-Aug-2018 07:10:39 Creating local git repository in '/home/bamboo/xml-data/build-dir/PHPBB3-PR-JOB1/.git'.
11-Aug-2018 07:10:39 Cloning into '/home/bamboo/xml-data/build-dir/PHPBB3-PR-JOB1'...
11-Aug-2018 07:10:39 done.
11-Aug-2018 07:10:49 Switched to a new branch '3.1.x'
11-Aug-2018 07:10:49 Branch 3.1.x set up to track remote branch 3.1.x from origin.
11-Aug-2018 07:10:49 Updated source code to revision: dc8ff9da28b8ab4ad11c7ea94cca526f17c87fe5
11-Aug-2018 07:10:49 Finished task 'Checkout develop branch' with result: Success
11-Aug-2018 07:10:49 Running pre-build action: VCS Version Collector
11-Aug-2018 07:10:49
Substituting variable: ${bamboo.PRnumber} with 5235
11-Aug-2018 07:10:49
Substituting variable: ${bamboo.buildResultsUrl} with https://bamboo.phpbb.com/browse/PHPBB3-PR-JOB1-8649
11-Aug-2018 07:10:49 Starting task 'Set pending build status' of type 'com.atlassian.bamboo.plugins.scripttask:task.builder.script'
11-Aug-2018 07:10:49
Beginning to execute external process for build 'phpBB3 - Pull Requests - Build and Test Job #8649 (PHPBB3-PR-JOB1-8649)'
... running command line:
/bin/sh /home/bamboo/temp/PHPBB3-PR-JOB1-8649-ScriptBuildTask-668329888075367092.sh
... in: /home/bamboo/xml-data/build-dir/PHPBB3-PR-JOB1
... using extra environment variables:
bamboo_planRepository_1_branch=3.1.x
bamboo_planRepository_1_branchDisplayName=3.1.x
bamboo_repository_revision_number=dc8ff9da28b8ab4ad11c7ea94cca526f17c87fe5
bamboo_PRref=feature/gsoc-pm
bamboo_resultsUrl=https://bamboo.phpbb.com/browse/PHPBB3-PR-JOB1-8649
bamboo_capability_system_builder_command_Git=/usr/bin/git
bamboo_repository_75956235_git_username=bantu
bamboo_build_working_directory=/home/bamboo/xml-data/build-dir/PHPBB3-PR-JOB1
bamboo_planRepository_1_name=phpBB Ascraeus
bamboo_buildKey=PHPBB3-PR-JOB1
bamboo_capability_phpbb_tests=true
bamboo_shortPlanName=Pull Requests
bamboo_capability_system_builder_command_fop=/usr/bin/fop
bamboo_capability_dbms_sqlite_2=true
bamboo_planRepository_name=phpBB Ascraeus
bamboo_PRnumber=5235
bamboo_buildNumber=8649
bamboo_repository_75956235_git_repositoryUrl=https://github.com/phpbb/phpbb.git
bamboo_capability_system_builder_phpunit_PHPUnit=/usr/bin/phpunit
bamboo_shortJobName=Build and Test Job
bamboo_buildResultsUrl=https://bamboo.phpbb.com/browse/PHPBB3-PR-JOB1-8649
bamboo_repository_75956235_branch_name=3.1.x
bamboo_planRepository_repositoryUrl=https://github.com/phpbb/phpbb.git
bamboo_agentId=131073
bamboo_planName=phpBB3 - Pull Requests
bamboo_shortPlanKey=PR
bamboo_shortJobKey=JOB1
bamboo_capability_dbms_mysql_55=true
bamboo_capability_system_jdk_JDK_1_7_0_65=/usr/lib/jvm/java-7-openjdk-amd64
bamboo_planRepository_revision=dc8ff9da28b8ab4ad11c7ea94cca526f17c87fe5
bamboo_buildTimeStamp=2018-08-11T07:10:38.691Z
bamboo_repository_previous_revision_number=dc8ff9da28b8ab4ad11c7ea94cca526f17c87fe5
bamboo_capability_system_jdk_JDK_1_6_0_16=/usr/lib/jvm/java-6-sun-1.6.0.16
bamboo_capability_system_builder_mvn2_Maven_2=/usr/share/maven2
bamboo_planRepository_previousRevision=dc8ff9da28b8ab4ad11c7ea94cca526f17c87fe5
bamboo_repository_git_branch=3.1.x
bamboo_buildResultKey=PHPBB3-PR-JOB1-8649
bamboo_repository_branch_name=3.1.x
bamboo_buildPlanName=phpBB3 - Pull Requests - Build and Test Job
bamboo_planRepository_1_revision=dc8ff9da28b8ab4ad11c7ea94cca526f17c87fe5
bamboo_repository_name=phpBB Ascraeus
bamboo_buildFailed=false
bamboo_capability_system_docker_executable=/usr/bin/docker
bamboo_planRepository_branch=3.1.x
bamboo_agentWorkingDirectory=/home/bamboo/xml-data/build-dir
bamboo_capability_system_git_executable=/usr/bin/git
bamboo_capability_system_builder_phpunit_PHPUnit_3_4=/usr/bin/phpunit
bamboo_repository_git_username=bantu
bamboo_planRepository_1_previousRevision=dc8ff9da28b8ab4ad11c7ea94cca526f17c87fe5
bamboo_repository_75956235_revision_number=dc8ff9da28b8ab4ad11c7ea94cca526f17c87fe5
bamboo_planRepository_branchDisplayName=3.1.x
bamboo_planRepository_1_type=gitv2
bamboo_planRepository_branchName=3.1.x
bamboo_repository_75956235_previous_revision_number=dc8ff9da28b8ab4ad11c7ea94cca526f17c87fe5
bamboo_capability_system_jdk_JDK=/usr/lib/jvm/java-6-sun
bamboo_plan_storageTag=PHPBB3-PR
bamboo_hg_cache_directory=/home/bamboo/xml-data/build-dir/_hg-repositories-cache
bamboo_planRepository_1_username=bantu
bamboo_planRepository_type=gitv2
bamboo_git_cache_directory=/home/bamboo/xml-data/build-dir/_git-repositories-cache
bamboo_ManualBuildTriggerReason_userName=Build Robot
bamboo_repository_git_repositoryUrl=https://github.com/phpbb/phpbb.git
bamboo_repository_75956235_git_branch=3.1.x
bamboo_capability_system_builder_ant_Ant=/usr/share/ant
bamboo_repository_75956235_name=phpBB Ascraeus
bamboo_tmp_directory=/home/bamboo/temp
bamboo_working_directory=/home/bamboo/xml-data/build-dir/PHPBB3-PR-JOB1
bamboo_planKey=PHPBB3-PR
bamboo_capability_local=true
bamboo_planRepository_1_repositoryUrl=https://github.com/phpbb/phpbb.git
bamboo_planRepository_username=bantu
bamboo_capability_system_jdk_JDK_1_6=/usr/lib/jvm/java-6-sun
bamboo_capability_system_jdk_JDK_1_7=/usr/lib/jvm/java-7-openjdk-amd64
bamboo_planRepository_1_branchName=3.1.x
11-Aug-2018 07:10:52 From https://github.com/phpbb/phpbb
11-Aug-2018 07:10:52 * branch            refs/pull/5235/head -> FETCH_HEAD
11-Aug-2018 07:10:52   % Total    % Received % Xferd  Average Speed   Time    Time     Time  Current
11-Aug-2018 07:10:52                                  Dload  Upload   Total   Spent    Left  Speed
11-Aug-2018 07:10:52
11-Aug-2018 07:10:52   0     0    0     0    0     0      0      0 --:--:-- --:--:-- --:--:--     0
11-Aug-2018 07:10:52 100   275  100    93  100   182    172    336 --:--:-- --:--:-- --:--:--   337
11-Aug-2018 07:10:52 Finished task 'Set pending build status' with result: Success
11-Aug-2018 07:10:52
Substituting variable: ${bamboo.PRnumber} with 5235
11-Aug-2018 07:10:52 Starting task 'Fetch PR' of type 'com.atlassian.bamboo.plugins.scripttask:task.builder.script'
11-Aug-2018 07:10:52
Beginning to execute external process for build 'phpBB3 - Pull Requests - Build and Test Job #8649 (PHPBB3-PR-JOB1-8649)'
... running command line:
/bin/sh /home/bamboo/temp/PHPBB3-PR-JOB1-8649-ScriptBuildTask-4824438327737178503.sh
... in: /home/bamboo/xml-data/build-dir/PHPBB3-PR-JOB1
... using extra environment variables:
bamboo_planRepository_1_branch=3.1.x
bamboo_planRepository_1_branchDisplayName=3.1.x
bamboo_repository_revision_number=dc8ff9da28b8ab4ad11c7ea94cca526f17c87fe5
bamboo_PRref=feature/gsoc-pm
bamboo_resultsUrl=https://bamboo.phpbb.com/browse/PHPBB3-PR-JOB1-8649
bamboo_capability_system_builder_command_Git=/usr/bin/git
bamboo_repository_75956235_git_username=bantu
bamboo_build_working_directory=/home/bamboo/xml-data/build-dir/PHPBB3-PR-JOB1
bamboo_planRepository_1_name=phpBB Ascraeus
bamboo_buildKey=PHPBB3-PR-JOB1
bamboo_capability_phpbb_tests=true
bamboo_shortPlanName=Pull Requests
bamboo_capability_system_builder_command_fop=/usr/bin/fop
bamboo_capability_dbms_sqlite_2=true
bamboo_planRepository_name=phpBB Ascraeus
bamboo_PRnumber=5235
bamboo_buildNumber=8649
bamboo_repository_75956235_git_repositoryUrl=https://github.com/phpbb/phpbb.git
bamboo_capability_system_builder_phpunit_PHPUnit=/usr/bin/phpunit
bamboo_shortJobName=Build and Test Job
bamboo_buildResultsUrl=https://bamboo.phpbb.com/browse/PHPBB3-PR-JOB1-8649
bamboo_repository_75956235_branch_name=3.1.x
bamboo_planRepository_repositoryUrl=https://github.com/phpbb/phpbb.git
bamboo_agentId=131073
bamboo_planName=phpBB3 - Pull Requests
bamboo_build_commandline_com_atlassian_bamboo_plugins_scripttask_task_builder_script_7=/bin/sh /home/bamboo/temp/PHPBB3-PR-JOB1-8649-ScriptBuildTask-668329888075367092.sh
bamboo_shortPlanKey=PR
bamboo_shortJobKey=JOB1
bamboo_capability_dbms_mysql_55=true
bamboo_capability_system_jdk_JDK_1_7_0_65=/usr/lib/jvm/java-7-openjdk-amd64
bamboo_planRepository_revision=dc8ff9da28b8ab4ad11c7ea94cca526f17c87fe5
bamboo_buildTimeStamp=2018-08-11T07:10:38.691Z
bamboo_repository_previous_revision_number=dc8ff9da28b8ab4ad11c7ea94cca526f17c87fe5
bamboo_capability_system_jdk_JDK_1_6_0_16=/usr/lib/jvm/java-6-sun-1.6.0.16
bamboo_capability_system_builder_mvn2_Maven_2=/usr/share/maven2
bamboo_planRepository_previousRevision=dc8ff9da28b8ab4ad11c7ea94cca526f17c87fe5
bamboo_repository_git_branch=3.1.x
bamboo_buildResultKey=PHPBB3-PR-JOB1-8649
bamboo_repository_branch_name=3.1.x
bamboo_buildPlanName=phpBB3 - Pull Requests - Build and Test Job
bamboo_planRepository_1_revision=dc8ff9da28b8ab4ad11c7ea94cca526f17c87fe5
bamboo_repository_name=phpBB Ascraeus
bamboo_buildFailed=false
bamboo_capability_system_docker_executable=/usr/bin/docker
bamboo_planRepository_branch=3.1.x
bamboo_agentWorkingDirectory=/home/bamboo/xml-data/build-dir
bamboo_capability_system_git_executable=/usr/bin/git
bamboo_capability_system_builder_phpunit_PHPUnit_3_4=/usr/bin/phpunit
bamboo_repository_git_username=bantu
bamboo_planRepository_1_previousRevision=dc8ff9da28b8ab4ad11c7ea94cca526f17c87fe5
bamboo_repository_75956235_revision_number=dc8ff9da28b8ab4ad11c7ea94cca526f17c87fe5
bamboo_planRepository_branchDisplayName=3.1.x
bamboo_planRepository_1_type=gitv2
bamboo_planRepository_branchName=3.1.x
bamboo_repository_75956235_previous_revision_number=dc8ff9da28b8ab4ad11c7ea94cca526f17c87fe5
bamboo_capability_system_jdk_JDK=/usr/lib/jvm/java-6-sun
bamboo_plan_storageTag=PHPBB3-PR
bamboo_hg_cache_directory=/home/bamboo/xml-data/build-dir/_hg-repositories-cache
bamboo_planRepository_1_username=bantu
bamboo_planRepository_type=gitv2
bamboo_git_cache_directory=/home/bamboo/xml-data/build-dir/_git-repositories-cache
bamboo_ManualBuildTriggerReason_userName=Build Robot
bamboo_repository_git_repositoryUrl=https://github.com/phpbb/phpbb.git
bamboo_repository_75956235_git_branch=3.1.x
bamboo_capability_system_builder_ant_Ant=/usr/share/ant
bamboo_repository_75956235_name=phpBB Ascraeus
bamboo_tmp_directory=/home/bamboo/temp
bamboo_working_directory=/home/bamboo/xml-data/build-dir/PHPBB3-PR-JOB1
bamboo_planKey=PHPBB3-PR
bamboo_capability_local=true
bamboo_planRepository_1_repositoryUrl=https://github.com/phpbb/phpbb.git
bamboo_planRepository_username=bantu
bamboo_capability_system_jdk_JDK_1_6=/usr/lib/jvm/java-6-sun
bamboo_capability_system_jdk_JDK_1_7=/usr/lib/jvm/java-7-openjdk-amd64
bamboo_planRepository_1_branchName=3.1.x
11-Aug-2018 07:10:57 From https://github.com/phpbb/phpbb
11-Aug-2018 07:10:57 * branch            refs/pull/5235/merge -> FETCH_HEAD
11-Aug-2018 07:10:58 Note: checking out 'FETCH_HEAD'.
11-Aug-2018 07:10:58
11-Aug-2018 07:10:58 You are in 'detached HEAD' state. You can look around, make experimental
11-Aug-2018 07:10:58 changes and commit them, and you can discard any commits you make in this
11-Aug-2018 07:10:58 state without impacting any branches by performing another checkout.
11-Aug-2018 07:10:58
11-Aug-2018 07:10:58 If you want to create a new branch to retain commits you create, you may
11-Aug-2018 07:10:58 do so (now or later) by using -b with the checkout command again. Example:
11-Aug-2018 07:10:58
11-Aug-2018 07:10:58   git checkout -b new_branch_name
11-Aug-2018 07:10:58
11-Aug-2018 07:10:58 HEAD is now at 106eb3e... Merge 1c6686c50fc45d9079ad437764c0d6a1415c6d92 into 1b110139888dbe5ba6338d348287e43bdc193c2a
11-Aug-2018 07:10:58 Finished task 'Fetch PR' with result: Success
11-Aug-2018 07:10:58 Skipping execution of task 'Prepare directory' as it is disabled
11-Aug-2018 07:10:58
Substituting variable: ${bamboo.working.directory} with /home/bamboo/xml-data/build-dir/PHPBB3-PR-JOB1
11-Aug-2018 07:10:58 Starting task 'Prepare directory' of type 'com.atlassian.bamboo.plugins.bamboo-docker-plugin:task.docker.cli'
11-Aug-2018 07:10:58 Running image name (phpbb:php-5.6)
11-Aug-2018 07:10:58
Beginning to execute external process for build 'phpBB3 - Pull Requests - Build and Test Job #8649 (PHPBB3-PR-JOB1-8649)'
... running command line:
/usr/bin/docker run --volume /home/bamboo/xml-data/build-dir/PHPBB3-PR-JOB1:/data --workdir /data/phpBB --rm -e HOME=/home/bamboo -u=991 phpbb:php-5.6 /bin/bash -c php ../composer.phar install --dev; cd ../build; ../phpBB/vendor/bin/phing clean prepare
... in: /home/bamboo/xml-data/build-dir/PHPBB3-PR-JOB1
... using extra environment variables:
bamboo_planRepository_1_branch=3.1.x
bamboo_planRepository_1_branchDisplayName=3.1.x
bamboo_repository_revision_number=dc8ff9da28b8ab4ad11c7ea94cca526f17c87fe5
bamboo_PRref=feature/gsoc-pm
bamboo_resultsUrl=https://bamboo.phpbb.com/browse/PHPBB3-PR-JOB1-8649
bamboo_capability_system_builder_command_Git=/usr/bin/git
bamboo_repository_75956235_git_username=bantu
bamboo_build_working_directory=/home/bamboo/xml-data/build-dir/PHPBB3-PR-JOB1
bamboo_planRepository_1_name=phpBB Ascraeus
bamboo_buildKey=PHPBB3-PR-JOB1
bamboo_capability_phpbb_tests=true
bamboo_shortPlanName=Pull Requests
bamboo_capability_system_builder_command_fop=/usr/bin/fop
bamboo_capability_dbms_sqlite_2=true
bamboo_planRepository_name=phpBB Ascraeus
bamboo_PRnumber=5235
bamboo_buildNumber=8649
bamboo_repository_75956235_git_repositoryUrl=https://github.com/phpbb/phpbb.git
bamboo_capability_system_builder_phpunit_PHPUnit=/usr/bin/phpunit
bamboo_shortJobName=Build and Test Job
bamboo_buildResultsUrl=https://bamboo.phpbb.com/browse/PHPBB3-PR-JOB1-8649
bamboo_repository_75956235_branch_name=3.1.x
bamboo_planRepository_repositoryUrl=https://github.com/phpbb/phpbb.git
bamboo_agentId=131073
bamboo_planName=phpBB3 - Pull Requests
bamboo_build_commandline_com_atlassian_bamboo_plugins_scripttask_task_builder_script_7=/bin/sh /home/bamboo/temp/PHPBB3-PR-JOB1-8649-ScriptBuildTask-668329888075367092.sh
bamboo_shortPlanKey=PR
bamboo_shortJobKey=JOB1
bamboo_capability_dbms_mysql_55=true
bamboo_capability_system_jdk_JDK_1_7_0_65=/usr/lib/jvm/java-7-openjdk-amd64
bamboo_planRepository_revision=dc8ff9da28b8ab4ad11c7ea94cca526f17c87fe5
bamboo_buildTimeStamp=2018-08-11T07:10:38.691Z
bamboo_repository_previous_revision_number=dc8ff9da28b8ab4ad11c7ea94cca526f17c87fe5
bamboo_capability_system_jdk_JDK_1_6_0_16=/usr/lib/jvm/java-6-sun-1.6.0.16
bamboo_capability_system_builder_mvn2_Maven_2=/usr/share/maven2
bamboo_planRepository_previousRevision=dc8ff9da28b8ab4ad11c7ea94cca526f17c87fe5
bamboo_build_commandline_com_atlassian_bamboo_plugins_scripttask_task_builder_script_4=/bin/sh /home/bamboo/temp/PHPBB3-PR-JOB1-8649-ScriptBuildTask-4824438327737178503.sh
bamboo_repository_git_branch=3.1.x
bamboo_buildResultKey=PHPBB3-PR-JOB1-8649
bamboo_repository_branch_name=3.1.x
bamboo_buildPlanName=phpBB3 - Pull Requests - Build and Test Job
bamboo_planRepository_1_revision=dc8ff9da28b8ab4ad11c7ea94cca526f17c87fe5
bamboo_repository_name=phpBB Ascraeus
bamboo_buildFailed=false
bamboo_capability_system_docker_executable=/usr/bin/docker
bamboo_planRepository_branch=3.1.x
bamboo_agentWorkingDirectory=/home/bamboo/xml-data/build-dir
bamboo_capability_system_git_executable=/usr/bin/git
bamboo_capability_system_builder_phpunit_PHPUnit_3_4=/usr/bin/phpunit
bamboo_repository_git_username=bantu
bamboo_planRepository_1_previousRevision=dc8ff9da28b8ab4ad11c7ea94cca526f17c87fe5
bamboo_repository_75956235_revision_number=dc8ff9da28b8ab4ad11c7ea94cca526f17c87fe5
bamboo_planRepository_branchDisplayName=3.1.x
bamboo_planRepository_1_type=gitv2
bamboo_planRepository_branchName=3.1.x
bamboo_repository_75956235_previous_revision_number=dc8ff9da28b8ab4ad11c7ea94cca526f17c87fe5
bamboo_capability_system_jdk_JDK=/usr/lib/jvm/java-6-sun
bamboo_plan_storageTag=PHPBB3-PR
bamboo_hg_cache_directory=/home/bamboo/xml-data/build-dir/_hg-repositories-cache
bamboo_planRepository_1_username=bantu
bamboo_planRepository_type=gitv2
bamboo_git_cache_directory=/home/bamboo/xml-data/build-dir/_git-repositories-cache
bamboo_ManualBuildTriggerReason_userName=Build Robot
bamboo_repository_git_repositoryUrl=https://github.com/phpbb/phpbb.git
bamboo_repository_75956235_git_branch=3.1.x
bamboo_capability_system_builder_ant_Ant=/usr/share/ant
bamboo_repository_75956235_name=phpBB Ascraeus
bamboo_tmp_directory=/home/bamboo/temp
bamboo_working_directory=/home/bamboo/xml-data/build-dir/PHPBB3-PR-JOB1
bamboo_planKey=PHPBB3-PR
bamboo_capability_local=true
bamboo_planRepository_1_repositoryUrl=https://github.com/phpbb/phpbb.git
bamboo_planRepository_username=bantu
bamboo_capability_system_jdk_JDK_1_6=/usr/lib/jvm/java-6-sun
bamboo_capability_system_jdk_JDK_1_7=/usr/lib/jvm/java-7-openjdk-amd64
bamboo_planRepository_1_branchName=3.1.x
11-Aug-2018 07:11:02 Cannot create cache directory /home/bamboo/.composer/cache/repo/https---packagist.org/, or directory is not writable. Proceeding without cache
11-Aug-2018 07:11:02 Cannot create cache directory /home/bamboo/.composer/cache/files/, or directory is not writable. Proceeding without cache
11-Aug-2018 07:11:02 You are using the deprecated option "dev". Dev packages are installed by default now.
11-Aug-2018 07:11:02 Loading composer repositories with package information
11-Aug-2018 07:11:02 Installing dependencies (including require-dev) from lock file
11-Aug-2018 07:11:02 Package operations: 75 installs, 0 updates, 0 removals
11-Aug-2018 07:11:03   - Installing composer/installers (v1.5.0): Downloading (connecting...)Downloading (0%)           Downloading (5%)Downloading (20%)Downloading (25%)Downloading (30%)Downloading (50%)Downloading (55%)Downloading (60%)Downloading (75%)Downloading (80%)Downloading (100%)
11-Aug-2018 07:11:04   - Installing bantu/ini-get-wrapper (v1.0.1): Downloading (connecting...)Downloading (100%)         
11-Aug-2018 07:11:05   - Installing symfony/process (v3.4.3): Downloading (connecting...)Downloading (100%)         
11-Aug-2018 07:11:06   - Installing symfony/finder (v3.4.3): Downloading (connecting...)Downloading (0%)           Downloading (5%)Downloading (10%)Downloading (35%)Downloading (40%)Downloading (45%)Downloading (50%)Downloading (85%)Downloading (90%)Downloading (95%)Downloading (100%)
11-Aug-2018 07:11:06   - Installing symfony/filesystem (v3.4.3): Downloading (connecting...)Downloading (0%)           Downloading (5%)Downloading (100%)
11-Aug-2018 07:11:07   - Installing symfony/polyfill-mbstring (v1.7.0): Downloading (connecting...)Downloading (0%)           Downloading (20%)Downloading (40%)Downloading (60%)Downloading (80%)Downloading (100%)
11-Aug-2018 07:11:08   - Installing psr/log (1.0.2): Downloading (connecting...)Downloading (0%)           Downloading (15%)Downloading (100%)
11-Aug-2018 07:11:09   - Installing symfony/debug (v3.4.3): Downloading (connecting...)Downloading (100%)         
11-Aug-2018 07:11:10   - Installing symfony/console (v3.4.3): Downloading (connecting...)Downloading (100%)         
11-Aug-2018 07:11:11   - Installing seld/phar-utils (1.0.1): Downloading (connecting...)Downloading (0%)           Downloading (30%)Downloading (60%)Downloading (90%)Downloading (100%)
11-Aug-2018 07:11:11   - Installing seld/jsonlint (1.7.0): Downloading (connecting...)Downloading (100%)         
11-Aug-2018 07:11:12   - Installing seld/cli-prompt (1.0.3): Downloading (connecting...)Downloading (0%)           Downloading (15%)Downloading (30%)Downloading (100%)
11-Aug-2018 07:11:13   - Installing justinrainbow/json-schema (5.2.6): Downloading (connecting...)Downloading (0%)           Downloading (20%)Downloading (25%)Downloading (30%)Downloading (35%)Downloading (50%)Downloading (55%)Downloading (60%)Downloading (65%)Downloading (80%)Downloading (85%)Downloading (90%)Downloading (95%)Downloading (100%)
11-Aug-2018 07:11:14   - Installing composer/spdx-licenses (1.2.0): Downloading (connecting...)Downloading (100%)         
11-Aug-2018 07:11:14   - Installing composer/semver (1.4.2): Downloading (connecting...)Downloading (0%)           Downloading (35%)Downloading (75%)Downloading (100%)
11-Aug-2018 07:11:16   - Installing composer/ca-bundle (1.1.0): Downloading (connecting...)Downloading (0%)           Downloading (5%)Downloading (10%)Downloading (15%)Downloading (20%)Downloading (25%)Downloading (30%)Downloading (35%)Downloading (40%)Downloading (45%)Downloading (50%)Downloading (55%)Downloading (60%)Downloading (65%)Downloading (70%)Downloading (75%)Downloading (80%)Downloading (85%)Downloading (90%)Downloading (95%)Downloading (100%)
11-Aug-2018 07:11:17   - Installing composer/composer (1.6.2): Downloading (connecting...)Downloading (100%)         
11-Aug-2018 07:11:18   - Installing google/recaptcha (1.1.3): Downloading (connecting...)Downloading (100%)         
11-Aug-2018 07:11:19   - Installing guzzlehttp/promises (v1.3.1): Downloading (connecting...)Downloading (0%)           Downloading (30%)Downloading (60%)Downloading (80%)Downloading (100%)
11-Aug-2018 07:11:20   - Installing psr/http-message (1.0.1): Downloading (connecting...)Downloading (0%)           Downloading (50%)Downloading (75%)Downloading (100%)
11-Aug-2018 07:11:20   - Installing guzzlehttp/psr7 (1.4.2): Downloading (connecting...)Downloading (0%)           Downloading (5%)Downloading (10%)Downloading (15%)Downloading (20%)Downloading (50%)Downloading (55%)Downloading (60%)Downloading (65%)Downloading (85%)Downloading (90%)Downloading (95%)Downloading (100%)
11-Aug-2018 07:11:22   - Installing lusitanian/oauth (v0.8.10): Downloading (connecting...)Downloading (0%)           Downloading (5%)Downloading (10%)Downloading (15%)Downloading (30%)Downloading (40%)Downloading (45%)Downloading (50%)Downloading (55%)Downloading (60%)Downloading (65%)Downloading (70%)Downloading (75%)Downloading (85%)Downloading (90%)Downloading (100%)
11-Aug-2018 07:11:22   - Installing marc1706/fast-image-size (v1.1.4): Downloading (connecting...)Downloading (100%)         
11-Aug-2018 07:11:23   - Installing patchwork/utf8 (v1.3.1): Downloading (connecting...)Downloading (100%)         
11-Aug-2018 07:11:24   - Installing psr/container (1.0.0): Downloading (connecting...)Downloading (0%)           Downloading (75%)Downloading (100%)
11-Aug-2018 07:11:26   - Installing s9e/text-formatter (0.13.1): Downloading (connecting...)Downloading (100%)         
11-Aug-2018 07:11:27   - Installing symfony/config (v3.4.3): Downloading (connecting...)Downloading (100%)         
11-Aug-2018 07:11:28   - Installing paragonie/random_compat (v1.4.2): Downloading (connecting...)Downloading (0%)           Downloading (10%)Downloading (25%)Downloading (35%)Downloading (45%)Downloading (55%)Downloading (80%)Downloading (90%)Downloading (100%)
11-Aug-2018 07:11:28   - Installing symfony/polyfill-php70 (v1.6.0): Downloading (connecting...)Downloading (0%)           Downloading (85%)Downloading (100%)
11-Aug-2018 07:11:29   - Installing symfony/http-foundation (v3.4.3): Downloading (connecting...)Downloading (100%)         
11-Aug-2018 07:11:30   - Installing symfony/event-dispatcher (v3.4.3): Downloading (connecting...)Downloading (0%)           Downloading (5%)Downloading (45%)Downloading (50%)Downloading (100%)
11-Aug-2018 07:11:32   - Installing symfony/http-kernel (v3.4.3): Downloading (connecting...)Downloading (0%)           Downloading (5%)Downloading (10%)Downloading (15%)Downloading (20%)Downloading (25%)Downloading (30%)Downloading (35%)Downloading (40%)Downloading (45%)Downloading (50%)Downloading (55%)Downloading (60%)Downloading (65%)Downloading (70%)Downloading (75%)Downloading (80%)Downloading (85%)Downloading (90%)Downloading (95%)Downloading (100%)
11-Aug-2018 07:11:33   - Installing symfony/dependency-injection (v3.4.3): Downloading (connecting...)Downloading (100%)         
11-Aug-2018 07:11:34   - Installing zendframework/zend-eventmanager (3.2.0): Downloading (connecting...)Downloading (0%)           Downloading (25%)Downloading (35%)Downloading (45%)Downloading (70%)Downloading (80%)Downloading (100%)
11-Aug-2018 07:11:36   - Installing zendframework/zend-code (2.6.3): Downloading (connecting...)Downloading (0%)           Downloading (5%)Downloading (10%)Downloading (15%)Downloading (20%)Downloading (25%)Downloading (35%)Downloading (40%)Downloading (45%)Downloading (50%)Downloading (55%)Downloading (60%)Downloading (70%)Downloading (75%)Downloading (80%)Downloading (85%)Downloading (90%)Downloading (95%)Downloading (100%)
11-Aug-2018 07:11:36   - Installing ocramius/proxy-manager (1.0.2): Downloading (connecting...)Downloading (100%)         
11-Aug-2018 07:11:37   - Installing symfony/proxy-manager-bridge (v3.4.3): Downloading (connecting...)Downloading (100%)         
11-Aug-2018 07:11:39   - Installing symfony/routing (v3.4.3): Downloading (connecting...)Downloading (100%)         
11-Aug-2018 07:11:40   - Installing twig/twig (v1.35.0): Downloading (connecting...)Downloading (0%)           Downloading (5%)Downloading (10%)Downloading (15%)Downloading (20%)Downloading (25%)Downloading (30%)Downloading (35%)Downloading (40%)Downloading (45%)Downloading (50%)Downloading (55%)Downloading (60%)Downloading (65%)Downloading (70%)Downloading (80%)Downloading (85%)Downloading (95%)Downloading (100%)
11-Aug-2018 07:11:41   - Installing symfony/twig-bridge (v3.4.3): Downloading (connecting...)Downloading (100%)         
11-Aug-2018 07:11:42   - Installing symfony/dom-crawler (v3.4.3): Downloading (connecting...)Downloading (0%)           Downloading (5%)Downloading (35%)Downloading (45%)Downloading (50%)Downloading (70%)Downloading (90%)Downloading (95%)Downloading (100%)
11-Aug-2018 07:11:43   - Installing symfony/css-selector (v3.4.3): Downloading (connecting...)Downloading (100%)         
11-Aug-2018 07:11:44   - Installing symfony/browser-kit (v3.4.3): Downloading (connecting...)Downloading (0%)           Downloading (5%)Downloading (90%)Downloading (95%)Downloading (100%)
11-Aug-2018 07:11:45   - Installing guzzlehttp/guzzle (6.3.0): Downloading (connecting...)Downloading (0%)           Downloading (5%)Downloading (15%)Downloading (20%)Downloading (30%)Downloading (35%)Downloading (45%)Downloading (50%)Downloading (60%)Downloading (65%)Downloading (75%)Downloading (80%)Downloading (90%)Downloading (95%)Downloading (100%)
11-Aug-2018 07:11:45   - Installing fabpot/goutte (v3.2.2): Downloading (connecting...)Downloading (0%)           Downloading (55%)Downloading (90%)Downloading (100%)
11-Aug-2018 07:11:47   - Installing facebook/webdriver (1.5.0): Downloading (connecting...)Downloading (0%)           Downloading (5%)Downloading (10%)Downloading (15%)Downloading (20%)Downloading (25%)Downloading (30%)Downloading (35%)Downloading (40%)Downloading (45%)Downloading (50%)Downloading (55%)Downloading (60%)Downloading (65%)Downloading (70%)Downloading (75%)Downloading (80%)Downloading (85%)Downloading (90%)Downloading (95%)Downloading (100%)
11-Aug-2018 07:11:48   - Installing laravel/homestead (v4.0.5): Downloading (connecting...)Downloading (100%)         
11-Aug-2018 07:11:49   - Installing phing/phing (2.4.14): Downloading (connecting...)Downloading (100%)         
11-Aug-2018 07:11:50   - Installing webmozart/assert (1.2.0): Downloading (connecting...)Downloading (0%)           Downloading (55%)Downloading (80%)Downloading (100%)
11-Aug-2018 07:11:51   - Installing phpdocumentor/reflection-common (1.0.1): Downloading (connecting...)Downloading (0%)           Downloading (100%)
11-Aug-2018 07:11:52   - Installing phpdocumentor/type-resolver (0.4.0): Downloading (connecting...)Downloading (0%)           Downloading (5%)Downloading (80%)Downloading (85%)Downloading (90%)Downloading (100%)
11-Aug-2018 07:11:53   - Installing phpdocumentor/reflection-docblock (3.3.2): Downloading (connecting...)Downloading (0%)           Downloading (5%)Downloading (10%)Downloading (15%)Downloading (45%)Downloading (50%)Downloading (55%)Downloading (60%)Downloading (65%)Downloading (100%)
11-Aug-2018 07:11:54   - Installing symfony/yaml (v3.4.3): Downloading (connecting...)Downloading (0%)           Downloading (5%)Downloading (10%)Downloading (15%)Downloading (20%)Downloading (25%)Downloading (30%)Downloading (35%)Downloading (40%)Downloading (45%)Downloading (50%)Downloading (55%)Downloading (60%)Downloading (65%)Downloading (70%)Downloading (75%)Downloading (80%)Downloading (85%)Downloading (90%)Downloading (95%)Downloading (100%)
11-Aug-2018 07:11:54   - Installing sebastian/version (2.0.1): Downloading (connecting...)Downloading (0%)           Downloading (100%)
11-Aug-2018 07:11:55   - Installing sebastian/resource-operations (1.0.0): Downloading (connecting...)Downloading (0%)           Downloading (65%)Downloading (100%)
11-Aug-2018 07:11:55   - Installing sebastian/recursion-context (2.0.0): Downloading (connecting...)Downloading (0%)           Downloading (100%)
11-Aug-2018 07:11:56   - Installing sebastian/object-enumerator (2.0.1): Downloading (connecting...)Downloading (0%)           Downloading (95%)Downloading (100%)
11-Aug-2018 07:11:57   - Installing sebastian/global-state (1.1.1): Downloading (connecting...)Downloading (0%)           Downloading (40%)Downloading (70%)Downloading (100%)
11-Aug-2018 07:11:57   - Installing sebastian/exporter (2.0.0): Downloading (connecting...)Downloading (0%)           Downloading (100%)
11-Aug-2018 07:11:58   - Installing sebastian/environment (2.0.0): Downloading (connecting...)Downloading (0%)           Downloading (15%)Downloading (30%)Downloading (45%)Downloading (60%)Downloading (75%)Downloading (90%)Downloading (100%)
11-Aug-2018 07:11:58   - Installing sebastian/diff (1.4.3): Downloading (connecting...)Downloading (0%)           Downloading (35%)Downloading (50%)Downloading (85%)Downloading (90%)Downloading (100%)
11-Aug-2018 07:12:01   - Installing sebastian/comparator (1.2.4): Downloading (connecting...)Downloading (0%)           Downloading (10%)Downloading (75%)Downloading (100%)
11-Aug-2018 07:12:01   - Installing phpunit/php-text-template (1.2.1): Downloading (connecting...)Downloading (0%)           Downloading (35%)Downloading (100%)
11-Aug-2018 07:12:02   - Installing doctrine/instantiator (1.0.5): Downloading (connecting...)Downloading (0%)           Downloading (15%)Downloading (30%)Downloading (45%)Downloading (50%)Downloading (65%)Downloading (80%)Downloading (95%)Downloading (100%)
11-Aug-2018 07:12:03   - Installing phpunit/phpunit-mock-objects (3.4.4): Downloading (connecting...)Downloading (0%)           Downloading (5%)Downloading (10%)Downloading (15%)Downloading (20%)Downloading (25%)Downloading (30%)Downloading (40%)Downloading (45%)Downloading (50%)Downloading (55%)Downloading (60%)Downloading (65%)Downloading (70%)Downloading (75%)Downloading (80%)Downloading (85%)Downloading (90%)Downloading (95%)Downloading (100%)
11-Aug-2018 07:12:04   - Installing phpunit/php-timer (1.0.9): Downloading (connecting...)Downloading (0%)           Downloading (45%)Downloading (90%)Downloading (100%)
11-Aug-2018 07:12:05   - Installing phpunit/php-file-iterator (1.4.5): Downloading (connecting...)Downloading (0%)           Downloading (90%)Downloading (100%)
11-Aug-2018 07:12:05   - Installing sebastian/code-unit-reverse-lookup (1.0.1): Downloading (connecting...)Downloading (0%)           Downloading (55%)Downloading (100%)
11-Aug-2018 07:12:06   - Installing phpunit/php-token-stream (1.4.12): Downloading (connecting...)Downloading (100%)         
11-Aug-2018 07:12:08   - Installing phpunit/php-code-coverage (4.0.8): Downloading (connecting...)Downloading (0%)           Downloading (5%)Downloading (10%)Downloading (15%)Downloading (20%)Downloading (25%)Downloading (30%)Downloading (35%)Downloading (40%)Downloading (45%)Downloading (50%)Downloading (55%)Downloading (60%)Downloading (65%)Downloading (70%)Downloading (75%)Downloading (80%)Downloading (85%)Downloading (90%)Downloading (95%)Downloading (100%)
11-Aug-2018 07:12:09   - Installing phpspec/prophecy (1.7.5): Downloading (connecting...)Downloading (0%)           Downloading (10%)Downloading (15%)Downloading (20%)Downloading (25%)Downloading (35%)Downloading (40%)Downloading (45%)Downloading (50%)Downloading (55%)Downloading (65%)Downloading (75%)Downloading (85%)Downloading (90%)Downloading (95%)Downloading (100%)
11-Aug-2018 07:12:10   - Installing myclabs/deep-copy (1.7.0): Downloading (connecting...)Downloading (0%)           Downloading (15%)Downloading (20%)Downloading (35%)Downloading (40%)Downloading (45%)Downloading (50%)Downloading (60%)Downloading (75%)Downloading (80%)Downloading (95%)Downloading (100%)
11-Aug-2018 07:12:13   - Installing phpunit/phpunit (5.7.26): Downloading (connecting...)Downloading (0%)           Downloading (5%)Downloading (10%)Downloading (15%)Downloading (20%)Downloading (25%)Downloading (30%)Downloading (35%)Downloading (40%)Downloading (45%)Downloading (50%)Downloading (55%)Downloading (60%)Downloading (65%)Downloading (70%)Downloading (75%)Downloading (80%)Downloading (85%)Downloading (90%)Downloading (95%)Downloading (100%)
11-Aug-2018 07:12:14   - Installing phpunit/dbunit (2.0.3): Downloading (connecting...)Downloading (0%)           Downloading (5%)Downloading (10%)Downloading (15%)Downloading (20%)Downloading (25%)Downloading (30%)Downloading (35%)Downloading (40%)Downloading (45%)Downloading (50%)Downloading (55%)Downloading (60%)Downloading (65%)Downloading (70%)Downloading (75%)Downloading (80%)Downloading (85%)Downloading (90%)Downloading (95%)Downloading (100%)
11-Aug-2018 07:12:15   - Installing squizlabs/php_codesniffer (2.9.1): Downloading (connecting...)Downloading (0%)           Downloading (5%)Downloading (10%)Downloading (15%)Downloading (20%)Downloading (25%)Downloading (30%)Downloading (35%)Downloading (40%)Downloading (45%)Downloading (50%)Downloading (55%)Downloading (60%)Downloading (65%)Downloading (70%)Downloading (75%)Downloading (80%)Downloading (85%)Downloading (90%)Downloading (95%)Downloading (100%)
11-Aug-2018 07:12:16 symfony/console suggests installing symfony/lock ()
11-Aug-2018 07:12:16 lusitanian/oauth suggests installing predis/predis (Allows using the Redis storage backend.)
11-Aug-2018 07:12:16 patchwork/utf8 suggests installing ext-intl (Use Intl for best performance)
11-Aug-2018 07:12:16 patchwork/utf8 suggests installing ext-wfio (Use WFIO for UTF-8 filesystem access on Windows)
11-Aug-2018 07:12:16 s9e/text-formatter suggests installing ext-intl (Allows international URLs to be accepted by the URL filter)
11-Aug-2018 07:12:16 s9e/text-formatter suggests installing ext-xsl (Enables the XSLT renderer)
11-Aug-2018 07:12:16 paragonie/random_compat suggests installing ext-libsodium (Provides a modern crypto API that can be used to generate random bytes.)
11-Aug-2018 07:12:16 symfony/http-kernel suggests installing symfony/var-dumper ()
11-Aug-2018 07:12:16 symfony/dependency-injection suggests installing symfony/expression-language (For using expressions in service container configuration)
11-Aug-2018 07:12:16 zendframework/zend-eventmanager suggests installing container-interop/container-interop (^1.1.0, to use the lazy listeners feature)
11-Aug-2018 07:12:16 zendframework/zend-eventmanager suggests installing zendframework/zend-stdlib (^2.7.3 || ^3.0, to use the FilterChain feature)
11-Aug-2018 07:12:16 zendframework/zend-code suggests installing doctrine/annotations (Doctrine\Common\Annotations >=1.0 for annotation features)
11-Aug-2018 07:12:16 zendframework/zend-code suggests installing zendframework/zend-stdlib (Zend\Stdlib component)
11-Aug-2018 07:12:16 ocramius/proxy-manager suggests installing ocramius/generated-hydrator (To have very fast object to array to object conversion for ghost objects)
11-Aug-2018 07:12:16 ocramius/proxy-manager suggests installing zendframework/zend-json (To have the JsonRpc adapter (Remote Object feature))
11-Aug-2018 07:12:16 ocramius/proxy-manager suggests installing zendframework/zend-soap (To have the Soap adapter (Remote Object feature))
11-Aug-2018 07:12:16 ocramius/proxy-manager suggests installing zendframework/zend-stdlib (To use the hydrator proxy)
11-Aug-2018 07:12:16 ocramius/proxy-manager suggests installing zendframework/zend-xmlrpc (To have the XmlRpc adapter (Remote Object feature))
11-Aug-2018 07:12:16 symfony/routing suggests installing doctrine/annotations (For using the annotation loader)
11-Aug-2018 07:12:16 symfony/routing suggests installing symfony/expression-language (For using expression matching)
11-Aug-2018 07:12:16 symfony/twig-bridge suggests installing symfony/asset (For using the AssetExtension)
11-Aug-2018 07:12:16 symfony/twig-bridge suggests installing symfony/expression-language (For using the ExpressionExtension)
11-Aug-2018 07:12:16 symfony/twig-bridge suggests installing symfony/form (For using the FormExtension)
11-Aug-2018 07:12:16 symfony/twig-bridge suggests installing symfony/security (For using the SecurityExtension)
11-Aug-2018 07:12:16 symfony/twig-bridge suggests installing symfony/stopwatch (For using the StopwatchExtension)
11-Aug-2018 07:12:16 symfony/twig-bridge suggests installing symfony/templating (For using the TwigEngine)
11-Aug-2018 07:12:16 symfony/twig-bridge suggests installing symfony/translation (For using the TranslationExtension)
11-Aug-2018 07:12:16 symfony/twig-bridge suggests installing symfony/var-dumper (For using the DumpExtension)
11-Aug-2018 07:12:16 symfony/twig-bridge suggests installing symfony/web-link (For using the WebLinkExtension)
11-Aug-2018 07:12:16 sebastian/global-state suggests installing ext-uopz (*)
11-Aug-2018 07:12:16 phpunit/phpunit-mock-objects suggests installing ext-soap (*)
11-Aug-2018 07:12:16 phpunit/phpunit suggests installing phpunit/php-invoker (~1.1)
11-Aug-2018 07:12:16 Generating autoload files
11-Aug-2018 07:12:16 Buildfile: /data/build/build.xml
11-Aug-2018 07:12:16
11-Aug-2018 07:12:16 phpBB > clean:
11-Aug-2018 07:12:16
11-Aug-2018 07:12:16    [delete] Directory /data/build/logs does not exist or is not a directory.
11-Aug-2018 07:12:16    [delete] Directory /data/build/api does not exist or is not a directory.
11-Aug-2018 07:12:16    [delete] Directory /data/build/codebrowser does not exist or is not a directory.
11-Aug-2018 07:12:16    [delete] Directory /data/build/coverage does not exist or is not a directory.
11-Aug-2018 07:12:16    [delete] Directory /data/build/cpd does not exist or is not a directory.
11-Aug-2018 07:12:16    [delete] Directory /data/build/dependencies does not exist or is not a directory.
11-Aug-2018 07:12:16    [delete] Directory /data/build/new_version does not exist or is not a directory.
11-Aug-2018 07:12:16    [delete] Directory /data/build/old_versions does not exist or is not a directory.
11-Aug-2018 07:12:16    [delete] Directory /data/build/save does not exist or is not a directory.
11-Aug-2018 07:12:16
11-Aug-2018 07:12:16 phpBB > prepare:
11-Aug-2018 07:12:16
11-Aug-2018 07:12:16     [mkdir] Created dir: /data/build/logs
11-Aug-2018 07:12:16     [mkdir] Created dir: /data/build/api
11-Aug-2018 07:12:16     [mkdir] Created dir: /data/build/codebrowser
11-Aug-2018 07:12:16     [mkdir] Created dir: /data/build/coverage
11-Aug-2018 07:12:16     [mkdir] Created dir: /data/build/cpd
11-Aug-2018 07:12:16     [mkdir] Created dir: /data/build/dependencies
11-Aug-2018 07:12:16     [mkdir] Created dir: /data/build/new_version
11-Aug-2018 07:12:16     [mkdir] Created dir: /data/build/new_version/files
11-Aug-2018 07:12:16     [mkdir] Created dir: /data/build/new_version/patches
11-Aug-2018 07:12:16     [mkdir] Created dir: /data/build/new_version/release_files
11-Aug-2018 07:12:16     [mkdir] Created dir: /data/build/new_version/update
11-Aug-2018 07:12:16     [mkdir] Created dir: /data/build/old_versions
11-Aug-2018 07:12:16     [mkdir] Created dir: /data/build/save
11-Aug-2018 07:12:16
11-Aug-2018 07:12:16 BUILD FINISHED
11-Aug-2018 07:12:16
11-Aug-2018 07:12:16 Total time: 0.1252 seconds
11-Aug-2018 07:12:16
11-Aug-2018 07:12:17 Finished task 'Prepare directory' with result: Success
11-Aug-2018 07:12:17 Skipping execution of task 'Run sniffs' as it is disabled
11-Aug-2018 07:12:17
Substituting variable: ${bamboo.working.directory} with /home/bamboo/xml-data/build-dir/PHPBB3-PR-JOB1
11-Aug-2018 07:12:17 Starting task 'Run sniffs' of type 'com.atlassian.bamboo.plugins.bamboo-docker-plugin:task.docker.cli'
11-Aug-2018 07:12:17 Running image name (phpbb:php-5.6)
11-Aug-2018 07:12:17
Beginning to execute external process for build 'phpBB3 - Pull Requests - Build and Test Job #8649 (PHPBB3-PR-JOB1-8649)'
... running command line:
/usr/bin/docker run --volume /home/bamboo/xml-data/build-dir/PHPBB3-PR-JOB1:/data --workdir /data/build --rm -u=991 phpbb:php-5.6 ../phpBB/vendor/bin/phing sniff
... in: /home/bamboo/xml-data/build-dir/PHPBB3-PR-JOB1
... using extra environment variables:
bamboo_planRepository_1_branch=3.1.x
bamboo_planRepository_1_branchDisplayName=3.1.x
bamboo_repository_revision_number=dc8ff9da28b8ab4ad11c7ea94cca526f17c87fe5
bamboo_PRref=feature/gsoc-pm
bamboo_resultsUrl=https://bamboo.phpbb.com/browse/PHPBB3-PR-JOB1-8649
bamboo_capability_system_builder_command_Git=/usr/bin/git
bamboo_repository_75956235_git_username=bantu
bamboo_build_working_directory=/home/bamboo/xml-data/build-dir/PHPBB3-PR-JOB1
bamboo_planRepository_1_name=phpBB Ascraeus
bamboo_buildKey=PHPBB3-PR-JOB1
bamboo_capability_phpbb_tests=true
bamboo_shortPlanName=Pull Requests
bamboo_capability_system_builder_command_fop=/usr/bin/fop
bamboo_capability_dbms_sqlite_2=true
bamboo_planRepository_name=phpBB Ascraeus
bamboo_PRnumber=5235
bamboo_buildNumber=8649
bamboo_repository_75956235_git_repositoryUrl=https://github.com/phpbb/phpbb.git
bamboo_capability_system_builder_phpunit_PHPUnit=/usr/bin/phpunit
bamboo_shortJobName=Build and Test Job
bamboo_buildResultsUrl=https://bamboo.phpbb.com/browse/PHPBB3-PR-JOB1-8649
bamboo_repository_75956235_branch_name=3.1.x
bamboo_planRepository_repositoryUrl=https://github.com/phpbb/phpbb.git
bamboo_agentId=131073
bamboo_planName=phpBB3 - Pull Requests
bamboo_build_commandline_com_atlassian_bamboo_plugins_scripttask_task_builder_script_7=/bin/sh /home/bamboo/temp/PHPBB3-PR-JOB1-8649-ScriptBuildTask-668329888075367092.sh
bamboo_shortPlanKey=PR
bamboo_shortJobKey=JOB1
bamboo_capability_dbms_mysql_55=true
bamboo_capability_system_jdk_JDK_1_7_0_65=/usr/lib/jvm/java-7-openjdk-amd64
bamboo_planRepository_revision=dc8ff9da28b8ab4ad11c7ea94cca526f17c87fe5
bamboo_buildTimeStamp=2018-08-11T07:10:38.691Z
bamboo_repository_previous_revision_number=dc8ff9da28b8ab4ad11c7ea94cca526f17c87fe5
bamboo_capability_system_jdk_JDK_1_6_0_16=/usr/lib/jvm/java-6-sun-1.6.0.16
bamboo_capability_system_builder_mvn2_Maven_2=/usr/share/maven2
bamboo_planRepository_previousRevision=dc8ff9da28b8ab4ad11c7ea94cca526f17c87fe5
bamboo_build_commandline_com_atlassian_bamboo_plugins_scripttask_task_builder_script_4=/bin/sh /home/bamboo/temp/PHPBB3-PR-JOB1-8649-ScriptBuildTask-4824438327737178503.sh
bamboo_repository_git_branch=3.1.x
bamboo_buildResultKey=PHPBB3-PR-JOB1-8649
bamboo_repository_branch_name=3.1.x
bamboo_buildPlanName=phpBB3 - Pull Requests - Build and Test Job
bamboo_planRepository_1_revision=dc8ff9da28b8ab4ad11c7ea94cca526f17c87fe5
bamboo_repository_name=phpBB Ascraeus
bamboo_buildFailed=false
bamboo_capability_system_docker_executable=/usr/bin/docker
bamboo_build_commandline_com_atlassian_bamboo_plugins_bamboo_docker_plugin_task_docker_cli_12=/usr/bin/docker run --volume /home/bamboo/xml-data/build-dir/PHPBB3-PR-JOB1:/data --workdir /data/phpBB --rm -e HOME=/home/bamboo -u=991 phpbb:php-5.6 /bin/bash -c php ../composer.phar install --dev; cd ../build; ../phpBB/vendor/bin/phing clean prepare
bamboo_planRepository_branch=3.1.x
bamboo_agentWorkingDirectory=/home/bamboo/xml-data/build-dir
bamboo_capability_system_git_executable=/usr/bin/git
bamboo_capability_system_builder_phpunit_PHPUnit_3_4=/usr/bin/phpunit
bamboo_repository_git_username=bantu
bamboo_planRepository_1_previousRevision=dc8ff9da28b8ab4ad11c7ea94cca526f17c87fe5
bamboo_repository_75956235_revision_number=dc8ff9da28b8ab4ad11c7ea94cca526f17c87fe5
bamboo_planRepository_branchDisplayName=3.1.x
bamboo_planRepository_1_type=gitv2
bamboo_planRepository_branchName=3.1.x
bamboo_repository_75956235_previous_revision_number=dc8ff9da28b8ab4ad11c7ea94cca526f17c87fe5
bamboo_capability_system_jdk_JDK=/usr/lib/jvm/java-6-sun
bamboo_plan_storageTag=PHPBB3-PR
bamboo_hg_cache_directory=/home/bamboo/xml-data/build-dir/_hg-repositories-cache
bamboo_planRepository_1_username=bantu
bamboo_planRepository_type=gitv2
bamboo_git_cache_directory=/home/bamboo/xml-data/build-dir/_git-repositories-cache
bamboo_ManualBuildTriggerReason_userName=Build Robot
bamboo_repository_git_repositoryUrl=https://github.com/phpbb/phpbb.git
bamboo_repository_75956235_git_branch=3.1.x
bamboo_capability_system_builder_ant_Ant=/usr/share/ant
bamboo_repository_75956235_name=phpBB Ascraeus
bamboo_tmp_directory=/home/bamboo/temp
bamboo_working_directory=/home/bamboo/xml-data/build-dir/PHPBB3-PR-JOB1
bamboo_planKey=PHPBB3-PR
bamboo_capability_local=true
bamboo_planRepository_1_repositoryUrl=https://github.com/phpbb/phpbb.git
bamboo_planRepository_username=bantu
bamboo_capability_system_jdk_JDK_1_6=/usr/lib/jvm/java-6-sun
bamboo_capability_system_jdk_JDK_1_7=/usr/lib/jvm/java-7-openjdk-amd64
bamboo_planRepository_1_branchName=3.1.x
11-Aug-2018 07:12:17 Buildfile: /data/build/build.xml
11-Aug-2018 07:12:17
11-Aug-2018 07:12:17 phpBB > sniff:
11-Aug-2018 07:12:17
11-Aug-2018 07:12:25 ............................................................  60 / 750 (8%)
11-Aug-2018 07:12:26 ............................................................ 120 / 750 (16%)
11-Aug-2018 07:12:26 ............................................................ 180 / 750 (24%)
11-Aug-2018 07:12:27 ............................................................ 240 / 750 (32%)
11-Aug-2018 07:12:30 ............................................................ 300 / 750 (40%)
11-Aug-2018 07:12:36 ............................................................ 360 / 750 (48%)
11-Aug-2018 07:12:42 ............................................................ 420 / 750 (56%)
11-Aug-2018 07:12:45 ............................................................ 480 / 750 (64%)
11-Aug-2018 07:12:49 ............................................................ 540 / 750 (72%)
11-Aug-2018 07:12:53 ............................................................ 600 / 750 (80%)
11-Aug-2018 07:12:57 ............................................................ 660 / 750 (88%)
11-Aug-2018 07:13:00 ............................................................ 720 / 750 (96%)
11-Aug-2018 07:13:01 ..............................
11-Aug-2018 07:13:01
11-Aug-2018 07:13:01 Time: 43.99 secs; Memory: 63.75Mb
11-Aug-2018 07:13:01
11-Aug-2018 07:13:09 ............................................................  60 / 209 (29%)
11-Aug-2018 07:13:28 .......E.................................................... 120 / 209 (57%)
11-Aug-2018 07:13:41 ............................................................ 180 / 209 (86%)
11-Aug-2018 07:13:49 ......................E......
11-Aug-2018 07:13:49
11-Aug-2018 07:13:49
11-Aug-2018 07:13:49 FILE: /data/phpBB/includes/functions_privmsgs.php
11-Aug-2018 07:13:49 ----------------------------------------------------------------------
11-Aug-2018 07:13:49 FOUND 1 ERROR AFFECTING 1 LINE
11-Aug-2018 07:13:49 ----------------------------------------------------------------------
11-Aug-2018 07:13:49 934 | ERROR | There should be exactly one space between the keyword and
11-Aug-2018 07:13:49      |       | opening parenthesis
11-Aug-2018 07:13:49      |       | (phpbb.ControlStructures.OpeningParenthesis.NoSpaceBeforeOpeningParenthesis)
11-Aug-2018 07:13:49 ----------------------------------------------------------------------
11-Aug-2018 07:13:49
11-Aug-2018 07:13:49
11-Aug-2018 07:13:49 FILE: /data/phpBB/includes/ucp/ucp_pm_viewfolder.php
11-Aug-2018 07:13:49 ----------------------------------------------------------------------
11-Aug-2018 07:13:49 FOUND 1 ERROR AFFECTING 1 LINE
11-Aug-2018 07:13:49 ----------------------------------------------------------------------
11-Aug-2018 07:13:49 590 | ERROR | [x] Whitespace found at end of line
11-Aug-2018 07:13:49      |       |     (Squiz.WhiteSpace.SuperfluousWhitespace.EndLine)
11-Aug-2018 07:13:49 ----------------------------------------------------------------------
11-Aug-2018 07:13:49 PHPCBF CAN FIX THE 1 MARKED SNIFF VIOLATIONS AUTOMATICALLY
11-Aug-2018 07:13:49 ----------------------------------------------------------------------
11-Aug-2018 07:13:49
11-Aug-2018 07:13:49 Time: 47.77 secs; Memory: 60.5Mb
11-Aug-2018 07:13:49
11-Aug-2018 07:13:49
11-Aug-2018 07:13:49
11-Aug-2018 07:13:49 Time: 18ms; Memory: 3.75Mb
11-Aug-2018 07:13:49
11-Aug-2018 07:13:49        [if] Error in IfTask
11-Aug-2018 07:13:49 Execution of target "sniff" failed for the following reason: /data/build/build.xml:109:6: /data/build/build.xml:115:9: PHP Code Sniffer failed.
11-Aug-2018 07:13:49
11-Aug-2018 07:13:49 BUILD FAILED
11-Aug-2018 07:13:49 /data/build/build.xml:109:6: /data/build/build.xml:115:9: PHP Code Sniffer failed.
11-Aug-2018 07:13:49 Total time: 2 minutes  32.10 seconds
11-Aug-2018 07:13:49
11-Aug-2018 07:13:49 Error occurred while running Task 'Run sniffs(11)' of type com.atlassian.bamboo.plugins.bamboo-docker-plugin:task.docker.cli.
11-Aug-2018 07:13:49 com.atlassian.bamboo.task.TaskException: Failed to execute task
11-Aug-2018 07:13:49         at com.atlassian.bamboo.plugins.docker.service.RunService.execute(RunService.java:75)
11-Aug-2018 07:13:49         at com.atlassian.bamboo.plugins.docker.tasks.cli.DockerCliTask.execute(DockerCliTask.java:70)
11-Aug-2018 07:13:49         at com.atlassian.bamboo.task.TaskExecutorImpl.lambda$executeTasks$3(TaskExecutorImpl.java:285)
11-Aug-2018 07:13:49         at com.atlassian.bamboo.task.TaskExecutorImpl.executeTaskWithPrePostActions(TaskExecutorImpl.java:224)
11-Aug-2018 07:13:49         at com.atlassian.bamboo.task.TaskExecutorImpl.executeTasks(TaskExecutorImpl.java:285)
11-Aug-2018 07:13:49         at com.atlassian.bamboo.task.TaskExecutorImpl.execute(TaskExecutorImpl.java:112)
11-Aug-2018 07:13:49         at com.atlassian.bamboo.build.pipeline.tasks.ExecuteBuildTask.call(ExecuteBuildTask.java:71)
11-Aug-2018 07:13:49         at com.atlassian.bamboo.v2.build.agent.DefaultBuildAgent.executeBuildPhase(DefaultBuildAgent.java:203)
11-Aug-2018 07:13:49         at com.atlassian.bamboo.v2.build.agent.DefaultBuildAgent.build(DefaultBuildAgent.java:175)
11-Aug-2018 07:13:49         at com.atlassian.bamboo.v2.build.agent.BuildAgentControllerImpl.lambda$waitAndPerformBuild$0(BuildAgentControllerImpl.java:122)
11-Aug-2018 07:13:49         at com.atlassian.bamboo.variable.CustomVariableContextImpl.withVariableSubstitutor(CustomVariableContextImpl.java:185)
11-Aug-2018 07:13:49         at com.atlassian.bamboo.v2.build.agent.BuildAgentControllerImpl.waitAndPerformBuild(BuildAgentControllerImpl.java:117)
11-Aug-2018 07:13:49         at com.atlassian.bamboo.v2.build.agent.DefaultBuildAgent$1.run(DefaultBuildAgent.java:126)
11-Aug-2018 07:13:49         at com.atlassian.bamboo.utils.BambooRunnables$1.run(BambooRunnables.java:48)
11-Aug-2018 07:13:49         at com.atlassian.bamboo.security.ImpersonationHelper.runWith(ImpersonationHelper.java:26)
11-Aug-2018 07:13:49         at com.atlassian.bamboo.security.ImpersonationHelper.runWithSystemAuthority(ImpersonationHelper.java:17)
11-Aug-2018 07:13:49         at com.atlassian.bamboo.security.ImpersonationHelper$1.run(ImpersonationHelper.java:41)
11-Aug-2018 07:13:49         at java.lang.Thread.run(Thread.java:748)
11-Aug-2018 07:13:49 Caused by: com.atlassian.bamboo.docker.DockerException: Error running Docker run command
11-Aug-2018 07:13:49         at com.atlassian.bamboo.docker.DockerContainerServiceImpl.run(DockerContainerServiceImpl.java:118)
11-Aug-2018 07:13:49         at sun.reflect.GeneratedMethodAccessor2599.invoke(Unknown Source)
11-Aug-2018 07:13:49         at sun.reflect.DelegatingMethodAccessorImpl.invoke(DelegatingMethodAccessorImpl.java:43)
11-Aug-2018 07:13:49         at java.lang.reflect.Method.invoke(Method.java:498)
11-Aug-2018 07:13:49         at com.atlassian.plugin.util.ContextClassLoaderSettingInvocationHandler.invoke(ContextClassLoaderSettingInvocationHandler.java:26)
11-Aug-2018 07:13:49         at com.sun.proxy.$Proxy401.run(Unknown Source)
11-Aug-2018 07:13:49         at sun.reflect.GeneratedMethodAccessor2599.invoke(Unknown Source)
11-Aug-2018 07:13:49         at sun.reflect.DelegatingMethodAccessorImpl.invoke(DelegatingMethodAccessorImpl.java:43)
11-Aug-2018 07:13:49         at java.lang.reflect.Method.invoke(Method.java:498)
11-Aug-2018 07:13:49         at org.springframework.aop.support.AopUtils.invokeJoinpointUsingReflection(AopUtils.java:302)
11-Aug-2018 07:13:49         at org.eclipse.gemini.blueprint.service.importer.support.internal.aop.ServiceInvoker.doInvoke(ServiceInvoker.java:56)
11-Aug-2018 07:13:49         at org.eclipse.gemini.blueprint.service.importer.support.internal.aop.ServiceInvoker.invoke(ServiceInvoker.java:60)
11-Aug-2018 07:13:49         at org.springframework.aop.framework.ReflectiveMethodInvocation.proceed(ReflectiveMethodInvocation.java:179)
11-Aug-2018 07:13:49         at org.springframework.aop.support.DelegatingIntroductionInterceptor.doProceed(DelegatingIntroductionInterceptor.java:133)
11-Aug-2018 07:13:49         at org.springframework.aop.support.DelegatingIntroductionInterceptor.invoke(DelegatingIntroductionInterceptor.java:121)
11-Aug-2018 07:13:49         at org.springframework.aop.framework.ReflectiveMethodInvocation.proceed(ReflectiveMethodInvocation.java:179)
11-Aug-2018 07:13:49         at org.eclipse.gemini.blueprint.service.util.internal.aop.ServiceTCCLInterceptor.invokeUnprivileged(ServiceTCCLInterceptor.java:70)
11-Aug-2018 07:13:49         at org.eclipse.gemini.blueprint.service.util.internal.aop.ServiceTCCLInterceptor.invoke(ServiceTCCLInterceptor.java:53)
11-Aug-2018 07:13:49         at org.springframework.aop.framework.ReflectiveMethodInvocation.proceed(ReflectiveMethodInvocation.java:179)
11-Aug-2018 07:13:49         at org.eclipse.gemini.blueprint.service.importer.support.LocalBundleContextAdvice.invoke(LocalBundleContextAdvice.java:57)
11-Aug-2018 07:13:49         at org.springframework.aop.framework.ReflectiveMethodInvocation.proceed(ReflectiveMethodInvocation.java:179)
11-Aug-2018 07:13:49         at org.springframework.aop.support.DelegatingIntroductionInterceptor.doProceed(DelegatingIntroductionInterceptor.java:133)
11-Aug-2018 07:13:49         at org.springframework.aop.support.DelegatingIntroductionInterceptor.invoke(DelegatingIntroductionInterceptor.java:121)
11-Aug-2018 07:13:49         at org.springframework.aop.framework.ReflectiveMethodInvocation.proceed(ReflectiveMethodInvocation.java:179)
11-Aug-2018 07:13:49         at org.springframework.aop.framework.JdkDynamicAopProxy.invoke(JdkDynamicAopProxy.java:207)
11-Aug-2018 07:13:49         at com.sun.proxy.$Proxy695.run(Unknown Source)
11-Aug-2018 07:13:49         at com.atlassian.bamboo.plugins.docker.client.DockerCmd.run(DockerCmd.java:51)
11-Aug-2018 07:13:49         at com.atlassian.bamboo.plugins.docker.service.RunService.execute(RunService.java:64)
11-Aug-2018 07:13:49         ... 17 more
11-Aug-2018 07:13:49 Caused by: com.atlassian.utils.process.ProcessException: Error executing /usr/bin/docker run --volume /home/bamboo/xml-data/build-dir/PHPBB3-PR-JOB1:/data --workdir /data/build --rm -u=991 phpbb:php-5.6 ../phpBB/vendor/bin/phing sniff
11-Aug-2018 07:13:49         at com.atlassian.bamboo.docker.DockerContainerServiceImpl.execute(DockerContainerServiceImpl.java:252)
11-Aug-2018 07:13:49         at com.atlassian.bamboo.docker.DockerContainerServiceImpl.run(DockerContainerServiceImpl.java:106)
11-Aug-2018 07:13:49         ... 44 more
11-Aug-2018 07:13:49 Starting task 'Parsing test results produced by script' of type 'com.atlassian.bamboo.plugins.testresultparser:task.testresultparser.junit'
11-Aug-2018 07:13:49 Parsing test results under /home/bamboo/xml-data/build-dir/PHPBB3-PR-JOB1...
11-Aug-2018 07:13:49 Failing task since test cases were expected but none were found.
11-Aug-2018 07:13:49 Finished task 'Parsing test results produced by script' with result: Failed
11-Aug-2018 07:13:49
Substituting variable: ${bamboo.PRnumber} with 5235
11-Aug-2018 07:13:49
Substituting variable: ${bamboo.buildResultsUrl} with https://bamboo.phpbb.com/browse/PHPBB3-PR-JOB1-8649
11-Aug-2018 07:13:49
Substituting variable: ${bamboo.buildResultsUrl} with https://bamboo.phpbb.com/browse/PHPBB3-PR-JOB1-8649
11-Aug-2018 07:13:49 Starting task 'Set result build status' of type 'com.atlassian.bamboo.plugins.scripttask:task.builder.script'
11-Aug-2018 07:13:49
Beginning to execute external process for build 'phpBB3 - Pull Requests - Build and Test Job #8649 (PHPBB3-PR-JOB1-8649)'
... running command line:
/bin/sh /home/bamboo/temp/PHPBB3-PR-JOB1-8649-ScriptBuildTask-8167387261528342996.sh
... in: /home/bamboo/xml-data/build-dir/PHPBB3-PR-JOB1
... using extra environment variables:
bamboo_planRepository_1_branch=3.1.x
bamboo_planRepository_1_branchDisplayName=3.1.x
bamboo_repository_revision_number=dc8ff9da28b8ab4ad11c7ea94cca526f17c87fe5
bamboo_PRref=feature/gsoc-pm
bamboo_resultsUrl=https://bamboo.phpbb.com/browse/PHPBB3-PR-JOB1-8649
bamboo_capability_system_builder_command_Git=/usr/bin/git
bamboo_repository_75956235_git_username=bantu
bamboo_build_working_directory=/home/bamboo/xml-data/build-dir/PHPBB3-PR-JOB1
bamboo_planRepository_1_name=phpBB Ascraeus
bamboo_buildKey=PHPBB3-PR-JOB1
bamboo_capability_phpbb_tests=true
bamboo_shortPlanName=Pull Requests
bamboo_capability_system_builder_command_fop=/usr/bin/fop
bamboo_capability_dbms_sqlite_2=true
bamboo_planRepository_name=phpBB Ascraeus
bamboo_PRnumber=5235
bamboo_buildNumber=8649
bamboo_repository_75956235_git_repositoryUrl=https://github.com/phpbb/phpbb.git
bamboo_capability_system_builder_phpunit_PHPUnit=/usr/bin/phpunit
bamboo_shortJobName=Build and Test Job
bamboo_buildResultsUrl=https://bamboo.phpbb.com/browse/PHPBB3-PR-JOB1-8649
bamboo_repository_75956235_branch_name=3.1.x
bamboo_planRepository_repositoryUrl=https://github.com/phpbb/phpbb.git
bamboo_agentId=131073
bamboo_planName=phpBB3 - Pull Requests
bamboo_build_commandline_com_atlassian_bamboo_plugins_scripttask_task_builder_script_7=/bin/sh /home/bamboo/temp/PHPBB3-PR-JOB1-8649-ScriptBuildTask-668329888075367092.sh
bamboo_shortPlanKey=PR
bamboo_shortJobKey=JOB1
bamboo_capability_dbms_mysql_55=true
bamboo_capability_system_jdk_JDK_1_7_0_65=/usr/lib/jvm/java-7-openjdk-amd64
bamboo_planRepository_revision=dc8ff9da28b8ab4ad11c7ea94cca526f17c87fe5
bamboo_buildTimeStamp=2018-08-11T07:10:38.691Z
bamboo_repository_previous_revision_number=dc8ff9da28b8ab4ad11c7ea94cca526f17c87fe5
bamboo_capability_system_jdk_JDK_1_6_0_16=/usr/lib/jvm/java-6-sun-1.6.0.16
bamboo_capability_system_builder_mvn2_Maven_2=/usr/share/maven2
bamboo_planRepository_previousRevision=dc8ff9da28b8ab4ad11c7ea94cca526f17c87fe5
bamboo_build_commandline_com_atlassian_bamboo_plugins_scripttask_task_builder_script_4=/bin/sh /home/bamboo/temp/PHPBB3-PR-JOB1-8649-ScriptBuildTask-4824438327737178503.sh
bamboo_repository_git_branch=3.1.x
bamboo_buildResultKey=PHPBB3-PR-JOB1-8649
bamboo_repository_branch_name=3.1.x
bamboo_buildPlanName=phpBB3 - Pull Requests - Build and Test Job
bamboo_planRepository_1_revision=dc8ff9da28b8ab4ad11c7ea94cca526f17c87fe5
bamboo_repository_name=phpBB Ascraeus
bamboo_buildFailed=true
bamboo_capability_system_docker_executable=/usr/bin/docker
bamboo_build_commandline_com_atlassian_bamboo_plugins_bamboo_docker_plugin_task_docker_cli_11=/usr/bin/docker run --volume /home/bamboo/xml-data/build-dir/PHPBB3-PR-JOB1:/data --workdir /data/build --rm -u=991 phpbb:php-5.6 ../phpBB/vendor/bin/phing sniff
bamboo_build_commandline_com_atlassian_bamboo_plugins_bamboo_docker_plugin_task_docker_cli_12=/usr/bin/docker run --volume /home/bamboo/xml-data/build-dir/PHPBB3-PR-JOB1:/data --workdir /data/phpBB --rm -e HOME=/home/bamboo -u=991 phpbb:php-5.6 /bin/bash -c php ../composer.phar install --dev; cd ../build; ../phpBB/vendor/bin/phing clean prepare
bamboo_planRepository_branch=3.1.x
bamboo_agentWorkingDirectory=/home/bamboo/xml-data/build-dir
bamboo_jobFailed=true
bamboo_capability_system_git_executable=/usr/bin/git
bamboo_capability_system_builder_phpunit_PHPUnit_3_4=/usr/bin/phpunit
bamboo_repository_git_username=bantu
bamboo_planRepository_1_previousRevision=dc8ff9da28b8ab4ad11c7ea94cca526f17c87fe5
bamboo_repository_75956235_revision_number=dc8ff9da28b8ab4ad11c7ea94cca526f17c87fe5
bamboo_planRepository_branchDisplayName=3.1.x
bamboo_planRepository_1_type=gitv2
bamboo_planRepository_branchName=3.1.x
bamboo_repository_75956235_previous_revision_number=dc8ff9da28b8ab4ad11c7ea94cca526f17c87fe5
bamboo_capability_system_jdk_JDK=/usr/lib/jvm/java-6-sun
bamboo_plan_storageTag=PHPBB3-PR
bamboo_hg_cache_directory=/home/bamboo/xml-data/build-dir/_hg-repositories-cache
bamboo_planRepository_1_username=bantu
bamboo_planRepository_type=gitv2
bamboo_git_cache_directory=/home/bamboo/xml-data/build-dir/_git-repositories-cache
bamboo_ManualBuildTriggerReason_userName=Build Robot
bamboo_repository_git_repositoryUrl=https://github.com/phpbb/phpbb.git
bamboo_repository_75956235_git_branch=3.1.x
bamboo_capability_system_builder_ant_Ant=/usr/share/ant
bamboo_repository_75956235_name=phpBB Ascraeus
bamboo_tmp_directory=/home/bamboo/temp
bamboo_working_directory=/home/bamboo/xml-data/build-dir/PHPBB3-PR-JOB1
bamboo_planKey=PHPBB3-PR
bamboo_capability_local=true
bamboo_planRepository_1_repositoryUrl=https://github.com/phpbb/phpbb.git
bamboo_planRepository_username=bantu
bamboo_capability_system_jdk_JDK_1_6=/usr/lib/jvm/java-6-sun
bamboo_capability_system_jdk_JDK_1_7=/usr/lib/jvm/java-7-openjdk-amd64
bamboo_planRepository_1_branchName=3.1.x
11-Aug-2018 07:13:50 From https://github.com/phpbb/phpbb
11-Aug-2018 07:13:50 * branch            refs/pull/5235/head -> FETCH_HEAD
11-Aug-2018 07:13:50 grep: build/logs/phpunit.xml: No such file or directory
11-Aug-2018 07:13:50 grep: build/logs/phpunit.xml: No such file or directory
11-Aug-2018 07:13:50   % Total    % Received % Xferd  Average Speed   Time    Time     Time  Current
11-Aug-2018 07:13:50                                  Dload  Upload   Total   Spent    Left  Speed
11-Aug-2018 07:13:50
11-Aug-2018 07:13:51   0     0    0     0    0     0      0      0 --:--:-- --:--:-- --:--:--     0
11-Aug-2018 07:13:51 100   273  100    93  100   180    326    631 --:--:-- --:--:-- --:--:--   631
11-Aug-2018 07:13:51 100   273  100    93  100   180    326    631 --:--:-- --:--:-- --:--:--   631
11-Aug-2018 07:13:51 Finished task 'Set result build status' with result: Success
11-Aug-2018 07:13:51 Running post build plugin 'NCover Results Collector'
11-Aug-2018 07:13:51 Running post build plugin 'Artifact Copier'
11-Aug-2018 07:13:51 Running post build plugin 'npm Cache Cleanup'
11-Aug-2018 07:13:51 Running post build plugin 'Clover Results Collector'
11-Aug-2018 07:13:51 Running post build plugin 'Docker Container Cleanup'
11-Aug-2018 07:13:51 Successfully removed working directory at '/home/bamboo/xml-data/build-dir/PHPBB3-PR-JOB1'
11-Aug-2018 07:13:51 Finalising the build...
11-Aug-2018 07:13:51 Stopping timer.
11-Aug-2018 07:13:51 Build PHPBB3-PR-JOB1-8649 completed.
11-Aug-2018 07:13:51 Running on server: post build plugin 'NCover Results Collector'
11-Aug-2018 07:13:51 Running on server: post build plugin 'Build Hanging Detection Configuration'
11-Aug-2018 07:13:51 Running on server: post build plugin 'Clover Delta Calculator'
11-Aug-2018 07:13:51 Running on server: post build plugin 'Maven Dependencies Postprocessor'
11-Aug-2018 07:13:51 All post build plugins have finished
11-Aug-2018 07:13:51 Generating build results summary...
11-Aug-2018 07:13:51 Saving build results to disk...
11-Aug-2018 07:13:51 Logging substituted variables...
11-Aug-2018 07:13:51 Indexing build results...
11-Aug-2018 07:13:51 Finished building PHPBB3-PR-JOB1-8649.
11-Aug-2018 07:13:51
Substituting variable: ${bamboo.PRnumber} with 5235