Tests pending pull requests

Build: #8711 failed

Job: Build and Test Job failed

Stages & jobs

  1. Build and Test

Build log

The build generated 352 lines of output. Download or view full build log

25-Aug-2018 16:13:06 Build phpBB3 - Pull Requests - Build and Test Job #8711 (PHPBB3-PR-JOB1-8711) started building on agent Default Agent
25-Aug-2018 16:13:06
25-Aug-2018 16:13:06 Build working directory is /home/bamboo/xml-data/build-dir/PHPBB3-PR-JOB1
25-Aug-2018 16:13:06 Executing build phpBB3 - Pull Requests - Build and Test Job #8711 (PHPBB3-PR-JOB1-8711)
25-Aug-2018 16:13:06 Starting task 'Checkout develop branch' of type 'com.atlassian.bamboo.plugins.vcs:task.vcs.checkout'
25-Aug-2018 16:13:06 Build always requires a clean checkout
25-Aug-2018 16:13:06 Cleaning build directory '/home/bamboo/xml-data/build-dir/PHPBB3-PR-JOB1'
25-Aug-2018 16:13:06 Checking out into /home/bamboo/xml-data/build-dir/PHPBB3-PR-JOB1
25-Aug-2018 16:13:06 Updating source code to revision: dc8ff9da28b8ab4ad11c7ea94cca526f17c87fe5
25-Aug-2018 16:13:06 Fetching 'refs/heads/3.1.x' from 'https://github.com/phpbb/phpbb.git'.
25-Aug-2018 16:13:06 Checking out revision dc8ff9da28b8ab4ad11c7ea94cca526f17c87fe5.
25-Aug-2018 16:13:06 Creating local git repository in '/home/bamboo/xml-data/build-dir/PHPBB3-PR-JOB1/.git'.
25-Aug-2018 16:13:06 Cloning into '/home/bamboo/xml-data/build-dir/PHPBB3-PR-JOB1'...
25-Aug-2018 16:13:06 done.
25-Aug-2018 16:13:08 Switched to a new branch '3.1.x'
25-Aug-2018 16:13:08 Branch 3.1.x set up to track remote branch 3.1.x from origin.
25-Aug-2018 16:13:08 Updated source code to revision: dc8ff9da28b8ab4ad11c7ea94cca526f17c87fe5
25-Aug-2018 16:13:08 Finished task 'Checkout develop branch' with result: Success
25-Aug-2018 16:13:08 Running pre-build action: VCS Version Collector
25-Aug-2018 16:13:08
Substituting variable: ${bamboo.PRnumber} with 5270
25-Aug-2018 16:13:08
Substituting variable: ${bamboo.buildResultsUrl} with https://bamboo.phpbb.com/browse/PHPBB3-PR-JOB1-8711
25-Aug-2018 16:13:08 Starting task 'Set pending build status' of type 'com.atlassian.bamboo.plugins.scripttask:task.builder.script'
25-Aug-2018 16:13:08
Beginning to execute external process for build 'phpBB3 - Pull Requests - Build and Test Job #8711 (PHPBB3-PR-JOB1-8711)'
... running command line:
/bin/sh /home/bamboo/temp/PHPBB3-PR-JOB1-8711-ScriptBuildTask-1485860256103364640.sh
... in: /home/bamboo/xml-data/build-dir/PHPBB3-PR-JOB1
... using extra environment variables:
bamboo_planRepository_1_branch=3.1.x
bamboo_planRepository_1_branchDisplayName=3.1.x
bamboo_repository_revision_number=dc8ff9da28b8ab4ad11c7ea94cca526f17c87fe5
bamboo_PRref=master
bamboo_resultsUrl=https://bamboo.phpbb.com/browse/PHPBB3-PR-JOB1-8711
bamboo_capability_system_builder_command_Git=/usr/bin/git
bamboo_repository_75956235_git_username=bantu
bamboo_build_working_directory=/home/bamboo/xml-data/build-dir/PHPBB3-PR-JOB1
bamboo_planRepository_1_name=phpBB Ascraeus
bamboo_buildKey=PHPBB3-PR-JOB1
bamboo_capability_phpbb_tests=true
bamboo_shortPlanName=Pull Requests
bamboo_capability_system_builder_command_fop=/usr/bin/fop
bamboo_capability_dbms_sqlite_2=true
bamboo_planRepository_name=phpBB Ascraeus
bamboo_PRnumber=5270
bamboo_buildNumber=8711
bamboo_repository_75956235_git_repositoryUrl=https://github.com/phpbb/phpbb.git
bamboo_capability_system_builder_phpunit_PHPUnit=/usr/bin/phpunit
bamboo_shortJobName=Build and Test Job
bamboo_buildResultsUrl=https://bamboo.phpbb.com/browse/PHPBB3-PR-JOB1-8711
bamboo_repository_75956235_branch_name=3.1.x
bamboo_planRepository_repositoryUrl=https://github.com/phpbb/phpbb.git
bamboo_agentId=131073
bamboo_planName=phpBB3 - Pull Requests
bamboo_shortPlanKey=PR
bamboo_shortJobKey=JOB1
bamboo_capability_dbms_mysql_55=true
bamboo_capability_system_jdk_JDK_1_7_0_65=/usr/lib/jvm/java-7-openjdk-amd64
bamboo_planRepository_revision=dc8ff9da28b8ab4ad11c7ea94cca526f17c87fe5
bamboo_buildTimeStamp=2018-08-25T16:13:06.244Z
bamboo_repository_previous_revision_number=dc8ff9da28b8ab4ad11c7ea94cca526f17c87fe5
bamboo_capability_system_jdk_JDK_1_6_0_16=/usr/lib/jvm/java-6-sun-1.6.0.16
bamboo_capability_system_builder_mvn2_Maven_2=/usr/share/maven2
bamboo_planRepository_previousRevision=dc8ff9da28b8ab4ad11c7ea94cca526f17c87fe5
bamboo_repository_git_branch=3.1.x
bamboo_buildResultKey=PHPBB3-PR-JOB1-8711
bamboo_repository_branch_name=3.1.x
bamboo_buildPlanName=phpBB3 - Pull Requests - Build and Test Job
bamboo_planRepository_1_revision=dc8ff9da28b8ab4ad11c7ea94cca526f17c87fe5
bamboo_repository_name=phpBB Ascraeus
bamboo_buildFailed=false
bamboo_capability_system_docker_executable=/usr/bin/docker
bamboo_planRepository_branch=3.1.x
bamboo_agentWorkingDirectory=/home/bamboo/xml-data/build-dir
bamboo_capability_system_git_executable=/usr/bin/git
bamboo_capability_system_builder_phpunit_PHPUnit_3_4=/usr/bin/phpunit
bamboo_repository_git_username=bantu
bamboo_planRepository_1_previousRevision=dc8ff9da28b8ab4ad11c7ea94cca526f17c87fe5
bamboo_repository_75956235_revision_number=dc8ff9da28b8ab4ad11c7ea94cca526f17c87fe5
bamboo_planRepository_branchDisplayName=3.1.x
bamboo_planRepository_1_type=gitv2
bamboo_planRepository_branchName=3.1.x
bamboo_repository_75956235_previous_revision_number=dc8ff9da28b8ab4ad11c7ea94cca526f17c87fe5
bamboo_capability_system_jdk_JDK=/usr/lib/jvm/java-6-sun
bamboo_plan_storageTag=PHPBB3-PR
bamboo_hg_cache_directory=/home/bamboo/xml-data/build-dir/_hg-repositories-cache
bamboo_planRepository_1_username=bantu
bamboo_planRepository_type=gitv2
bamboo_git_cache_directory=/home/bamboo/xml-data/build-dir/_git-repositories-cache
bamboo_ManualBuildTriggerReason_userName=Build Robot
bamboo_repository_git_repositoryUrl=https://github.com/phpbb/phpbb.git
bamboo_repository_75956235_git_branch=3.1.x
bamboo_capability_system_builder_ant_Ant=/usr/share/ant
bamboo_repository_75956235_name=phpBB Ascraeus
bamboo_tmp_directory=/home/bamboo/temp
bamboo_working_directory=/home/bamboo/xml-data/build-dir/PHPBB3-PR-JOB1
bamboo_planKey=PHPBB3-PR
bamboo_capability_local=true
bamboo_planRepository_1_repositoryUrl=https://github.com/phpbb/phpbb.git
bamboo_planRepository_username=bantu
bamboo_capability_system_jdk_JDK_1_6=/usr/lib/jvm/java-6-sun
bamboo_capability_system_jdk_JDK_1_7=/usr/lib/jvm/java-7-openjdk-amd64
bamboo_planRepository_1_branchName=3.1.x
25-Aug-2018 16:13:12 From https://github.com/phpbb/phpbb
25-Aug-2018 16:13:12 * branch            refs/pull/5270/head -> FETCH_HEAD
25-Aug-2018 16:13:12   % Total    % Received % Xferd  Average Speed   Time    Time     Time  Current
25-Aug-2018 16:13:12                                  Dload  Upload   Total   Spent    Left  Speed
25-Aug-2018 16:13:12
25-Aug-2018 16:13:12   0     0    0     0    0     0      0      0 --:--:-- --:--:-- --:--:--     0
25-Aug-2018 16:13:12 100   275  100    93  100   182    175    344 --:--:-- --:--:-- --:--:--   344
25-Aug-2018 16:13:12 Finished task 'Set pending build status' with result: Success
25-Aug-2018 16:13:12
Substituting variable: ${bamboo.PRnumber} with 5270
25-Aug-2018 16:13:12 Starting task 'Fetch PR' of type 'com.atlassian.bamboo.plugins.scripttask:task.builder.script'
25-Aug-2018 16:13:12
Beginning to execute external process for build 'phpBB3 - Pull Requests - Build and Test Job #8711 (PHPBB3-PR-JOB1-8711)'
... running command line:
/bin/sh /home/bamboo/temp/PHPBB3-PR-JOB1-8711-ScriptBuildTask-7927193096220711349.sh
... in: /home/bamboo/xml-data/build-dir/PHPBB3-PR-JOB1
... using extra environment variables:
bamboo_planRepository_1_branch=3.1.x
bamboo_planRepository_1_branchDisplayName=3.1.x
bamboo_repository_revision_number=dc8ff9da28b8ab4ad11c7ea94cca526f17c87fe5
bamboo_PRref=master
bamboo_resultsUrl=https://bamboo.phpbb.com/browse/PHPBB3-PR-JOB1-8711
bamboo_capability_system_builder_command_Git=/usr/bin/git
bamboo_repository_75956235_git_username=bantu
bamboo_build_working_directory=/home/bamboo/xml-data/build-dir/PHPBB3-PR-JOB1
bamboo_planRepository_1_name=phpBB Ascraeus
bamboo_buildKey=PHPBB3-PR-JOB1
bamboo_capability_phpbb_tests=true
bamboo_shortPlanName=Pull Requests
bamboo_capability_system_builder_command_fop=/usr/bin/fop
bamboo_capability_dbms_sqlite_2=true
bamboo_planRepository_name=phpBB Ascraeus
bamboo_PRnumber=5270
bamboo_buildNumber=8711
bamboo_repository_75956235_git_repositoryUrl=https://github.com/phpbb/phpbb.git
bamboo_capability_system_builder_phpunit_PHPUnit=/usr/bin/phpunit
bamboo_shortJobName=Build and Test Job
bamboo_buildResultsUrl=https://bamboo.phpbb.com/browse/PHPBB3-PR-JOB1-8711
bamboo_repository_75956235_branch_name=3.1.x
bamboo_planRepository_repositoryUrl=https://github.com/phpbb/phpbb.git
bamboo_agentId=131073
bamboo_planName=phpBB3 - Pull Requests
bamboo_build_commandline_com_atlassian_bamboo_plugins_scripttask_task_builder_script_7=/bin/sh /home/bamboo/temp/PHPBB3-PR-JOB1-8711-ScriptBuildTask-1485860256103364640.sh
bamboo_shortPlanKey=PR
bamboo_shortJobKey=JOB1
bamboo_capability_dbms_mysql_55=true
bamboo_capability_system_jdk_JDK_1_7_0_65=/usr/lib/jvm/java-7-openjdk-amd64
bamboo_planRepository_revision=dc8ff9da28b8ab4ad11c7ea94cca526f17c87fe5
bamboo_buildTimeStamp=2018-08-25T16:13:06.244Z
bamboo_repository_previous_revision_number=dc8ff9da28b8ab4ad11c7ea94cca526f17c87fe5
bamboo_capability_system_jdk_JDK_1_6_0_16=/usr/lib/jvm/java-6-sun-1.6.0.16
bamboo_capability_system_builder_mvn2_Maven_2=/usr/share/maven2
bamboo_planRepository_previousRevision=dc8ff9da28b8ab4ad11c7ea94cca526f17c87fe5
bamboo_repository_git_branch=3.1.x
bamboo_buildResultKey=PHPBB3-PR-JOB1-8711
bamboo_repository_branch_name=3.1.x
bamboo_buildPlanName=phpBB3 - Pull Requests - Build and Test Job
bamboo_planRepository_1_revision=dc8ff9da28b8ab4ad11c7ea94cca526f17c87fe5
bamboo_repository_name=phpBB Ascraeus
bamboo_buildFailed=false
bamboo_capability_system_docker_executable=/usr/bin/docker
bamboo_planRepository_branch=3.1.x
bamboo_agentWorkingDirectory=/home/bamboo/xml-data/build-dir
bamboo_capability_system_git_executable=/usr/bin/git
bamboo_capability_system_builder_phpunit_PHPUnit_3_4=/usr/bin/phpunit
bamboo_repository_git_username=bantu
bamboo_planRepository_1_previousRevision=dc8ff9da28b8ab4ad11c7ea94cca526f17c87fe5
bamboo_repository_75956235_revision_number=dc8ff9da28b8ab4ad11c7ea94cca526f17c87fe5
bamboo_planRepository_branchDisplayName=3.1.x
bamboo_planRepository_1_type=gitv2
bamboo_planRepository_branchName=3.1.x
bamboo_repository_75956235_previous_revision_number=dc8ff9da28b8ab4ad11c7ea94cca526f17c87fe5
bamboo_capability_system_jdk_JDK=/usr/lib/jvm/java-6-sun
bamboo_plan_storageTag=PHPBB3-PR
bamboo_hg_cache_directory=/home/bamboo/xml-data/build-dir/_hg-repositories-cache
bamboo_planRepository_1_username=bantu
bamboo_planRepository_type=gitv2
bamboo_git_cache_directory=/home/bamboo/xml-data/build-dir/_git-repositories-cache
bamboo_ManualBuildTriggerReason_userName=Build Robot
bamboo_repository_git_repositoryUrl=https://github.com/phpbb/phpbb.git
bamboo_repository_75956235_git_branch=3.1.x
bamboo_capability_system_builder_ant_Ant=/usr/share/ant
bamboo_repository_75956235_name=phpBB Ascraeus
bamboo_tmp_directory=/home/bamboo/temp
bamboo_working_directory=/home/bamboo/xml-data/build-dir/PHPBB3-PR-JOB1
bamboo_planKey=PHPBB3-PR
bamboo_capability_local=true
bamboo_planRepository_1_repositoryUrl=https://github.com/phpbb/phpbb.git
bamboo_planRepository_username=bantu
bamboo_capability_system_jdk_JDK_1_6=/usr/lib/jvm/java-6-sun
bamboo_capability_system_jdk_JDK_1_7=/usr/lib/jvm/java-7-openjdk-amd64
bamboo_planRepository_1_branchName=3.1.x
25-Aug-2018 16:13:14 From https://github.com/phpbb/phpbb
25-Aug-2018 16:13:14 * branch            refs/pull/5270/merge -> FETCH_HEAD
25-Aug-2018 16:13:14 Note: checking out 'FETCH_HEAD'.
25-Aug-2018 16:13:14
25-Aug-2018 16:13:14 You are in 'detached HEAD' state. You can look around, make experimental
25-Aug-2018 16:13:14 changes and commit them, and you can discard any commits you make in this
25-Aug-2018 16:13:14 state without impacting any branches by performing another checkout.
25-Aug-2018 16:13:14
25-Aug-2018 16:13:14 If you want to create a new branch to retain commits you create, you may
25-Aug-2018 16:13:14 do so (now or later) by using -b with the checkout command again. Example:
25-Aug-2018 16:13:14
25-Aug-2018 16:13:14   git checkout -b new_branch_name
25-Aug-2018 16:13:14
25-Aug-2018 16:13:14 HEAD is now at f70a273... Merge 340ec91f1f5d3ea57a0267cd571e72527185ba8f into d098020e72b656a3b593bb3cc7e0c7e3340c72a3
25-Aug-2018 16:13:14 Finished task 'Fetch PR' with result: Success
25-Aug-2018 16:13:14 Skipping execution of task 'Prepare directory' as it is disabled
25-Aug-2018 16:13:14
Substituting variable: ${bamboo.working.directory} with /home/bamboo/xml-data/build-dir/PHPBB3-PR-JOB1
25-Aug-2018 16:13:14 Starting task 'Prepare directory' of type 'com.atlassian.bamboo.plugins.bamboo-docker-plugin:task.docker.cli'
25-Aug-2018 16:13:14 Running image name (phpbb:php-5.6)
25-Aug-2018 16:13:14
Beginning to execute external process for build 'phpBB3 - Pull Requests - Build and Test Job #8711 (PHPBB3-PR-JOB1-8711)'
... running command line:
/usr/bin/docker run --volume /home/bamboo/xml-data/build-dir/PHPBB3-PR-JOB1:/data --workdir /data/phpBB --rm -e HOME=/home/bamboo -u=991 phpbb:php-5.6 /bin/bash -c php ../composer.phar install --dev; cd ../build; ../phpBB/vendor/bin/phing clean prepare
... in: /home/bamboo/xml-data/build-dir/PHPBB3-PR-JOB1
... using extra environment variables:
bamboo_planRepository_1_branch=3.1.x
bamboo_planRepository_1_branchDisplayName=3.1.x
bamboo_repository_revision_number=dc8ff9da28b8ab4ad11c7ea94cca526f17c87fe5
bamboo_PRref=master
bamboo_resultsUrl=https://bamboo.phpbb.com/browse/PHPBB3-PR-JOB1-8711
bamboo_capability_system_builder_command_Git=/usr/bin/git
bamboo_repository_75956235_git_username=bantu
bamboo_build_working_directory=/home/bamboo/xml-data/build-dir/PHPBB3-PR-JOB1
bamboo_planRepository_1_name=phpBB Ascraeus
bamboo_buildKey=PHPBB3-PR-JOB1
bamboo_capability_phpbb_tests=true
bamboo_shortPlanName=Pull Requests
bamboo_capability_system_builder_command_fop=/usr/bin/fop
bamboo_capability_dbms_sqlite_2=true
bamboo_planRepository_name=phpBB Ascraeus
bamboo_PRnumber=5270
bamboo_buildNumber=8711
bamboo_repository_75956235_git_repositoryUrl=https://github.com/phpbb/phpbb.git
bamboo_capability_system_builder_phpunit_PHPUnit=/usr/bin/phpunit
bamboo_shortJobName=Build and Test Job
bamboo_buildResultsUrl=https://bamboo.phpbb.com/browse/PHPBB3-PR-JOB1-8711
bamboo_repository_75956235_branch_name=3.1.x
bamboo_planRepository_repositoryUrl=https://github.com/phpbb/phpbb.git
bamboo_agentId=131073
bamboo_planName=phpBB3 - Pull Requests
bamboo_build_commandline_com_atlassian_bamboo_plugins_scripttask_task_builder_script_7=/bin/sh /home/bamboo/temp/PHPBB3-PR-JOB1-8711-ScriptBuildTask-1485860256103364640.sh
bamboo_shortPlanKey=PR
bamboo_shortJobKey=JOB1
bamboo_capability_dbms_mysql_55=true
bamboo_capability_system_jdk_JDK_1_7_0_65=/usr/lib/jvm/java-7-openjdk-amd64
bamboo_planRepository_revision=dc8ff9da28b8ab4ad11c7ea94cca526f17c87fe5
bamboo_buildTimeStamp=2018-08-25T16:13:06.244Z
bamboo_repository_previous_revision_number=dc8ff9da28b8ab4ad11c7ea94cca526f17c87fe5
bamboo_capability_system_jdk_JDK_1_6_0_16=/usr/lib/jvm/java-6-sun-1.6.0.16
bamboo_capability_system_builder_mvn2_Maven_2=/usr/share/maven2
bamboo_planRepository_previousRevision=dc8ff9da28b8ab4ad11c7ea94cca526f17c87fe5
bamboo_build_commandline_com_atlassian_bamboo_plugins_scripttask_task_builder_script_4=/bin/sh /home/bamboo/temp/PHPBB3-PR-JOB1-8711-ScriptBuildTask-7927193096220711349.sh
bamboo_repository_git_branch=3.1.x
bamboo_buildResultKey=PHPBB3-PR-JOB1-8711
bamboo_repository_branch_name=3.1.x
bamboo_buildPlanName=phpBB3 - Pull Requests - Build and Test Job
bamboo_planRepository_1_revision=dc8ff9da28b8ab4ad11c7ea94cca526f17c87fe5
bamboo_repository_name=phpBB Ascraeus
bamboo_buildFailed=false
bamboo_capability_system_docker_executable=/usr/bin/docker
bamboo_planRepository_branch=3.1.x
bamboo_agentWorkingDirectory=/home/bamboo/xml-data/build-dir
bamboo_capability_system_git_executable=/usr/bin/git
bamboo_capability_system_builder_phpunit_PHPUnit_3_4=/usr/bin/phpunit
bamboo_repository_git_username=bantu
bamboo_planRepository_1_previousRevision=dc8ff9da28b8ab4ad11c7ea94cca526f17c87fe5
bamboo_repository_75956235_revision_number=dc8ff9da28b8ab4ad11c7ea94cca526f17c87fe5
bamboo_planRepository_branchDisplayName=3.1.x
bamboo_planRepository_1_type=gitv2
bamboo_planRepository_branchName=3.1.x
bamboo_repository_75956235_previous_revision_number=dc8ff9da28b8ab4ad11c7ea94cca526f17c87fe5
bamboo_capability_system_jdk_JDK=/usr/lib/jvm/java-6-sun
bamboo_plan_storageTag=PHPBB3-PR
bamboo_hg_cache_directory=/home/bamboo/xml-data/build-dir/_hg-repositories-cache
bamboo_planRepository_1_username=bantu
bamboo_planRepository_type=gitv2
bamboo_git_cache_directory=/home/bamboo/xml-data/build-dir/_git-repositories-cache
bamboo_ManualBuildTriggerReason_userName=Build Robot
bamboo_repository_git_repositoryUrl=https://github.com/phpbb/phpbb.git
bamboo_repository_75956235_git_branch=3.1.x
bamboo_capability_system_builder_ant_Ant=/usr/share/ant
bamboo_repository_75956235_name=phpBB Ascraeus
bamboo_tmp_directory=/home/bamboo/temp
bamboo_working_directory=/home/bamboo/xml-data/build-dir/PHPBB3-PR-JOB1
bamboo_planKey=PHPBB3-PR
bamboo_capability_local=true
bamboo_planRepository_1_repositoryUrl=https://github.com/phpbb/phpbb.git
bamboo_planRepository_username=bantu
bamboo_capability_system_jdk_JDK_1_6=/usr/lib/jvm/java-6-sun
bamboo_capability_system_jdk_JDK_1_7=/usr/lib/jvm/java-7-openjdk-amd64
bamboo_planRepository_1_branchName=3.1.x
25-Aug-2018 16:13:15 Cannot create cache directory /home/bamboo/.composer/cache/repo/https---packagist.org/, or directory is not writable. Proceeding without cache
25-Aug-2018 16:13:15 Cannot create cache directory /home/bamboo/.composer/cache/files/, or directory is not writable. Proceeding without cache
25-Aug-2018 16:13:15 You are using the deprecated option "dev". Dev packages are installed by default now.
25-Aug-2018 16:13:15 Loading composer repositories with package information
25-Aug-2018 16:13:15 Installing dependencies (including require-dev) from lock file
25-Aug-2018 16:13:15 Package operations: 75 installs, 0 updates, 0 removals
25-Aug-2018 16:13:16   - Installing composer/installers (v1.5.0): Downloading (connecting...)Downloading (0%)           Downloading (5%)Downloading (15%)Downloading (30%)Downloading (35%)Downloading (45%)Downloading (50%)Downloading (55%)Downloading (75%)Downloading (80%)Downloading (85%)Downloading (100%)
25-Aug-2018 16:13:17   - Installing bantu/ini-get-wrapper (v1.0.1): Downloading (connecting...)Downloading (0%)           Downloading (100%)
25-Aug-2018 16:13:17   - Installing symfony/process (v3.4.3): Downloading (connecting...)Downloading (100%)         
25-Aug-2018 16:13:18   - Installing symfony/finder (v3.4.3): Downloading (connecting...)Downloading (100%)         
25-Aug-2018 16:13:19   - Installing symfony/filesystem (v3.4.3): Downloading (connecting...)Downloading (0%)           Downloading (5%)Downloading (85%)Downloading (90%)Downloading (100%)
25-Aug-2018 16:13:20   - Installing symfony/polyfill-mbstring (v1.8.0): Downloading (connecting...)Downloading (100%)         
25-Aug-2018 16:13:21   - Installing psr/log (1.0.2): Downloading (connecting...)Downloading (0%)           Downloading (15%)Downloading (100%)
25-Aug-2018 16:13:21   - Installing symfony/debug (v3.4.3): Downloading (connecting...)Downloading (0%)           Downloading (5%)Downloading (15%)Downloading (20%)Downloading (30%)Downloading (35%)Downloading (40%)Downloading (55%)Downloading (60%)Downloading (75%)Downloading (80%)Downloading (95%)Downloading (100%)
25-Aug-2018 16:13:22   - Installing symfony/console (v3.4.3): Downloading (connecting...)Downloading (100%)         
25-Aug-2018 16:13:23   - Installing seld/phar-utils (1.0.1): Downloading (connecting...)Downloading (0%)           Downloading (30%)Downloading (60%)Downloading (90%)Downloading (100%)
25-Aug-2018 16:13:24   - Installing seld/jsonlint (1.7.0): Downloading (connecting...)Downloading (0%)           Downloading (15%)Downloading (70%)Downloading (85%)Downloading (100%)
25-Aug-2018 16:13:24   - Installing seld/cli-prompt (1.0.3): Downloading (connecting...)Downloading (100%)         
25-Aug-2018 16:13:26   - Installing justinrainbow/json-schema (5.2.6): Downloading (connecting...)Downloading (0%)           Downloading (20%)Downloading (25%)Downloading (30%)Downloading (35%)Downloading (50%)Downloading (55%)Downloading (70%)Downloading (75%)Downloading (95%)Downloading (100%)
25-Aug-2018 16:13:26   - Installing composer/spdx-licenses (1.2.0): Downloading (connecting...)Downloading (0%)           Downloading (65%)Downloading (100%)
25-Aug-2018 16:13:27   - Installing composer/semver (1.4.2): Downloading (connecting...)Downloading (100%)         
25-Aug-2018 16:13:29   - Installing composer/ca-bundle (1.1.0): Downloading (connecting...)Downloading (0%)           Downloading (5%)Downloading (10%)Downloading (15%)Downloading (20%)Downloading (25%)Downloading (30%)Downloading (35%)Downloading (40%)Downloading (45%)Downloading (50%)Downloading (55%)Downloading (60%)Downloading (65%)Downloading (70%)Downloading (75%)Downloading (80%)Downloading (85%)Downloading (90%)Downloading (95%)Downloading (100%)
25-Aug-2018 16:13:32   - Installing composer/composer (1.6.2): Downloading (connecting...)Downloading (0%)           Downloading (5%)Downloading (10%)Downloading (15%)Downloading (20%)Downloading (25%)Downloading (30%)Downloading (35%)Downloading (40%)Downloading (45%)Downloading (50%)Downloading (55%)Downloading (60%)Downloading (65%)Downloading (70%)Downloading (75%)Downloading (80%)Downloading (85%)Downloading (90%)Downloading (95%)Downloading (100%)
25-Aug-2018 16:13:33   - Installing google/recaptcha (1.1.3): Downloading (connecting...)Downloading (100%)         
25-Aug-2018 16:13:34   - Installing guzzlehttp/promises (v1.3.1): Downloading (connecting...)Downloading (0%)           Downloading (30%)Downloading (60%)Downloading (80%)Downloading (100%)
25-Aug-2018 16:13:34   - Installing psr/http-message (1.0.1): Downloading (connecting...)Downloading (0%)           Downloading (95%)Downloading (100%)
25-Aug-2018 16:13:35   - Installing guzzlehttp/psr7 (1.4.2): Downloading (connecting...)Downloading (0%)           Downloading (5%)Downloading (10%)Downloading (15%)Downloading (35%)Downloading (40%)Downloading (45%)Downloading (50%)Downloading (55%)Downloading (60%)Downloading (65%)Downloading (70%)Downloading (100%)
25-Aug-2018 16:13:37   - Installing lusitanian/oauth (v0.8.11): Downloading (connecting...)Downloading (0%)           Downloading (5%)Downloading (15%)Downloading (20%)Downloading (25%)Downloading (30%)Downloading (35%)Downloading (40%)Downloading (45%)Downloading (55%)Downloading (60%)Downloading (70%)Downloading (75%)Downloading (80%)Downloading (85%)Downloading (90%)Downloading (95%)Downloading (100%)
25-Aug-2018 16:13:37   - Installing marc1706/fast-image-size (v1.1.4): Downloading (connecting...)Downloading (0%)           Downloading (45%)Downloading (100%)
25-Aug-2018 16:13:38   - Installing patchwork/utf8 (v1.3.1): Downloading (connecting...)Downloading (100%)         
25-Aug-2018 16:13:39   - Installing psr/container (1.0.0): Downloading (connecting...)Downloading (0%)           Downloading (75%)Downloading (100%)
25-Aug-2018 16:13:42   - Installing s9e/text-formatter (0.13.1): Downloading (connecting...)Downloading (0%)           Downloading (5%)Downloading (10%)Downloading (15%)Downloading (20%)Downloading (25%)Downloading (30%)Downloading (35%)Downloading (40%)Downloading (45%)Downloading (50%)Downloading (55%)Downloading (60%)Downloading (65%)Downloading (70%)Downloading (75%)Downloading (80%)Downloading (85%)Downloading (90%)Downloading (95%)Downloading (100%)
25-Aug-2018 16:13:43   - Installing symfony/config (v3.4.3): Downloading (connecting...)Downloading (100%)         
25-Aug-2018 16:13:44   - Installing paragonie/random_compat (v1.4.3): Downloading (connecting...)Downloading (0%)           Downloading (10%)Downloading (35%)Downloading (45%)Downloading (50%)Downloading (60%)Downloading (85%)Downloading (100%)
25-Aug-2018 16:13:45   - Installing symfony/polyfill-php70 (v1.6.0): Downloading (connecting...)Downloading (0%)           Downloading (85%)Downloading (100%)
25-Aug-2018 16:13:45   - Installing symfony/http-foundation (v3.4.3): Downloading (connecting...)Downloading (100%)         
25-Aug-2018 16:13:46   - Installing symfony/event-dispatcher (v3.4.3): Downloading (connecting...)Downloading (0%)           Downloading (5%)Downloading (90%)Downloading (95%)Downloading (100%)
25-Aug-2018 16:13:47   - Installing symfony/http-kernel (v3.4.3): Downloading (connecting...)Downloading (0%)           Downloading (5%)Downloading (10%)Downloading (15%)Downloading (20%)Downloading (25%)Downloading (30%)Downloading (35%)Downloading (40%)Downloading (45%)Downloading (50%)Downloading (55%)Downloading (60%)Downloading (65%)Downloading (70%)Downloading (75%)Downloading (80%)Downloading (85%)Downloading (90%)Downloading (95%)Downloading (100%)
25-Aug-2018 16:13:48   - Installing symfony/dependency-injection (v3.4.3): Downloading (connecting...)Downloading (100%)         
25-Aug-2018 16:13:49   - Installing zendframework/zend-eventmanager (3.2.0): Downloading (connecting...)Downloading (0%)           Downloading (25%)Downloading (35%)Downloading (50%)Downloading (70%)Downloading (100%)
25-Aug-2018 16:13:50   - Installing zendframework/zend-code (2.6.3): Downloading (connecting...)Downloading (0%)           Downloading (5%)Downloading (10%)Downloading (15%)Downloading (20%)Downloading (25%)Downloading (35%)Downloading (40%)Downloading (45%)Downloading (50%)Downloading (55%)Downloading (60%)Downloading (65%)Downloading (70%)Downloading (75%)Downloading (80%)Downloading (85%)Downloading (90%)Downloading (95%)Downloading (100%)
25-Aug-2018 16:13:51   - Installing ocramius/proxy-manager (1.0.2): Downloading (connecting...)Downloading (100%)         
25-Aug-2018 16:13:52   - Installing symfony/proxy-manager-bridge (v3.4.3): Downloading (connecting...)Downloading (0%)           Downloading (75%)Downloading (100%)
25-Aug-2018 16:13:54   - Installing symfony/routing (v3.4.3): Downloading (connecting...)Downloading (0%)           Downloading (5%)Downloading (10%)Downloading (15%)Downloading (20%)Downloading (25%)Downloading (30%)Downloading (35%)Downloading (40%)Downloading (45%)Downloading (50%)Downloading (55%)Downloading (60%)Downloading (65%)Downloading (70%)Downloading (75%)Downloading (80%)Downloading (85%)Downloading (90%)Downloading (95%)Downloading (100%)
25-Aug-2018 16:13:55   - Installing twig/twig (v1.35.3): Downloading (connecting...)Downloading (100%)         
25-Aug-2018 16:13:56   - Installing symfony/twig-bridge (v3.4.3): Downloading (connecting...)Downloading (0%)           Downloading (5%)Downloading (10%)Downloading (20%)Downloading (30%)Downloading (35%)Downloading (40%)Downloading (45%)Downloading (55%)Downloading (65%)Downloading (70%)Downloading (75%)Downloading (80%)Downloading (85%)Downloading (95%)Downloading (100%)
25-Aug-2018 16:13:57   - Installing symfony/dom-crawler (v3.4.3): Downloading (connecting...)Downloading (100%)         
25-Aug-2018 16:13:58   - Installing symfony/css-selector (v3.4.3): Downloading (connecting...)Downloading (100%)         
25-Aug-2018 16:13:59   - Installing symfony/browser-kit (v3.4.3): Downloading (connecting...)Downloading (0%)           Downloading (5%)Downloading (70%)Downloading (100%)
25-Aug-2018 16:14:00   - Installing guzzlehttp/guzzle (6.3.0): Downloading (connecting...)Downloading (0%)           Downloading (5%)Downloading (15%)Downloading (20%)Downloading (30%)Downloading (35%)Downloading (45%)Downloading (50%)Downloading (60%)Downloading (65%)Downloading (75%)Downloading (80%)Downloading (90%)Downloading (95%)Downloading (100%)
25-Aug-2018 16:14:00   - Installing fabpot/goutte (v3.2.2): Downloading (connecting...)Downloading (100%)         
25-Aug-2018 16:14:02   - Installing facebook/webdriver (1.5.0): Downloading (connecting...)Downloading (0%)           Downloading (5%)Downloading (10%)Downloading (15%)Downloading (20%)Downloading (25%)Downloading (30%)Downloading (35%)Downloading (40%)Downloading (45%)Downloading (50%)Downloading (55%)Downloading (60%)Downloading (65%)Downloading (70%)Downloading (75%)Downloading (80%)Downloading (85%)Downloading (90%)Downloading (95%)Downloading (100%)
25-Aug-2018 16:14:03   - Installing symfony/yaml (v3.4.3): Downloading (connecting...)Downloading (0%)           Downloading (5%)Downloading (10%)Downloading (15%)Downloading (20%)Downloading (25%)Downloading (30%)Downloading (35%)Downloading (40%)Downloading (45%)Downloading (50%)Downloading (100%)
25-Aug-2018 16:14:04   - Installing laravel/homestead (v7.7.0): Downloading (connecting...)Downloading (100%)         
25-Aug-2018 16:14:06   - Installing phing/phing (2.4.14): Downloading (connecting...)Downloading (0%)           Downloading (5%)Downloading (10%)Downloading (15%)Downloading (20%)Downloading (25%)Downloading (30%)Downloading (35%)Downloading (40%)Downloading (45%)Downloading (50%)Downloading (55%)Downloading (60%)Downloading (65%)Downloading (70%)Downloading (75%)Downloading (80%)Downloading (85%)Downloading (90%)Downloading (95%)Downloading (100%)
25-Aug-2018 16:14:07   - Installing webmozart/assert (1.2.0): Downloading (connecting...)Downloading (0%)           Downloading (55%)Downloading (80%)Downloading (100%)
25-Aug-2018 16:14:08   - Installing phpdocumentor/reflection-common (1.0.1): Downloading (connecting...)Downloading (0%)           Downloading (100%)
25-Aug-2018 16:14:09   - Installing phpdocumentor/type-resolver (0.4.0): Downloading (connecting...)Downloading (0%)           Downloading (5%)Downloading (100%)
25-Aug-2018 16:14:10   - Installing phpdocumentor/reflection-docblock (3.3.2): Downloading (connecting...)Downloading (0%)           Downloading (5%)Downloading (10%)Downloading (15%)Downloading (45%)Downloading (50%)Downloading (70%)Downloading (75%)Downloading (80%)Downloading (85%)Downloading (90%)Downloading (95%)Downloading (100%)
25-Aug-2018 16:14:10   - Installing sebastian/version (2.0.1): Downloading (connecting...)Downloading (0%)           Downloading (100%)
25-Aug-2018 16:14:11   - Installing sebastian/resource-operations (1.0.0): Downloading (connecting...)Downloading (0%)           Downloading (65%)Downloading (100%)
25-Aug-2018 16:14:12   - Installing sebastian/recursion-context (2.0.0): Downloading (connecting...)Downloading (0%)           Downloading (100%)
25-Aug-2018 16:14:12   - Installing sebastian/object-enumerator (2.0.1): Downloading (connecting...)Downloading (100%)         
25-Aug-2018 16:14:13   - Installing sebastian/global-state (1.1.1): Downloading (connecting...)Downloading (0%)           Downloading (40%)Downloading (70%)Downloading (100%)
25-Aug-2018 16:14:14   - Installing sebastian/exporter (2.0.0): Downloading (connecting...)Downloading (0%)           Downloading (100%)
25-Aug-2018 16:14:15   - Installing sebastian/environment (2.0.0): Downloading (connecting...)Downloading (0%)           Downloading (15%)Downloading (30%)Downloading (45%)Downloading (60%)Downloading (75%)Downloading (90%)Downloading (100%)
25-Aug-2018 16:14:16   - Installing sebastian/diff (1.4.3): Downloading (connecting...)Downloading (0%)           Downloading (35%)Downloading (40%)Downloading (75%)Downloading (100%)
25-Aug-2018 16:14:17   - Installing sebastian/comparator (1.2.4): Downloading (connecting...)Downloading (0%)           Downloading (10%)Downloading (75%)Downloading (100%)
25-Aug-2018 16:14:17   - Installing phpunit/php-text-template (1.2.1): Downloading (connecting...)Downloading (0%)           Downloading (35%)Downloading (100%)
25-Aug-2018 16:14:18   - Installing doctrine/instantiator (1.0.5): Downloading (connecting...)Downloading (0%)           Downloading (15%)Downloading (30%)Downloading (45%)Downloading (50%)Downloading (65%)Downloading (80%)Downloading (95%)Downloading (100%)
25-Aug-2018 16:14:19   - Installing phpunit/phpunit-mock-objects (3.4.4): Downloading (connecting...)Downloading (100%)         
25-Aug-2018 16:14:19   - Installing phpunit/php-timer (1.0.9): Downloading (connecting...)Downloading (0%)           Downloading (45%)Downloading (90%)Downloading (100%)
25-Aug-2018 16:14:20   - Installing phpunit/php-file-iterator (1.4.5): Downloading (connecting...)Downloading (0%)           Downloading (100%)
25-Aug-2018 16:14:20   - Installing sebastian/code-unit-reverse-lookup (1.0.1): Downloading (connecting...)Downloading (0%)           Downloading (55%)Downloading (100%)
25-Aug-2018 16:14:21   - Installing phpunit/php-token-stream (1.4.12): Downloading (connecting...)Downloading (0%)           Downloading (5%)Downloading (10%)Downloading (15%)Downloading (20%)Downloading (100%)
25-Aug-2018 16:14:24   - Installing phpunit/php-code-coverage (4.0.8): Downloading (connecting...)Downloading (0%)           Downloading (5%)Downloading (10%)Downloading (15%)Downloading (20%)Downloading (25%)Downloading (30%)Downloading (35%)Downloading (40%)Downloading (45%)Downloading (50%)Downloading (55%)Downloading (60%)Downloading (65%)Downloading (70%)Downloading (75%)Downloading (80%)Downloading (85%)Downloading (90%)Downloading (95%)Downloading (100%)
25-Aug-2018 16:14:24   - Installing phpspec/prophecy (1.7.6): Downloading (connecting...)Downloading (100%)         
25-Aug-2018 16:14:25   - Installing myclabs/deep-copy (1.7.0): Downloading (connecting...)Downloading (0%)           Downloading (15%)Downloading (20%)Downloading (35%)Downloading (40%)Downloading (45%)Downloading (50%)Downloading (65%)Downloading (70%)Downloading (85%)Downloading (90%)Downloading (100%)
25-Aug-2018 16:14:27   - Installing phpunit/phpunit (5.7.26): Downloading (connecting...)Downloading (0%)           Downloading (5%)Downloading (10%)Downloading (15%)Downloading (20%)Downloading (25%)Downloading (30%)Downloading (35%)Downloading (40%)Downloading (45%)Downloading (50%)Downloading (55%)Downloading (60%)Downloading (65%)Downloading (70%)Downloading (75%)Downloading (80%)Downloading (85%)Downloading (90%)Downloading (95%)Downloading (100%)
25-Aug-2018 16:14:28   - Installing phpunit/dbunit (2.0.3): Downloading (connecting...)Downloading (100%)         
25-Aug-2018 16:14:28   - Installing squizlabs/php_codesniffer (2.9.1): Downloading (connecting...)Downloading (0%)           Downloading (5%)Downloading (10%)Downloading (15%)Downloading (20%)Downloading (25%)Downloading (30%)Downloading (35%)Downloading (40%)Downloading (45%)Downloading (50%)Downloading (55%)Downloading (60%)Downloading (65%)Downloading (70%)Downloading (75%)Downloading (80%)Downloading (85%)Downloading (90%)Downloading (95%)Downloading (100%)
25-Aug-2018 16:14:29 symfony/console suggests installing symfony/lock ()
25-Aug-2018 16:14:29 lusitanian/oauth suggests installing predis/predis (Allows using the Redis storage backend.)
25-Aug-2018 16:14:29 patchwork/utf8 suggests installing ext-intl (Use Intl for best performance)
25-Aug-2018 16:14:29 patchwork/utf8 suggests installing ext-wfio (Use WFIO for UTF-8 filesystem access on Windows)
25-Aug-2018 16:14:29 s9e/text-formatter suggests installing ext-intl (Allows international URLs to be accepted by the URL filter)
25-Aug-2018 16:14:29 s9e/text-formatter suggests installing ext-xsl (Enables the XSLT renderer)
25-Aug-2018 16:14:29 paragonie/random_compat suggests installing ext-libsodium (Provides a modern crypto API that can be used to generate random bytes.)
25-Aug-2018 16:14:29 symfony/http-kernel suggests installing symfony/var-dumper ()
25-Aug-2018 16:14:29 symfony/dependency-injection suggests installing symfony/expression-language (For using expressions in service container configuration)
25-Aug-2018 16:14:29 zendframework/zend-eventmanager suggests installing container-interop/container-interop (^1.1.0, to use the lazy listeners feature)
25-Aug-2018 16:14:29 zendframework/zend-eventmanager suggests installing zendframework/zend-stdlib (^2.7.3 || ^3.0, to use the FilterChain feature)
25-Aug-2018 16:14:29 zendframework/zend-code suggests installing doctrine/annotations (Doctrine\Common\Annotations >=1.0 for annotation features)
25-Aug-2018 16:14:29 zendframework/zend-code suggests installing zendframework/zend-stdlib (Zend\Stdlib component)
25-Aug-2018 16:14:29 ocramius/proxy-manager suggests installing ocramius/generated-hydrator (To have very fast object to array to object conversion for ghost objects)
25-Aug-2018 16:14:29 ocramius/proxy-manager suggests installing zendframework/zend-json (To have the JsonRpc adapter (Remote Object feature))
25-Aug-2018 16:14:29 ocramius/proxy-manager suggests installing zendframework/zend-soap (To have the Soap adapter (Remote Object feature))
25-Aug-2018 16:14:29 ocramius/proxy-manager suggests installing zendframework/zend-stdlib (To use the hydrator proxy)
25-Aug-2018 16:14:29 ocramius/proxy-manager suggests installing zendframework/zend-xmlrpc (To have the XmlRpc adapter (Remote Object feature))
25-Aug-2018 16:14:29 symfony/routing suggests installing doctrine/annotations (For using the annotation loader)
25-Aug-2018 16:14:29 symfony/routing suggests installing symfony/expression-language (For using expression matching)
25-Aug-2018 16:14:29 symfony/twig-bridge suggests installing symfony/asset (For using the AssetExtension)
25-Aug-2018 16:14:29 symfony/twig-bridge suggests installing symfony/expression-language (For using the ExpressionExtension)
25-Aug-2018 16:14:29 symfony/twig-bridge suggests installing symfony/form (For using the FormExtension)
25-Aug-2018 16:14:29 symfony/twig-bridge suggests installing symfony/security (For using the SecurityExtension)
25-Aug-2018 16:14:29 symfony/twig-bridge suggests installing symfony/stopwatch (For using the StopwatchExtension)
25-Aug-2018 16:14:29 symfony/twig-bridge suggests installing symfony/templating (For using the TwigEngine)
25-Aug-2018 16:14:29 symfony/twig-bridge suggests installing symfony/translation (For using the TranslationExtension)
25-Aug-2018 16:14:29 symfony/twig-bridge suggests installing symfony/var-dumper (For using the DumpExtension)
25-Aug-2018 16:14:29 symfony/twig-bridge suggests installing symfony/web-link (For using the WebLinkExtension)
25-Aug-2018 16:14:29 sebastian/global-state suggests installing ext-uopz (*)
25-Aug-2018 16:14:29 phpunit/phpunit-mock-objects suggests installing ext-soap (*)
25-Aug-2018 16:14:29 phpunit/phpunit suggests installing phpunit/php-invoker (~1.1)
25-Aug-2018 16:14:29 Generating autoload files
25-Aug-2018 16:14:30 Buildfile: /data/build/build.xml
25-Aug-2018 16:14:30
25-Aug-2018 16:14:30 phpBB > clean:
25-Aug-2018 16:14:30
25-Aug-2018 16:14:30    [delete] Directory /data/build/logs does not exist or is not a directory.
25-Aug-2018 16:14:30    [delete] Directory /data/build/api does not exist or is not a directory.
25-Aug-2018 16:14:30    [delete] Directory /data/build/codebrowser does not exist or is not a directory.
25-Aug-2018 16:14:30    [delete] Directory /data/build/coverage does not exist or is not a directory.
25-Aug-2018 16:14:30    [delete] Directory /data/build/cpd does not exist or is not a directory.
25-Aug-2018 16:14:30    [delete] Directory /data/build/dependencies does not exist or is not a directory.
25-Aug-2018 16:14:30    [delete] Directory /data/build/new_version does not exist or is not a directory.
25-Aug-2018 16:14:30    [delete] Directory /data/build/old_versions does not exist or is not a directory.
25-Aug-2018 16:14:30    [delete] Directory /data/build/save does not exist or is not a directory.
25-Aug-2018 16:14:30
25-Aug-2018 16:14:30 phpBB > prepare:
25-Aug-2018 16:14:30
25-Aug-2018 16:14:30     [mkdir] Created dir: /data/build/logs
25-Aug-2018 16:14:30     [mkdir] Created dir: /data/build/api
25-Aug-2018 16:14:30     [mkdir] Created dir: /data/build/codebrowser
25-Aug-2018 16:14:30     [mkdir] Created dir: /data/build/coverage
25-Aug-2018 16:14:30     [mkdir] Created dir: /data/build/cpd
25-Aug-2018 16:14:30     [mkdir] Created dir: /data/build/dependencies
25-Aug-2018 16:14:30     [mkdir] Created dir: /data/build/new_version
25-Aug-2018 16:14:30     [mkdir] Created dir: /data/build/new_version/files
25-Aug-2018 16:14:30     [mkdir] Created dir: /data/build/new_version/patches
25-Aug-2018 16:14:30     [mkdir] Created dir: /data/build/new_version/release_files
25-Aug-2018 16:14:30     [mkdir] Created dir: /data/build/new_version/update
25-Aug-2018 16:14:30     [mkdir] Created dir: /data/build/old_versions
25-Aug-2018 16:14:30     [mkdir] Created dir: /data/build/save
25-Aug-2018 16:14:30
25-Aug-2018 16:14:30 BUILD FINISHED
25-Aug-2018 16:14:30
25-Aug-2018 16:14:30 Total time: 0.1032 seconds
25-Aug-2018 16:14:30
25-Aug-2018 16:14:30 Finished task 'Prepare directory' with result: Success
25-Aug-2018 16:14:30 Skipping execution of task 'Run sniffs' as it is disabled
25-Aug-2018 16:14:30
Substituting variable: ${bamboo.working.directory} with /home/bamboo/xml-data/build-dir/PHPBB3-PR-JOB1
25-Aug-2018 16:14:30 Starting task 'Run sniffs' of type 'com.atlassian.bamboo.plugins.bamboo-docker-plugin:task.docker.cli'
25-Aug-2018 16:14:30 Running image name (phpbb:php-5.6)
25-Aug-2018 16:14:30
Beginning to execute external process for build 'phpBB3 - Pull Requests - Build and Test Job #8711 (PHPBB3-PR-JOB1-8711)'
... running command line:
/usr/bin/docker run --volume /home/bamboo/xml-data/build-dir/PHPBB3-PR-JOB1:/data --workdir /data/build --rm -u=991 phpbb:php-5.6 ../phpBB/vendor/bin/phing sniff
... in: /home/bamboo/xml-data/build-dir/PHPBB3-PR-JOB1
... using extra environment variables:
bamboo_planRepository_1_branch=3.1.x
bamboo_planRepository_1_branchDisplayName=3.1.x
bamboo_repository_revision_number=dc8ff9da28b8ab4ad11c7ea94cca526f17c87fe5
bamboo_PRref=master
bamboo_resultsUrl=https://bamboo.phpbb.com/browse/PHPBB3-PR-JOB1-8711
bamboo_capability_system_builder_command_Git=/usr/bin/git
bamboo_repository_75956235_git_username=bantu
bamboo_build_working_directory=/home/bamboo/xml-data/build-dir/PHPBB3-PR-JOB1
bamboo_planRepository_1_name=phpBB Ascraeus
bamboo_buildKey=PHPBB3-PR-JOB1
bamboo_capability_phpbb_tests=true
bamboo_shortPlanName=Pull Requests
bamboo_capability_system_builder_command_fop=/usr/bin/fop
bamboo_capability_dbms_sqlite_2=true
bamboo_planRepository_name=phpBB Ascraeus
bamboo_PRnumber=5270
bamboo_buildNumber=8711
bamboo_repository_75956235_git_repositoryUrl=https://github.com/phpbb/phpbb.git
bamboo_capability_system_builder_phpunit_PHPUnit=/usr/bin/phpunit
bamboo_shortJobName=Build and Test Job
bamboo_buildResultsUrl=https://bamboo.phpbb.com/browse/PHPBB3-PR-JOB1-8711
bamboo_repository_75956235_branch_name=3.1.x
bamboo_planRepository_repositoryUrl=https://github.com/phpbb/phpbb.git
bamboo_agentId=131073
bamboo_planName=phpBB3 - Pull Requests
bamboo_build_commandline_com_atlassian_bamboo_plugins_scripttask_task_builder_script_7=/bin/sh /home/bamboo/temp/PHPBB3-PR-JOB1-8711-ScriptBuildTask-1485860256103364640.sh
bamboo_shortPlanKey=PR
bamboo_shortJobKey=JOB1
bamboo_capability_dbms_mysql_55=true
bamboo_capability_system_jdk_JDK_1_7_0_65=/usr/lib/jvm/java-7-openjdk-amd64
bamboo_planRepository_revision=dc8ff9da28b8ab4ad11c7ea94cca526f17c87fe5
bamboo_buildTimeStamp=2018-08-25T16:13:06.244Z
bamboo_repository_previous_revision_number=dc8ff9da28b8ab4ad11c7ea94cca526f17c87fe5
bamboo_capability_system_jdk_JDK_1_6_0_16=/usr/lib/jvm/java-6-sun-1.6.0.16
bamboo_capability_system_builder_mvn2_Maven_2=/usr/share/maven2
bamboo_planRepository_previousRevision=dc8ff9da28b8ab4ad11c7ea94cca526f17c87fe5
bamboo_build_commandline_com_atlassian_bamboo_plugins_scripttask_task_builder_script_4=/bin/sh /home/bamboo/temp/PHPBB3-PR-JOB1-8711-ScriptBuildTask-7927193096220711349.sh
bamboo_repository_git_branch=3.1.x
bamboo_buildResultKey=PHPBB3-PR-JOB1-8711
bamboo_repository_branch_name=3.1.x
bamboo_buildPlanName=phpBB3 - Pull Requests - Build and Test Job
bamboo_planRepository_1_revision=dc8ff9da28b8ab4ad11c7ea94cca526f17c87fe5
bamboo_repository_name=phpBB Ascraeus
bamboo_buildFailed=false
bamboo_capability_system_docker_executable=/usr/bin/docker
bamboo_build_commandline_com_atlassian_bamboo_plugins_bamboo_docker_plugin_task_docker_cli_12=/usr/bin/docker run --volume /home/bamboo/xml-data/build-dir/PHPBB3-PR-JOB1:/data --workdir /data/phpBB --rm -e HOME=/home/bamboo -u=991 phpbb:php-5.6 /bin/bash -c php ../composer.phar install --dev; cd ../build; ../phpBB/vendor/bin/phing clean prepare
bamboo_planRepository_branch=3.1.x
bamboo_agentWorkingDirectory=/home/bamboo/xml-data/build-dir
bamboo_capability_system_git_executable=/usr/bin/git
bamboo_capability_system_builder_phpunit_PHPUnit_3_4=/usr/bin/phpunit
bamboo_repository_git_username=bantu
bamboo_planRepository_1_previousRevision=dc8ff9da28b8ab4ad11c7ea94cca526f17c87fe5
bamboo_repository_75956235_revision_number=dc8ff9da28b8ab4ad11c7ea94cca526f17c87fe5
bamboo_planRepository_branchDisplayName=3.1.x
bamboo_planRepository_1_type=gitv2
bamboo_planRepository_branchName=3.1.x
bamboo_repository_75956235_previous_revision_number=dc8ff9da28b8ab4ad11c7ea94cca526f17c87fe5
bamboo_capability_system_jdk_JDK=/usr/lib/jvm/java-6-sun
bamboo_plan_storageTag=PHPBB3-PR
bamboo_hg_cache_directory=/home/bamboo/xml-data/build-dir/_hg-repositories-cache
bamboo_planRepository_1_username=bantu
bamboo_planRepository_type=gitv2
bamboo_git_cache_directory=/home/bamboo/xml-data/build-dir/_git-repositories-cache
bamboo_ManualBuildTriggerReason_userName=Build Robot
bamboo_repository_git_repositoryUrl=https://github.com/phpbb/phpbb.git
bamboo_repository_75956235_git_branch=3.1.x
bamboo_capability_system_builder_ant_Ant=/usr/share/ant
bamboo_repository_75956235_name=phpBB Ascraeus
bamboo_tmp_directory=/home/bamboo/temp
bamboo_working_directory=/home/bamboo/xml-data/build-dir/PHPBB3-PR-JOB1
bamboo_planKey=PHPBB3-PR
bamboo_capability_local=true
bamboo_planRepository_1_repositoryUrl=https://github.com/phpbb/phpbb.git
bamboo_planRepository_username=bantu
bamboo_capability_system_jdk_JDK_1_6=/usr/lib/jvm/java-6-sun
bamboo_capability_system_jdk_JDK_1_7=/usr/lib/jvm/java-7-openjdk-amd64
bamboo_planRepository_1_branchName=3.1.x
25-Aug-2018 16:14:30 Buildfile: /data/build/build.xml
25-Aug-2018 16:14:31
25-Aug-2018 16:14:31 phpBB > sniff:
25-Aug-2018 16:14:31
25-Aug-2018 16:14:38 ............................................................  60 / 756 (8%)
25-Aug-2018 16:14:39 ............................................................ 120 / 756 (16%)
25-Aug-2018 16:14:40 ............................................................ 180 / 756 (24%)
25-Aug-2018 16:14:41 ............................................................ 240 / 756 (32%)
25-Aug-2018 16:14:44 ............................................................ 300 / 756 (40%)
25-Aug-2018 16:14:50 ............................................................ 360 / 756 (48%)
25-Aug-2018 16:14:55 ............................................................ 420 / 756 (56%)
25-Aug-2018 16:14:59 ............................................................ 480 / 756 (63%)
25-Aug-2018 16:15:02 ............................................................ 540 / 756 (71%)
25-Aug-2018 16:15:06 ............................................................ 600 / 756 (79%)
25-Aug-2018 16:15:11 ............................................................ 660 / 756 (87%)
25-Aug-2018 16:15:14 ............................................................ 720 / 756 (95%)
25-Aug-2018 16:15:15 ....................................
25-Aug-2018 16:15:15
25-Aug-2018 16:15:15 Time: 44.81 secs; Memory: 64.25Mb
25-Aug-2018 16:15:15
25-Aug-2018 16:15:23 ............................................................  60 / 209 (29%)
25-Aug-2018 16:15:42 ............................................................ 120 / 209 (57%)
25-Aug-2018 16:15:55 .......................E.................................... 180 / 209 (86%)
25-Aug-2018 16:16:03 .............................
25-Aug-2018 16:16:03
25-Aug-2018 16:16:03
25-Aug-2018 16:16:03 FILE: /data/phpBB/includes/acp/acp_storage.php
25-Aug-2018 16:16:03 ----------------------------------------------------------------------
25-Aug-2018 16:16:03 FOUND 2 ERRORS AFFECTING 2 LINES
25-Aug-2018 16:16:03 ----------------------------------------------------------------------
25-Aug-2018 16:16:03 586 | ERROR | There should be exactly one space between the keyword and
25-Aug-2018 16:16:03      |       | opening parenthesis
25-Aug-2018 16:16:03      |       | (phpbb.ControlStructures.OpeningParenthesis.NoSpaceBeforeOpeningParenthesis)
25-Aug-2018 16:16:03 613 | ERROR | There should be exactly one space between the keyword and
25-Aug-2018 16:16:03      |       | opening parenthesis
25-Aug-2018 16:16:03      |       | (phpbb.ControlStructures.OpeningParenthesis.NoSpaceBeforeOpeningParenthesis)
25-Aug-2018 16:16:03 ----------------------------------------------------------------------
25-Aug-2018 16:16:03
25-Aug-2018 16:16:03 Time: 47.74 secs; Memory: 60.75Mb
25-Aug-2018 16:16:03
25-Aug-2018 16:16:03
25-Aug-2018 16:16:03
25-Aug-2018 16:16:03 Time: 18ms; Memory: 3.75Mb
25-Aug-2018 16:16:03
25-Aug-2018 16:16:03        [if] Error in IfTask
25-Aug-2018 16:16:03 Execution of target "sniff" failed for the following reason: /data/build/build.xml:109:6: /data/build/build.xml:115:9: PHP Code Sniffer failed.
25-Aug-2018 16:16:03
25-Aug-2018 16:16:03 BUILD FAILED
25-Aug-2018 16:16:03 /data/build/build.xml:109:6: /data/build/build.xml:115:9: PHP Code Sniffer failed.
25-Aug-2018 16:16:03 Total time: 2 minutes  32.88 seconds
25-Aug-2018 16:16:03
25-Aug-2018 16:16:03 Error occurred while running Task 'Run sniffs(11)' of type com.atlassian.bamboo.plugins.bamboo-docker-plugin:task.docker.cli.
25-Aug-2018 16:16:03 com.atlassian.bamboo.task.TaskException: Failed to execute task
25-Aug-2018 16:16:03         at com.atlassian.bamboo.plugins.docker.service.RunService.execute(RunService.java:75)
25-Aug-2018 16:16:03         at com.atlassian.bamboo.plugins.docker.tasks.cli.DockerCliTask.execute(DockerCliTask.java:70)
25-Aug-2018 16:16:03         at com.atlassian.bamboo.task.TaskExecutorImpl.lambda$executeTasks$3(TaskExecutorImpl.java:285)
25-Aug-2018 16:16:03         at com.atlassian.bamboo.task.TaskExecutorImpl.executeTaskWithPrePostActions(TaskExecutorImpl.java:224)
25-Aug-2018 16:16:03         at com.atlassian.bamboo.task.TaskExecutorImpl.executeTasks(TaskExecutorImpl.java:285)
25-Aug-2018 16:16:03         at com.atlassian.bamboo.task.TaskExecutorImpl.execute(TaskExecutorImpl.java:112)
25-Aug-2018 16:16:03         at com.atlassian.bamboo.build.pipeline.tasks.ExecuteBuildTask.call(ExecuteBuildTask.java:71)
25-Aug-2018 16:16:03         at com.atlassian.bamboo.v2.build.agent.DefaultBuildAgent.executeBuildPhase(DefaultBuildAgent.java:203)
25-Aug-2018 16:16:03         at com.atlassian.bamboo.v2.build.agent.DefaultBuildAgent.build(DefaultBuildAgent.java:175)
25-Aug-2018 16:16:03         at com.atlassian.bamboo.v2.build.agent.BuildAgentControllerImpl.lambda$waitAndPerformBuild$0(BuildAgentControllerImpl.java:122)
25-Aug-2018 16:16:03         at com.atlassian.bamboo.variable.CustomVariableContextImpl.withVariableSubstitutor(CustomVariableContextImpl.java:185)
25-Aug-2018 16:16:03         at com.atlassian.bamboo.v2.build.agent.BuildAgentControllerImpl.waitAndPerformBuild(BuildAgentControllerImpl.java:117)
25-Aug-2018 16:16:03         at com.atlassian.bamboo.v2.build.agent.DefaultBuildAgent$1.run(DefaultBuildAgent.java:126)
25-Aug-2018 16:16:03         at com.atlassian.bamboo.utils.BambooRunnables$1.run(BambooRunnables.java:48)
25-Aug-2018 16:16:03         at com.atlassian.bamboo.security.ImpersonationHelper.runWith(ImpersonationHelper.java:26)
25-Aug-2018 16:16:03         at com.atlassian.bamboo.security.ImpersonationHelper.runWithSystemAuthority(ImpersonationHelper.java:17)
25-Aug-2018 16:16:03         at com.atlassian.bamboo.security.ImpersonationHelper$1.run(ImpersonationHelper.java:41)
25-Aug-2018 16:16:03         at java.lang.Thread.run(Thread.java:748)
25-Aug-2018 16:16:03 Caused by: com.atlassian.bamboo.docker.DockerException: Error running Docker run command
25-Aug-2018 16:16:03         at com.atlassian.bamboo.docker.DockerContainerServiceImpl.run(DockerContainerServiceImpl.java:118)
25-Aug-2018 16:16:03         at sun.reflect.GeneratedMethodAccessor2599.invoke(Unknown Source)
25-Aug-2018 16:16:03         at sun.reflect.DelegatingMethodAccessorImpl.invoke(DelegatingMethodAccessorImpl.java:43)
25-Aug-2018 16:16:03         at java.lang.reflect.Method.invoke(Method.java:498)
25-Aug-2018 16:16:03         at com.atlassian.plugin.util.ContextClassLoaderSettingInvocationHandler.invoke(ContextClassLoaderSettingInvocationHandler.java:26)
25-Aug-2018 16:16:03         at com.sun.proxy.$Proxy401.run(Unknown Source)
25-Aug-2018 16:16:03         at sun.reflect.GeneratedMethodAccessor2599.invoke(Unknown Source)
25-Aug-2018 16:16:03         at sun.reflect.DelegatingMethodAccessorImpl.invoke(DelegatingMethodAccessorImpl.java:43)
25-Aug-2018 16:16:03         at java.lang.reflect.Method.invoke(Method.java:498)
25-Aug-2018 16:16:03         at org.springframework.aop.support.AopUtils.invokeJoinpointUsingReflection(AopUtils.java:302)
25-Aug-2018 16:16:03         at org.eclipse.gemini.blueprint.service.importer.support.internal.aop.ServiceInvoker.doInvoke(ServiceInvoker.java:56)
25-Aug-2018 16:16:03         at org.eclipse.gemini.blueprint.service.importer.support.internal.aop.ServiceInvoker.invoke(ServiceInvoker.java:60)
25-Aug-2018 16:16:03         at org.springframework.aop.framework.ReflectiveMethodInvocation.proceed(ReflectiveMethodInvocation.java:179)
25-Aug-2018 16:16:03         at org.springframework.aop.support.DelegatingIntroductionInterceptor.doProceed(DelegatingIntroductionInterceptor.java:133)
25-Aug-2018 16:16:03         at org.springframework.aop.support.DelegatingIntroductionInterceptor.invoke(DelegatingIntroductionInterceptor.java:121)
25-Aug-2018 16:16:03         at org.springframework.aop.framework.ReflectiveMethodInvocation.proceed(ReflectiveMethodInvocation.java:179)
25-Aug-2018 16:16:03         at org.eclipse.gemini.blueprint.service.util.internal.aop.ServiceTCCLInterceptor.invokeUnprivileged(ServiceTCCLInterceptor.java:70)
25-Aug-2018 16:16:03         at org.eclipse.gemini.blueprint.service.util.internal.aop.ServiceTCCLInterceptor.invoke(ServiceTCCLInterceptor.java:53)
25-Aug-2018 16:16:03         at org.springframework.aop.framework.ReflectiveMethodInvocation.proceed(ReflectiveMethodInvocation.java:179)
25-Aug-2018 16:16:03         at org.eclipse.gemini.blueprint.service.importer.support.LocalBundleContextAdvice.invoke(LocalBundleContextAdvice.java:57)
25-Aug-2018 16:16:03         at org.springframework.aop.framework.ReflectiveMethodInvocation.proceed(ReflectiveMethodInvocation.java:179)
25-Aug-2018 16:16:03         at org.springframework.aop.support.DelegatingIntroductionInterceptor.doProceed(DelegatingIntroductionInterceptor.java:133)
25-Aug-2018 16:16:03         at org.springframework.aop.support.DelegatingIntroductionInterceptor.invoke(DelegatingIntroductionInterceptor.java:121)
25-Aug-2018 16:16:03         at org.springframework.aop.framework.ReflectiveMethodInvocation.proceed(ReflectiveMethodInvocation.java:179)
25-Aug-2018 16:16:03         at org.springframework.aop.framework.JdkDynamicAopProxy.invoke(JdkDynamicAopProxy.java:207)
25-Aug-2018 16:16:03         at com.sun.proxy.$Proxy695.run(Unknown Source)
25-Aug-2018 16:16:03         at com.atlassian.bamboo.plugins.docker.client.DockerCmd.run(DockerCmd.java:51)
25-Aug-2018 16:16:03         at com.atlassian.bamboo.plugins.docker.service.RunService.execute(RunService.java:64)
25-Aug-2018 16:16:03         ... 17 more
25-Aug-2018 16:16:03 Caused by: com.atlassian.utils.process.ProcessException: Error executing /usr/bin/docker run --volume /home/bamboo/xml-data/build-dir/PHPBB3-PR-JOB1:/data --workdir /data/build --rm -u=991 phpbb:php-5.6 ../phpBB/vendor/bin/phing sniff
25-Aug-2018 16:16:03         at com.atlassian.bamboo.docker.DockerContainerServiceImpl.execute(DockerContainerServiceImpl.java:252)
25-Aug-2018 16:16:03         at com.atlassian.bamboo.docker.DockerContainerServiceImpl.run(DockerContainerServiceImpl.java:106)
25-Aug-2018 16:16:03         ... 44 more
25-Aug-2018 16:16:03 Starting task 'Parsing test results produced by script' of type 'com.atlassian.bamboo.plugins.testresultparser:task.testresultparser.junit'
25-Aug-2018 16:16:03 Parsing test results under /home/bamboo/xml-data/build-dir/PHPBB3-PR-JOB1...
25-Aug-2018 16:16:03 Failing task since test cases were expected but none were found.
25-Aug-2018 16:16:03 Finished task 'Parsing test results produced by script' with result: Failed
25-Aug-2018 16:16:03
Substituting variable: ${bamboo.PRnumber} with 5270
25-Aug-2018 16:16:03
Substituting variable: ${bamboo.buildResultsUrl} with https://bamboo.phpbb.com/browse/PHPBB3-PR-JOB1-8711
25-Aug-2018 16:16:03
Substituting variable: ${bamboo.buildResultsUrl} with https://bamboo.phpbb.com/browse/PHPBB3-PR-JOB1-8711
25-Aug-2018 16:16:03 Starting task 'Set result build status' of type 'com.atlassian.bamboo.plugins.scripttask:task.builder.script'
25-Aug-2018 16:16:03
Beginning to execute external process for build 'phpBB3 - Pull Requests - Build and Test Job #8711 (PHPBB3-PR-JOB1-8711)'
... running command line:
/bin/sh /home/bamboo/temp/PHPBB3-PR-JOB1-8711-ScriptBuildTask-5229602828572797804.sh
... in: /home/bamboo/xml-data/build-dir/PHPBB3-PR-JOB1
... using extra environment variables:
bamboo_planRepository_1_branch=3.1.x
bamboo_planRepository_1_branchDisplayName=3.1.x
bamboo_repository_revision_number=dc8ff9da28b8ab4ad11c7ea94cca526f17c87fe5
bamboo_PRref=master
bamboo_resultsUrl=https://bamboo.phpbb.com/browse/PHPBB3-PR-JOB1-8711
bamboo_capability_system_builder_command_Git=/usr/bin/git
bamboo_repository_75956235_git_username=bantu
bamboo_build_working_directory=/home/bamboo/xml-data/build-dir/PHPBB3-PR-JOB1
bamboo_planRepository_1_name=phpBB Ascraeus
bamboo_buildKey=PHPBB3-PR-JOB1
bamboo_capability_phpbb_tests=true
bamboo_shortPlanName=Pull Requests
bamboo_capability_system_builder_command_fop=/usr/bin/fop
bamboo_capability_dbms_sqlite_2=true
bamboo_planRepository_name=phpBB Ascraeus
bamboo_PRnumber=5270
bamboo_buildNumber=8711
bamboo_repository_75956235_git_repositoryUrl=https://github.com/phpbb/phpbb.git
bamboo_capability_system_builder_phpunit_PHPUnit=/usr/bin/phpunit
bamboo_shortJobName=Build and Test Job
bamboo_buildResultsUrl=https://bamboo.phpbb.com/browse/PHPBB3-PR-JOB1-8711
bamboo_repository_75956235_branch_name=3.1.x
bamboo_planRepository_repositoryUrl=https://github.com/phpbb/phpbb.git
bamboo_agentId=131073
bamboo_planName=phpBB3 - Pull Requests
bamboo_build_commandline_com_atlassian_bamboo_plugins_scripttask_task_builder_script_7=/bin/sh /home/bamboo/temp/PHPBB3-PR-JOB1-8711-ScriptBuildTask-1485860256103364640.sh
bamboo_shortPlanKey=PR
bamboo_shortJobKey=JOB1
bamboo_capability_dbms_mysql_55=true
bamboo_capability_system_jdk_JDK_1_7_0_65=/usr/lib/jvm/java-7-openjdk-amd64
bamboo_planRepository_revision=dc8ff9da28b8ab4ad11c7ea94cca526f17c87fe5
bamboo_buildTimeStamp=2018-08-25T16:13:06.244Z
bamboo_repository_previous_revision_number=dc8ff9da28b8ab4ad11c7ea94cca526f17c87fe5
bamboo_capability_system_jdk_JDK_1_6_0_16=/usr/lib/jvm/java-6-sun-1.6.0.16
bamboo_capability_system_builder_mvn2_Maven_2=/usr/share/maven2
bamboo_planRepository_previousRevision=dc8ff9da28b8ab4ad11c7ea94cca526f17c87fe5
bamboo_build_commandline_com_atlassian_bamboo_plugins_scripttask_task_builder_script_4=/bin/sh /home/bamboo/temp/PHPBB3-PR-JOB1-8711-ScriptBuildTask-7927193096220711349.sh
bamboo_repository_git_branch=3.1.x
bamboo_buildResultKey=PHPBB3-PR-JOB1-8711
bamboo_repository_branch_name=3.1.x
bamboo_buildPlanName=phpBB3 - Pull Requests - Build and Test Job
bamboo_planRepository_1_revision=dc8ff9da28b8ab4ad11c7ea94cca526f17c87fe5
bamboo_repository_name=phpBB Ascraeus
bamboo_buildFailed=true
bamboo_capability_system_docker_executable=/usr/bin/docker
bamboo_build_commandline_com_atlassian_bamboo_plugins_bamboo_docker_plugin_task_docker_cli_11=/usr/bin/docker run --volume /home/bamboo/xml-data/build-dir/PHPBB3-PR-JOB1:/data --workdir /data/build --rm -u=991 phpbb:php-5.6 ../phpBB/vendor/bin/phing sniff
bamboo_build_commandline_com_atlassian_bamboo_plugins_bamboo_docker_plugin_task_docker_cli_12=/usr/bin/docker run --volume /home/bamboo/xml-data/build-dir/PHPBB3-PR-JOB1:/data --workdir /data/phpBB --rm -e HOME=/home/bamboo -u=991 phpbb:php-5.6 /bin/bash -c php ../composer.phar install --dev; cd ../build; ../phpBB/vendor/bin/phing clean prepare
bamboo_planRepository_branch=3.1.x
bamboo_agentWorkingDirectory=/home/bamboo/xml-data/build-dir
bamboo_jobFailed=true
bamboo_capability_system_git_executable=/usr/bin/git
bamboo_capability_system_builder_phpunit_PHPUnit_3_4=/usr/bin/phpunit
bamboo_repository_git_username=bantu
bamboo_planRepository_1_previousRevision=dc8ff9da28b8ab4ad11c7ea94cca526f17c87fe5
bamboo_repository_75956235_revision_number=dc8ff9da28b8ab4ad11c7ea94cca526f17c87fe5
bamboo_planRepository_branchDisplayName=3.1.x
bamboo_planRepository_1_type=gitv2
bamboo_planRepository_branchName=3.1.x
bamboo_repository_75956235_previous_revision_number=dc8ff9da28b8ab4ad11c7ea94cca526f17c87fe5
bamboo_capability_system_jdk_JDK=/usr/lib/jvm/java-6-sun
bamboo_plan_storageTag=PHPBB3-PR
bamboo_hg_cache_directory=/home/bamboo/xml-data/build-dir/_hg-repositories-cache
bamboo_planRepository_1_username=bantu
bamboo_planRepository_type=gitv2
bamboo_git_cache_directory=/home/bamboo/xml-data/build-dir/_git-repositories-cache
bamboo_ManualBuildTriggerReason_userName=Build Robot
bamboo_repository_git_repositoryUrl=https://github.com/phpbb/phpbb.git
bamboo_repository_75956235_git_branch=3.1.x
bamboo_capability_system_builder_ant_Ant=/usr/share/ant
bamboo_repository_75956235_name=phpBB Ascraeus
bamboo_tmp_directory=/home/bamboo/temp
bamboo_working_directory=/home/bamboo/xml-data/build-dir/PHPBB3-PR-JOB1
bamboo_planKey=PHPBB3-PR
bamboo_capability_local=true
bamboo_planRepository_1_repositoryUrl=https://github.com/phpbb/phpbb.git
bamboo_planRepository_username=bantu
bamboo_capability_system_jdk_JDK_1_6=/usr/lib/jvm/java-6-sun
bamboo_capability_system_jdk_JDK_1_7=/usr/lib/jvm/java-7-openjdk-amd64
bamboo_planRepository_1_branchName=3.1.x
25-Aug-2018 16:16:05 From https://github.com/phpbb/phpbb
25-Aug-2018 16:16:05 * branch            refs/pull/5270/head -> FETCH_HEAD
25-Aug-2018 16:16:05 grep: build/logs/phpunit.xml: No such file or directory
25-Aug-2018 16:16:05 grep: build/logs/phpunit.xml: No such file or directory
25-Aug-2018 16:16:05   % Total    % Received % Xferd  Average Speed   Time    Time     Time  Current
25-Aug-2018 16:16:05                                  Dload  Upload   Total   Spent    Left  Speed
25-Aug-2018 16:16:05
25-Aug-2018 16:16:05   0     0    0     0    0     0      0      0 --:--:-- --:--:-- --:--:--     0
25-Aug-2018 16:16:05 100   273  100    93  100   180    161    312 --:--:-- --:--:-- --:--:--   313
25-Aug-2018 16:16:05 Finished task 'Set result build status' with result: Success
25-Aug-2018 16:16:05 Running post build plugin 'NCover Results Collector'
25-Aug-2018 16:16:05 Running post build plugin 'Artifact Copier'
25-Aug-2018 16:16:05 Running post build plugin 'npm Cache Cleanup'
25-Aug-2018 16:16:05 Running post build plugin 'Clover Results Collector'
25-Aug-2018 16:16:05 Running post build plugin 'Docker Container Cleanup'
25-Aug-2018 16:16:06 Successfully removed working directory at '/home/bamboo/xml-data/build-dir/PHPBB3-PR-JOB1'
25-Aug-2018 16:16:06 Finalising the build...
25-Aug-2018 16:16:06 Stopping timer.
25-Aug-2018 16:16:06 Build PHPBB3-PR-JOB1-8711 completed.
25-Aug-2018 16:16:06 Running on server: post build plugin 'NCover Results Collector'
25-Aug-2018 16:16:06 Running on server: post build plugin 'Build Hanging Detection Configuration'
25-Aug-2018 16:16:06 Running on server: post build plugin 'Clover Delta Calculator'
25-Aug-2018 16:16:06 Running on server: post build plugin 'Maven Dependencies Postprocessor'
25-Aug-2018 16:16:06 All post build plugins have finished
25-Aug-2018 16:16:06 Generating build results summary...
25-Aug-2018 16:16:06 Saving build results to disk...
25-Aug-2018 16:16:06 Logging substituted variables...
25-Aug-2018 16:16:06 Indexing build results...
25-Aug-2018 16:16:06 Finished building PHPBB3-PR-JOB1-8711.
25-Aug-2018 16:16:06
Substituting variable: ${bamboo.PRnumber} with 5270