Tests pending pull requests

Build: #8763 failed

Job: Build and Test Job failed

Stages & jobs

  1. Build and Test

Build log

The build generated 5,653 lines of output.The output is too long and has been truncated to the last 1,000 lines. Download or view full build log

13-Sep-2018 14:53:47 612) phpbb_controller_helper_route_unclean_path_test::test_helper_url_absolute with data set #4 ('controller2', array(1, 2), true, 'custom-sid', 'http://localhost/app.php/foo/...om-sid', 'params-argument (array) using...ion_id')
13-Sep-2018 14:53:47 Missing argument 6 for phpbb\routing\router::__construct(), called in /data/tests/controller/common_helper_route.php on line 142 and defined
13-Sep-2018 14:53:47
13-Sep-2018 14:53:47 /data/phpBB/phpbb/routing/router.php:98
13-Sep-2018 14:53:47 /data/tests/controller/common_helper_route.php:142
13-Sep-2018 14:53:47 /data/tests/controller/common_helper_route.php:46
13-Sep-2018 14:53:47
13-Sep-2018 14:53:47 613) phpbb_controller_helper_route_unclean_path_test::test_helper_url_absolute with data set #5 ('controller2', array(1, 2), false, 'custom-sid', 'http://localhost/app.php/foo/...om-sid', 'params-argument (array) using...ion_id')
13-Sep-2018 14:53:47 Missing argument 6 for phpbb\routing\router::__construct(), called in /data/tests/controller/common_helper_route.php on line 142 and defined
13-Sep-2018 14:53:47
13-Sep-2018 14:53:47 /data/phpBB/phpbb/routing/router.php:98
13-Sep-2018 14:53:47 /data/tests/controller/common_helper_route.php:142
13-Sep-2018 14:53:47 /data/tests/controller/common_helper_route.php:46
13-Sep-2018 14:53:47
13-Sep-2018 14:53:47 614) phpbb_controller_helper_route_unclean_path_test::test_helper_url_absolute with data set #6 ('controller3', array(3, 1, 2), true, 'custom-sid', 'http://localhost/app.php/foo/...om-sid', 'params-argument (array) using...ion_id')
13-Sep-2018 14:53:47 Missing argument 6 for phpbb\routing\router::__construct(), called in /data/tests/controller/common_helper_route.php on line 142 and defined
13-Sep-2018 14:53:47
13-Sep-2018 14:53:47 /data/phpBB/phpbb/routing/router.php:98
13-Sep-2018 14:53:47 /data/tests/controller/common_helper_route.php:142
13-Sep-2018 14:53:47 /data/tests/controller/common_helper_route.php:46
13-Sep-2018 14:53:47
13-Sep-2018 14:53:47 615) phpbb_controller_helper_route_unclean_path_test::test_helper_url_absolute with data set #7 ('controller2', array(1, 2, 'anchor'), true, false, 'http://localhost/app.php/foo/...anchor', 'anchor in params-argument (array)')
13-Sep-2018 14:53:47 Missing argument 6 for phpbb\routing\router::__construct(), called in /data/tests/controller/common_helper_route.php on line 142 and defined
13-Sep-2018 14:53:47
13-Sep-2018 14:53:47 /data/phpBB/phpbb/routing/router.php:98
13-Sep-2018 14:53:47 /data/tests/controller/common_helper_route.php:142
13-Sep-2018 14:53:47 /data/tests/controller/common_helper_route.php:46
13-Sep-2018 14:53:47
13-Sep-2018 14:53:47 616) phpbb_controller_helper_route_unclean_path_test::test_helper_url_absolute with data set #8 ('controller2', array(1, 2, 'anchor'), false, false, 'http://localhost/app.php/foo/...anchor', 'anchor in params-argument (array)')
13-Sep-2018 14:53:47 Missing argument 6 for phpbb\routing\router::__construct(), called in /data/tests/controller/common_helper_route.php on line 142 and defined
13-Sep-2018 14:53:47
13-Sep-2018 14:53:47 /data/phpBB/phpbb/routing/router.php:98
13-Sep-2018 14:53:47 /data/tests/controller/common_helper_route.php:142
13-Sep-2018 14:53:47 /data/tests/controller/common_helper_route.php:46
13-Sep-2018 14:53:47
13-Sep-2018 14:53:47 617) phpbb_controller_helper_route_unclean_path_test::test_helper_url_absolute with data set #9 ('controller3', array(3, 1, 2, 'anchor'), true, false, 'http://localhost/app.php/foo/...anchor', 'anchor in params-argument (array)')
13-Sep-2018 14:53:47 Missing argument 6 for phpbb\routing\router::__construct(), called in /data/tests/controller/common_helper_route.php on line 142 and defined
13-Sep-2018 14:53:47
13-Sep-2018 14:53:47 /data/phpBB/phpbb/routing/router.php:98
13-Sep-2018 14:53:47 /data/tests/controller/common_helper_route.php:142
13-Sep-2018 14:53:47 /data/tests/controller/common_helper_route.php:46
13-Sep-2018 14:53:47
13-Sep-2018 14:53:47 618) phpbb_controller_helper_route_unclean_path_test::test_helper_url_absolute with data set #10 ('controller2', array(1, 2, 'anchor'), true, 'custom-sid', 'http://localhost/app.php/foo/...anchor', 'anchor in params-argument (ar...ion_id')
13-Sep-2018 14:53:47 Missing argument 6 for phpbb\routing\router::__construct(), called in /data/tests/controller/common_helper_route.php on line 142 and defined
13-Sep-2018 14:53:47
13-Sep-2018 14:53:47 /data/phpBB/phpbb/routing/router.php:98
13-Sep-2018 14:53:47 /data/tests/controller/common_helper_route.php:142
13-Sep-2018 14:53:47 /data/tests/controller/common_helper_route.php:46
13-Sep-2018 14:53:47
13-Sep-2018 14:53:47 619) phpbb_controller_helper_route_unclean_path_test::test_helper_url_absolute with data set #11 ('controller2', array(1, 2, 'anchor'), false, 'custom-sid', 'http://localhost/app.php/foo/...anchor', 'anchor in params-argument (ar...ion_id')
13-Sep-2018 14:53:47 Missing argument 6 for phpbb\routing\router::__construct(), called in /data/tests/controller/common_helper_route.php on line 142 and defined
13-Sep-2018 14:53:47
13-Sep-2018 14:53:47 /data/phpBB/phpbb/routing/router.php:98
13-Sep-2018 14:53:47 /data/tests/controller/common_helper_route.php:142
13-Sep-2018 14:53:47 /data/tests/controller/common_helper_route.php:46
13-Sep-2018 14:53:47
13-Sep-2018 14:53:47 620) phpbb_controller_helper_route_unclean_path_test::test_helper_url_absolute with data set #12 ('controller3', array(3, 1, 2, 'anchor'), true, 'custom-sid', 'http://localhost/app.php/foo/...anchor', 'anchor in params-argument (ar...ion_id')
13-Sep-2018 14:53:47 Missing argument 6 for phpbb\routing\router::__construct(), called in /data/tests/controller/common_helper_route.php on line 142 and defined
13-Sep-2018 14:53:47
13-Sep-2018 14:53:47 /data/phpBB/phpbb/routing/router.php:98
13-Sep-2018 14:53:47 /data/tests/controller/common_helper_route.php:142
13-Sep-2018 14:53:47 /data/tests/controller/common_helper_route.php:46
13-Sep-2018 14:53:47
13-Sep-2018 14:53:47 621) phpbb_controller_helper_route_unclean_path_test::test_helper_url_absolute with data set #13 ('controller2', array(), true, false, 'http://localhost/app.php/foo/bar', 'no params using empty array')
13-Sep-2018 14:53:47 Missing argument 6 for phpbb\routing\router::__construct(), called in /data/tests/controller/common_helper_route.php on line 142 and defined
13-Sep-2018 14:53:47
13-Sep-2018 14:53:47 /data/phpBB/phpbb/routing/router.php:98
13-Sep-2018 14:53:47 /data/tests/controller/common_helper_route.php:142
13-Sep-2018 14:53:47 /data/tests/controller/common_helper_route.php:46
13-Sep-2018 14:53:47
13-Sep-2018 14:53:47 622) phpbb_controller_helper_route_unclean_path_test::test_helper_url_absolute with data set #14 ('controller2', array(), false, false, 'http://localhost/app.php/foo/bar', 'no params using empty array')
13-Sep-2018 14:53:47 Missing argument 6 for phpbb\routing\router::__construct(), called in /data/tests/controller/common_helper_route.php on line 142 and defined
13-Sep-2018 14:53:47
13-Sep-2018 14:53:47 /data/phpBB/phpbb/routing/router.php:98
13-Sep-2018 14:53:47 /data/tests/controller/common_helper_route.php:142
13-Sep-2018 14:53:47 /data/tests/controller/common_helper_route.php:46
13-Sep-2018 14:53:47
13-Sep-2018 14:53:47 623) phpbb_controller_helper_route_unclean_path_test::test_helper_url_absolute with data set #15 ('controller3', array(3), true, false, 'http://localhost/app.php/foo/bar/p-3', 'no params using empty array')
13-Sep-2018 14:53:47 Missing argument 6 for phpbb\routing\router::__construct(), called in /data/tests/controller/common_helper_route.php on line 142 and defined
13-Sep-2018 14:53:47
13-Sep-2018 14:53:47 /data/phpBB/phpbb/routing/router.php:98
13-Sep-2018 14:53:47 /data/tests/controller/common_helper_route.php:142
13-Sep-2018 14:53:47 /data/tests/controller/common_helper_route.php:46
13-Sep-2018 14:53:47
13-Sep-2018 14:53:47 624) phpbb_controller_helper_route_unclean_path_test::test_helper_url_absolute with data set #16 ('controller4', array(), true, false, 'http://localhost/app.php/foo/test', 'di parameter')
13-Sep-2018 14:53:47 Missing argument 6 for phpbb\routing\router::__construct(), called in /data/tests/controller/common_helper_route.php on line 142 and defined
13-Sep-2018 14:53:47
13-Sep-2018 14:53:47 /data/phpBB/phpbb/routing/router.php:98
13-Sep-2018 14:53:47 /data/tests/controller/common_helper_route.php:142
13-Sep-2018 14:53:47 /data/tests/controller/common_helper_route.php:46
13-Sep-2018 14:53:47
13-Sep-2018 14:53:47 625) phpbb_controller_helper_route_unclean_path_test::test_helper_url_relative_path with data set #0 ('controller2', array(1, 2), true, false, 'app.php/foo/bar?t=1&f=2', 'parameters in params-argument as array')
13-Sep-2018 14:53:47 Missing argument 6 for phpbb\routing\router::__construct(), called in /data/tests/controller/common_helper_route.php on line 142 and defined
13-Sep-2018 14:53:47
13-Sep-2018 14:53:47 /data/phpBB/phpbb/routing/router.php:98
13-Sep-2018 14:53:47 /data/tests/controller/common_helper_route.php:142
13-Sep-2018 14:53:47 /data/tests/controller/common_helper_route.php:46
13-Sep-2018 14:53:47
13-Sep-2018 14:53:47 626) phpbb_controller_helper_route_unclean_path_test::test_helper_url_relative_path with data set #1 ('controller2', array(1, 2), false, false, 'app.php/foo/bar?t=1&f=2', 'parameters in params-argument as array')
13-Sep-2018 14:53:47 Missing argument 6 for phpbb\routing\router::__construct(), called in /data/tests/controller/common_helper_route.php on line 142 and defined
13-Sep-2018 14:53:47
13-Sep-2018 14:53:47 /data/phpBB/phpbb/routing/router.php:98
13-Sep-2018 14:53:47 /data/tests/controller/common_helper_route.php:142
13-Sep-2018 14:53:47 /data/tests/controller/common_helper_route.php:46
13-Sep-2018 14:53:47
13-Sep-2018 14:53:47 627) phpbb_controller_helper_route_unclean_path_test::test_helper_url_relative_path with data set #2 ('controller3', array(3, 1, 2), true, false, 'app.php/foo/bar/p-3?t=1&f=2', 'parameters in params-argument as array')
13-Sep-2018 14:53:47 Missing argument 6 for phpbb\routing\router::__construct(), called in /data/tests/controller/common_helper_route.php on line 142 and defined
13-Sep-2018 14:53:47
13-Sep-2018 14:53:47 /data/phpBB/phpbb/routing/router.php:98
13-Sep-2018 14:53:47 /data/tests/controller/common_helper_route.php:142
13-Sep-2018 14:53:47 /data/tests/controller/common_helper_route.php:46
13-Sep-2018 14:53:47
13-Sep-2018 14:53:47 628) phpbb_controller_helper_route_unclean_path_test::test_helper_url_relative_path with data set #3 ('controller3', array(3, 1, 2), false, false, 'app.php/foo/bar/p-3?t=1&f=2', 'parameters in params-argument as array')
13-Sep-2018 14:53:47 Missing argument 6 for phpbb\routing\router::__construct(), called in /data/tests/controller/common_helper_route.php on line 142 and defined
13-Sep-2018 14:53:47
13-Sep-2018 14:53:47 /data/phpBB/phpbb/routing/router.php:98
13-Sep-2018 14:53:47 /data/tests/controller/common_helper_route.php:142
13-Sep-2018 14:53:47 /data/tests/controller/common_helper_route.php:46
13-Sep-2018 14:53:47
13-Sep-2018 14:53:47 629) phpbb_controller_helper_route_unclean_path_test::test_helper_url_relative_path with data set #4 ('controller2', array(1, 2), true, 'custom-sid', 'app.php/foo/bar?t=1&f=2&a...om-sid', 'params-argument (array) using...ion_id')
13-Sep-2018 14:53:47 Missing argument 6 for phpbb\routing\router::__construct(), called in /data/tests/controller/common_helper_route.php on line 142 and defined
13-Sep-2018 14:53:47
13-Sep-2018 14:53:47 /data/phpBB/phpbb/routing/router.php:98
13-Sep-2018 14:53:47 /data/tests/controller/common_helper_route.php:142
13-Sep-2018 14:53:47 /data/tests/controller/common_helper_route.php:46
13-Sep-2018 14:53:47
13-Sep-2018 14:53:47 630) phpbb_controller_helper_route_unclean_path_test::test_helper_url_relative_path with data set #5 ('controller2', array(1, 2), false, 'custom-sid', 'app.php/foo/bar?t=1&f=2&sid=custom-sid', 'params-argument (array) using...ion_id')
13-Sep-2018 14:53:47 Missing argument 6 for phpbb\routing\router::__construct(), called in /data/tests/controller/common_helper_route.php on line 142 and defined
13-Sep-2018 14:53:47
13-Sep-2018 14:53:47 /data/phpBB/phpbb/routing/router.php:98
13-Sep-2018 14:53:47 /data/tests/controller/common_helper_route.php:142
13-Sep-2018 14:53:47 /data/tests/controller/common_helper_route.php:46
13-Sep-2018 14:53:47
13-Sep-2018 14:53:47 631) phpbb_controller_helper_route_unclean_path_test::test_helper_url_relative_path with data set #6 ('controller3', array(3, 1, 2), true, 'custom-sid', 'app.php/foo/bar/p-3?t=1&f...om-sid', 'params-argument (array) using...ion_id')
13-Sep-2018 14:53:47 Missing argument 6 for phpbb\routing\router::__construct(), called in /data/tests/controller/common_helper_route.php on line 142 and defined
13-Sep-2018 14:53:47
13-Sep-2018 14:53:47 /data/phpBB/phpbb/routing/router.php:98
13-Sep-2018 14:53:47 /data/tests/controller/common_helper_route.php:142
13-Sep-2018 14:53:47 /data/tests/controller/common_helper_route.php:46
13-Sep-2018 14:53:47
13-Sep-2018 14:53:47 632) phpbb_controller_helper_route_unclean_path_test::test_helper_url_relative_path with data set #7 ('controller2', array(1, 2, 'anchor'), true, false, 'app.php/foo/bar?t=1&f=2#anchor', 'anchor in params-argument (array)')
13-Sep-2018 14:53:47 Missing argument 6 for phpbb\routing\router::__construct(), called in /data/tests/controller/common_helper_route.php on line 142 and defined
13-Sep-2018 14:53:47
13-Sep-2018 14:53:47 /data/phpBB/phpbb/routing/router.php:98
13-Sep-2018 14:53:47 /data/tests/controller/common_helper_route.php:142
13-Sep-2018 14:53:47 /data/tests/controller/common_helper_route.php:46
13-Sep-2018 14:53:47
13-Sep-2018 14:53:47 633) phpbb_controller_helper_route_unclean_path_test::test_helper_url_relative_path with data set #8 ('controller2', array(1, 2, 'anchor'), false, false, 'app.php/foo/bar?t=1&f=2#anchor', 'anchor in params-argument (array)')
13-Sep-2018 14:53:47 Missing argument 6 for phpbb\routing\router::__construct(), called in /data/tests/controller/common_helper_route.php on line 142 and defined
13-Sep-2018 14:53:47
13-Sep-2018 14:53:47 /data/phpBB/phpbb/routing/router.php:98
13-Sep-2018 14:53:47 /data/tests/controller/common_helper_route.php:142
13-Sep-2018 14:53:47 /data/tests/controller/common_helper_route.php:46
13-Sep-2018 14:53:47
13-Sep-2018 14:53:47 634) phpbb_controller_helper_route_unclean_path_test::test_helper_url_relative_path with data set #9 ('controller3', array(3, 1, 2, 'anchor'), true, false, 'app.php/foo/bar/p-3?t=1&f=2#anchor', 'anchor in params-argument (array)')
13-Sep-2018 14:53:47 Missing argument 6 for phpbb\routing\router::__construct(), called in /data/tests/controller/common_helper_route.php on line 142 and defined
13-Sep-2018 14:53:47
13-Sep-2018 14:53:47 /data/phpBB/phpbb/routing/router.php:98
13-Sep-2018 14:53:47 /data/tests/controller/common_helper_route.php:142
13-Sep-2018 14:53:47 /data/tests/controller/common_helper_route.php:46
13-Sep-2018 14:53:47
13-Sep-2018 14:53:47 635) phpbb_controller_helper_route_unclean_path_test::test_helper_url_relative_path with data set #10 ('controller2', array(1, 2, 'anchor'), true, 'custom-sid', 'app.php/foo/bar?t=1&f=2&a...anchor', 'anchor in params-argument (ar...ion_id')
13-Sep-2018 14:53:47 Missing argument 6 for phpbb\routing\router::__construct(), called in /data/tests/controller/common_helper_route.php on line 142 and defined
13-Sep-2018 14:53:47
13-Sep-2018 14:53:47 /data/phpBB/phpbb/routing/router.php:98
13-Sep-2018 14:53:47 /data/tests/controller/common_helper_route.php:142
13-Sep-2018 14:53:47 /data/tests/controller/common_helper_route.php:46
13-Sep-2018 14:53:47
13-Sep-2018 14:53:47 636) phpbb_controller_helper_route_unclean_path_test::test_helper_url_relative_path with data set #11 ('controller2', array(1, 2, 'anchor'), false, 'custom-sid', 'app.php/foo/bar?t=1&f=2&sid=c...anchor', 'anchor in params-argument (ar...ion_id')
13-Sep-2018 14:53:47 Missing argument 6 for phpbb\routing\router::__construct(), called in /data/tests/controller/common_helper_route.php on line 142 and defined
13-Sep-2018 14:53:47
13-Sep-2018 14:53:47 /data/phpBB/phpbb/routing/router.php:98
13-Sep-2018 14:53:47 /data/tests/controller/common_helper_route.php:142
13-Sep-2018 14:53:47 /data/tests/controller/common_helper_route.php:46
13-Sep-2018 14:53:47
13-Sep-2018 14:53:47 637) phpbb_controller_helper_route_unclean_path_test::test_helper_url_relative_path with data set #12 ('controller3', array(3, 1, 2, 'anchor'), true, 'custom-sid', 'app.php/foo/bar/p-3?t=1&f...anchor', 'anchor in params-argument (ar...ion_id')
13-Sep-2018 14:53:47 Missing argument 6 for phpbb\routing\router::__construct(), called in /data/tests/controller/common_helper_route.php on line 142 and defined
13-Sep-2018 14:53:47
13-Sep-2018 14:53:47 /data/phpBB/phpbb/routing/router.php:98
13-Sep-2018 14:53:47 /data/tests/controller/common_helper_route.php:142
13-Sep-2018 14:53:47 /data/tests/controller/common_helper_route.php:46
13-Sep-2018 14:53:47
13-Sep-2018 14:53:47 638) phpbb_controller_helper_route_unclean_path_test::test_helper_url_relative_path with data set #13 ('controller2', array(), true, false, 'app.php/foo/bar', 'no params using empty array')
13-Sep-2018 14:53:47 Missing argument 6 for phpbb\routing\router::__construct(), called in /data/tests/controller/common_helper_route.php on line 142 and defined
13-Sep-2018 14:53:47
13-Sep-2018 14:53:47 /data/phpBB/phpbb/routing/router.php:98
13-Sep-2018 14:53:47 /data/tests/controller/common_helper_route.php:142
13-Sep-2018 14:53:47 /data/tests/controller/common_helper_route.php:46
13-Sep-2018 14:53:47
13-Sep-2018 14:53:47 639) phpbb_controller_helper_route_unclean_path_test::test_helper_url_relative_path with data set #14 ('controller2', array(), false, false, 'app.php/foo/bar', 'no params using empty array')
13-Sep-2018 14:53:47 Missing argument 6 for phpbb\routing\router::__construct(), called in /data/tests/controller/common_helper_route.php on line 142 and defined
13-Sep-2018 14:53:47
13-Sep-2018 14:53:47 /data/phpBB/phpbb/routing/router.php:98
13-Sep-2018 14:53:47 /data/tests/controller/common_helper_route.php:142
13-Sep-2018 14:53:47 /data/tests/controller/common_helper_route.php:46
13-Sep-2018 14:53:47
13-Sep-2018 14:53:47 640) phpbb_controller_helper_route_unclean_path_test::test_helper_url_relative_path with data set #15 ('controller3', array(3), true, false, 'app.php/foo/bar/p-3', 'no params using empty array')
13-Sep-2018 14:53:47 Missing argument 6 for phpbb\routing\router::__construct(), called in /data/tests/controller/common_helper_route.php on line 142 and defined
13-Sep-2018 14:53:47
13-Sep-2018 14:53:47 /data/phpBB/phpbb/routing/router.php:98
13-Sep-2018 14:53:47 /data/tests/controller/common_helper_route.php:142
13-Sep-2018 14:53:47 /data/tests/controller/common_helper_route.php:46
13-Sep-2018 14:53:47
13-Sep-2018 14:53:47 641) phpbb_controller_helper_route_unclean_path_test::test_helper_url_relative_path with data set #16 ('controller4', array(), true, false, 'app.php/foo/test', 'di parameter')
13-Sep-2018 14:53:47 Missing argument 6 for phpbb\routing\router::__construct(), called in /data/tests/controller/common_helper_route.php on line 142 and defined
13-Sep-2018 14:53:47
13-Sep-2018 14:53:47 /data/phpBB/phpbb/routing/router.php:98
13-Sep-2018 14:53:47 /data/tests/controller/common_helper_route.php:142
13-Sep-2018 14:53:47 /data/tests/controller/common_helper_route.php:46
13-Sep-2018 14:53:47
13-Sep-2018 14:53:47 642) phpbb_controller_helper_route_unclean_path_test::test_helper_url_network with data set #0 ('controller2', array(1, 2), true, false, '//localhost/app.php/foo/bar?t...mp;f=2', 'parameters in params-argument as array')
13-Sep-2018 14:53:47 Missing argument 6 for phpbb\routing\router::__construct(), called in /data/tests/controller/common_helper_route.php on line 142 and defined
13-Sep-2018 14:53:47
13-Sep-2018 14:53:47 /data/phpBB/phpbb/routing/router.php:98
13-Sep-2018 14:53:47 /data/tests/controller/common_helper_route.php:142
13-Sep-2018 14:53:47 /data/tests/controller/common_helper_route.php:46
13-Sep-2018 14:53:47
13-Sep-2018 14:53:47 643) phpbb_controller_helper_route_unclean_path_test::test_helper_url_network with data set #1 ('controller2', array(1, 2), false, false, '//localhost/app.php/foo/bar?t=1&f=2', 'parameters in params-argument as array')
13-Sep-2018 14:53:47 Missing argument 6 for phpbb\routing\router::__construct(), called in /data/tests/controller/common_helper_route.php on line 142 and defined
13-Sep-2018 14:53:47
13-Sep-2018 14:53:47 /data/phpBB/phpbb/routing/router.php:98
13-Sep-2018 14:53:47 /data/tests/controller/common_helper_route.php:142
13-Sep-2018 14:53:47 /data/tests/controller/common_helper_route.php:46
13-Sep-2018 14:53:47
13-Sep-2018 14:53:47 644) phpbb_controller_helper_route_unclean_path_test::test_helper_url_network with data set #2 ('controller3', array(3, 1, 2), true, false, '//localhost/app.php/foo/bar/p...mp;f=2', 'parameters in params-argument as array')
13-Sep-2018 14:53:47 Missing argument 6 for phpbb\routing\router::__construct(), called in /data/tests/controller/common_helper_route.php on line 142 and defined
13-Sep-2018 14:53:47
13-Sep-2018 14:53:47 /data/phpBB/phpbb/routing/router.php:98
13-Sep-2018 14:53:47 /data/tests/controller/common_helper_route.php:142
13-Sep-2018 14:53:47 /data/tests/controller/common_helper_route.php:46
13-Sep-2018 14:53:47
13-Sep-2018 14:53:47 645) phpbb_controller_helper_route_unclean_path_test::test_helper_url_network with data set #3 ('controller3', array(3, 1, 2), false, false, '//localhost/app.php/foo/bar/p...=1&f=2', 'parameters in params-argument as array')
13-Sep-2018 14:53:47 Missing argument 6 for phpbb\routing\router::__construct(), called in /data/tests/controller/common_helper_route.php on line 142 and defined
13-Sep-2018 14:53:47
13-Sep-2018 14:53:47 /data/phpBB/phpbb/routing/router.php:98
13-Sep-2018 14:53:47 /data/tests/controller/common_helper_route.php:142
13-Sep-2018 14:53:47 /data/tests/controller/common_helper_route.php:46
13-Sep-2018 14:53:47
13-Sep-2018 14:53:47 646) phpbb_controller_helper_route_unclean_path_test::test_helper_url_network with data set #4 ('controller2', array(1, 2), true, 'custom-sid', '//localhost/app.php/foo/bar?t...om-sid', 'params-argument (array) using...ion_id')
13-Sep-2018 14:53:47 Missing argument 6 for phpbb\routing\router::__construct(), called in /data/tests/controller/common_helper_route.php on line 142 and defined
13-Sep-2018 14:53:47
13-Sep-2018 14:53:47 /data/phpBB/phpbb/routing/router.php:98
13-Sep-2018 14:53:47 /data/tests/controller/common_helper_route.php:142
13-Sep-2018 14:53:47 /data/tests/controller/common_helper_route.php:46
13-Sep-2018 14:53:47
13-Sep-2018 14:53:47 647) phpbb_controller_helper_route_unclean_path_test::test_helper_url_network with data set #5 ('controller2', array(1, 2), false, 'custom-sid', '//localhost/app.php/foo/bar?t...om-sid', 'params-argument (array) using...ion_id')
13-Sep-2018 14:53:47 Missing argument 6 for phpbb\routing\router::__construct(), called in /data/tests/controller/common_helper_route.php on line 142 and defined
13-Sep-2018 14:53:47
13-Sep-2018 14:53:47 /data/phpBB/phpbb/routing/router.php:98
13-Sep-2018 14:53:47 /data/tests/controller/common_helper_route.php:142
13-Sep-2018 14:53:47 /data/tests/controller/common_helper_route.php:46
13-Sep-2018 14:53:47
13-Sep-2018 14:53:47 648) phpbb_controller_helper_route_unclean_path_test::test_helper_url_network with data set #6 ('controller3', array(3, 1, 2), true, 'custom-sid', '//localhost/app.php/foo/bar/p...om-sid', 'params-argument (array) using...ion_id')
13-Sep-2018 14:53:47 Missing argument 6 for phpbb\routing\router::__construct(), called in /data/tests/controller/common_helper_route.php on line 142 and defined
13-Sep-2018 14:53:47
13-Sep-2018 14:53:47 /data/phpBB/phpbb/routing/router.php:98
13-Sep-2018 14:53:47 /data/tests/controller/common_helper_route.php:142
13-Sep-2018 14:53:47 /data/tests/controller/common_helper_route.php:46
13-Sep-2018 14:53:47
13-Sep-2018 14:53:47 649) phpbb_controller_helper_route_unclean_path_test::test_helper_url_network with data set #7 ('controller2', array(1, 2, 'anchor'), true, false, '//localhost/app.php/foo/bar?t...anchor', 'anchor in params-argument (array)')
13-Sep-2018 14:53:47 Missing argument 6 for phpbb\routing\router::__construct(), called in /data/tests/controller/common_helper_route.php on line 142 and defined
13-Sep-2018 14:53:47
13-Sep-2018 14:53:47 /data/phpBB/phpbb/routing/router.php:98
13-Sep-2018 14:53:47 /data/tests/controller/common_helper_route.php:142
13-Sep-2018 14:53:47 /data/tests/controller/common_helper_route.php:46
13-Sep-2018 14:53:47
13-Sep-2018 14:53:47 650) phpbb_controller_helper_route_unclean_path_test::test_helper_url_network with data set #8 ('controller2', array(1, 2, 'anchor'), false, false, '//localhost/app.php/foo/bar?t...anchor', 'anchor in params-argument (array)')
13-Sep-2018 14:53:47 Missing argument 6 for phpbb\routing\router::__construct(), called in /data/tests/controller/common_helper_route.php on line 142 and defined
13-Sep-2018 14:53:47
13-Sep-2018 14:53:47 /data/phpBB/phpbb/routing/router.php:98
13-Sep-2018 14:53:47 /data/tests/controller/common_helper_route.php:142
13-Sep-2018 14:53:47 /data/tests/controller/common_helper_route.php:46
13-Sep-2018 14:53:47
13-Sep-2018 14:53:47 651) phpbb_controller_helper_route_unclean_path_test::test_helper_url_network with data set #9 ('controller3', array(3, 1, 2, 'anchor'), true, false, '//localhost/app.php/foo/bar/p...anchor', 'anchor in params-argument (array)')
13-Sep-2018 14:53:47 Missing argument 6 for phpbb\routing\router::__construct(), called in /data/tests/controller/common_helper_route.php on line 142 and defined
13-Sep-2018 14:53:47
13-Sep-2018 14:53:47 /data/phpBB/phpbb/routing/router.php:98
13-Sep-2018 14:53:47 /data/tests/controller/common_helper_route.php:142
13-Sep-2018 14:53:47 /data/tests/controller/common_helper_route.php:46
13-Sep-2018 14:53:47
13-Sep-2018 14:53:47 652) phpbb_controller_helper_route_unclean_path_test::test_helper_url_network with data set #10 ('controller2', array(1, 2, 'anchor'), true, 'custom-sid', '//localhost/app.php/foo/bar?t...anchor', 'anchor in params-argument (ar...ion_id')
13-Sep-2018 14:53:47 Missing argument 6 for phpbb\routing\router::__construct(), called in /data/tests/controller/common_helper_route.php on line 142 and defined
13-Sep-2018 14:53:47
13-Sep-2018 14:53:47 /data/phpBB/phpbb/routing/router.php:98
13-Sep-2018 14:53:47 /data/tests/controller/common_helper_route.php:142
13-Sep-2018 14:53:47 /data/tests/controller/common_helper_route.php:46
13-Sep-2018 14:53:47
13-Sep-2018 14:53:47 653) phpbb_controller_helper_route_unclean_path_test::test_helper_url_network with data set #11 ('controller2', array(1, 2, 'anchor'), false, 'custom-sid', '//localhost/app.php/foo/bar?t...anchor', 'anchor in params-argument (ar...ion_id')
13-Sep-2018 14:53:47 Missing argument 6 for phpbb\routing\router::__construct(), called in /data/tests/controller/common_helper_route.php on line 142 and defined
13-Sep-2018 14:53:47
13-Sep-2018 14:53:47 /data/phpBB/phpbb/routing/router.php:98
13-Sep-2018 14:53:47 /data/tests/controller/common_helper_route.php:142
13-Sep-2018 14:53:47 /data/tests/controller/common_helper_route.php:46
13-Sep-2018 14:53:47
13-Sep-2018 14:53:47 654) phpbb_controller_helper_route_unclean_path_test::test_helper_url_network with data set #12 ('controller3', array(3, 1, 2, 'anchor'), true, 'custom-sid', '//localhost/app.php/foo/bar/p...anchor', 'anchor in params-argument (ar...ion_id')
13-Sep-2018 14:53:47 Missing argument 6 for phpbb\routing\router::__construct(), called in /data/tests/controller/common_helper_route.php on line 142 and defined
13-Sep-2018 14:53:47
13-Sep-2018 14:53:47 /data/phpBB/phpbb/routing/router.php:98
13-Sep-2018 14:53:47 /data/tests/controller/common_helper_route.php:142
13-Sep-2018 14:53:47 /data/tests/controller/common_helper_route.php:46
13-Sep-2018 14:53:47
13-Sep-2018 14:53:47 655) phpbb_controller_helper_route_unclean_path_test::test_helper_url_network with data set #13 ('controller2', array(), true, false, '//localhost/app.php/foo/bar', 'no params using empty array')
13-Sep-2018 14:53:47 Missing argument 6 for phpbb\routing\router::__construct(), called in /data/tests/controller/common_helper_route.php on line 142 and defined
13-Sep-2018 14:53:47
13-Sep-2018 14:53:47 /data/phpBB/phpbb/routing/router.php:98
13-Sep-2018 14:53:47 /data/tests/controller/common_helper_route.php:142
13-Sep-2018 14:53:47 /data/tests/controller/common_helper_route.php:46
13-Sep-2018 14:53:47
13-Sep-2018 14:53:47 656) phpbb_controller_helper_route_unclean_path_test::test_helper_url_network with data set #14 ('controller2', array(), false, false, '//localhost/app.php/foo/bar', 'no params using empty array')
13-Sep-2018 14:53:47 Missing argument 6 for phpbb\routing\router::__construct(), called in /data/tests/controller/common_helper_route.php on line 142 and defined
13-Sep-2018 14:53:47
13-Sep-2018 14:53:47 /data/phpBB/phpbb/routing/router.php:98
13-Sep-2018 14:53:47 /data/tests/controller/common_helper_route.php:142
13-Sep-2018 14:53:47 /data/tests/controller/common_helper_route.php:46
13-Sep-2018 14:53:47
13-Sep-2018 14:53:47 657) phpbb_controller_helper_route_unclean_path_test::test_helper_url_network with data set #15 ('controller3', array(3), true, false, '//localhost/app.php/foo/bar/p-3', 'no params using empty array')
13-Sep-2018 14:53:47 Missing argument 6 for phpbb\routing\router::__construct(), called in /data/tests/controller/common_helper_route.php on line 142 and defined
13-Sep-2018 14:53:47
13-Sep-2018 14:53:47 /data/phpBB/phpbb/routing/router.php:98
13-Sep-2018 14:53:47 /data/tests/controller/common_helper_route.php:142
13-Sep-2018 14:53:47 /data/tests/controller/common_helper_route.php:46
13-Sep-2018 14:53:47
13-Sep-2018 14:53:47 658) phpbb_controller_helper_route_unclean_path_test::test_helper_url_network with data set #16 ('controller4', array(), true, false, '//localhost/app.php/foo/test', 'di parameter')
13-Sep-2018 14:53:47 Missing argument 6 for phpbb\routing\router::__construct(), called in /data/tests/controller/common_helper_route.php on line 142 and defined
13-Sep-2018 14:53:47
13-Sep-2018 14:53:47 /data/phpBB/phpbb/routing/router.php:98
13-Sep-2018 14:53:47 /data/tests/controller/common_helper_route.php:142
13-Sep-2018 14:53:47 /data/tests/controller/common_helper_route.php:46
13-Sep-2018 14:53:47
13-Sep-2018 14:53:47 659) phpbb_controller_helper_route_unclean_path_test::test_helper_url_absolute_with_rewrite with data set #0 ('controller2', array(1, 2), true, false, 'http://localhost/foo/bar?t=1&f=2', 'parameters in params-argument as array')
13-Sep-2018 14:53:47 Missing argument 6 for phpbb\routing\router::__construct(), called in /data/tests/controller/common_helper_route.php on line 142 and defined
13-Sep-2018 14:53:47
13-Sep-2018 14:53:47 /data/phpBB/phpbb/routing/router.php:98
13-Sep-2018 14:53:47 /data/tests/controller/common_helper_route.php:142
13-Sep-2018 14:53:47 /data/tests/controller/common_helper_route.php:46
13-Sep-2018 14:53:47
13-Sep-2018 14:53:47 660) phpbb_controller_helper_route_unclean_path_test::test_helper_url_absolute_with_rewrite with data set #1 ('controller2', array(1, 2), false, false, 'http://localhost/foo/bar?t=1&f=2', 'parameters in params-argument as array')
13-Sep-2018 14:53:47 Missing argument 6 for phpbb\routing\router::__construct(), called in /data/tests/controller/common_helper_route.php on line 142 and defined
13-Sep-2018 14:53:47
13-Sep-2018 14:53:47 /data/phpBB/phpbb/routing/router.php:98
13-Sep-2018 14:53:47 /data/tests/controller/common_helper_route.php:142
13-Sep-2018 14:53:47 /data/tests/controller/common_helper_route.php:46
13-Sep-2018 14:53:47
13-Sep-2018 14:53:47 661) phpbb_controller_helper_route_unclean_path_test::test_helper_url_absolute_with_rewrite with data set #2 ('controller3', array(3, 1, 2), true, false, 'http://localhost/foo/bar/p-3?...mp;f=2', 'parameters in params-argument as array')
13-Sep-2018 14:53:47 Missing argument 6 for phpbb\routing\router::__construct(), called in /data/tests/controller/common_helper_route.php on line 142 and defined
13-Sep-2018 14:53:47
13-Sep-2018 14:53:47 /data/phpBB/phpbb/routing/router.php:98
13-Sep-2018 14:53:47 /data/tests/controller/common_helper_route.php:142
13-Sep-2018 14:53:47 /data/tests/controller/common_helper_route.php:46
13-Sep-2018 14:53:47
13-Sep-2018 14:53:47 662) phpbb_controller_helper_route_unclean_path_test::test_helper_url_absolute_with_rewrite with data set #3 ('controller3', array(3, 1, 2), false, false, 'http://localhost/foo/bar/p-3?t=1&f=2', 'parameters in params-argument as array')
13-Sep-2018 14:53:47 Missing argument 6 for phpbb\routing\router::__construct(), called in /data/tests/controller/common_helper_route.php on line 142 and defined
13-Sep-2018 14:53:47
13-Sep-2018 14:53:47 /data/phpBB/phpbb/routing/router.php:98
13-Sep-2018 14:53:47 /data/tests/controller/common_helper_route.php:142
13-Sep-2018 14:53:47 /data/tests/controller/common_helper_route.php:46
13-Sep-2018 14:53:47
13-Sep-2018 14:53:47 663) phpbb_controller_helper_route_unclean_path_test::test_helper_url_absolute_with_rewrite with data set #4 ('controller2', array(1, 2), true, 'custom-sid', 'http://localhost/foo/bar?t=1&...om-sid', 'params-argument (array) using...ion_id')
13-Sep-2018 14:53:47 Missing argument 6 for phpbb\routing\router::__construct(), called in /data/tests/controller/common_helper_route.php on line 142 and defined
13-Sep-2018 14:53:47
13-Sep-2018 14:53:47 /data/phpBB/phpbb/routing/router.php:98
13-Sep-2018 14:53:47 /data/tests/controller/common_helper_route.php:142
13-Sep-2018 14:53:47 /data/tests/controller/common_helper_route.php:46
13-Sep-2018 14:53:47
13-Sep-2018 14:53:47 664) phpbb_controller_helper_route_unclean_path_test::test_helper_url_absolute_with_rewrite with data set #5 ('controller2', array(1, 2), false, 'custom-sid', 'http://localhost/foo/bar?t=1&...om-sid', 'params-argument (array) using...ion_id')
13-Sep-2018 14:53:47 Missing argument 6 for phpbb\routing\router::__construct(), called in /data/tests/controller/common_helper_route.php on line 142 and defined
13-Sep-2018 14:53:47
13-Sep-2018 14:53:47 /data/phpBB/phpbb/routing/router.php:98
13-Sep-2018 14:53:47 /data/tests/controller/common_helper_route.php:142
13-Sep-2018 14:53:47 /data/tests/controller/common_helper_route.php:46
13-Sep-2018 14:53:47
13-Sep-2018 14:53:47 665) phpbb_controller_helper_route_unclean_path_test::test_helper_url_absolute_with_rewrite with data set #6 ('controller3', array(3, 1, 2), true, 'custom-sid', 'http://localhost/foo/bar/p-3?...om-sid', 'params-argument (array) using...ion_id')
13-Sep-2018 14:53:47 Missing argument 6 for phpbb\routing\router::__construct(), called in /data/tests/controller/common_helper_route.php on line 142 and defined
13-Sep-2018 14:53:47
13-Sep-2018 14:53:47 /data/phpBB/phpbb/routing/router.php:98
13-Sep-2018 14:53:47 /data/tests/controller/common_helper_route.php:142
13-Sep-2018 14:53:47 /data/tests/controller/common_helper_route.php:46
13-Sep-2018 14:53:47
13-Sep-2018 14:53:47 666) phpbb_controller_helper_route_unclean_path_test::test_helper_url_absolute_with_rewrite with data set #7 ('controller2', array(1, 2, 'anchor'), true, false, 'http://localhost/foo/bar?t=1&...anchor', 'anchor in params-argument (array)')
13-Sep-2018 14:53:47 Missing argument 6 for phpbb\routing\router::__construct(), called in /data/tests/controller/common_helper_route.php on line 142 and defined
13-Sep-2018 14:53:47
13-Sep-2018 14:53:47 /data/phpBB/phpbb/routing/router.php:98
13-Sep-2018 14:53:47 /data/tests/controller/common_helper_route.php:142
13-Sep-2018 14:53:47 /data/tests/controller/common_helper_route.php:46
13-Sep-2018 14:53:47
13-Sep-2018 14:53:47 667) phpbb_controller_helper_route_unclean_path_test::test_helper_url_absolute_with_rewrite with data set #8 ('controller2', array(1, 2, 'anchor'), false, false, 'http://localhost/foo/bar?t=1&...anchor', 'anchor in params-argument (array)')
13-Sep-2018 14:53:47 Missing argument 6 for phpbb\routing\router::__construct(), called in /data/tests/controller/common_helper_route.php on line 142 and defined
13-Sep-2018 14:53:47
13-Sep-2018 14:53:47 /data/phpBB/phpbb/routing/router.php:98
13-Sep-2018 14:53:47 /data/tests/controller/common_helper_route.php:142
13-Sep-2018 14:53:47 /data/tests/controller/common_helper_route.php:46
13-Sep-2018 14:53:47
13-Sep-2018 14:53:47 668) phpbb_controller_helper_route_unclean_path_test::test_helper_url_absolute_with_rewrite with data set #9 ('controller3', array(3, 1, 2, 'anchor'), true, false, 'http://localhost/foo/bar/p-3?...anchor', 'anchor in params-argument (array)')
13-Sep-2018 14:53:47 Missing argument 6 for phpbb\routing\router::__construct(), called in /data/tests/controller/common_helper_route.php on line 142 and defined
13-Sep-2018 14:53:47
13-Sep-2018 14:53:47 /data/phpBB/phpbb/routing/router.php:98
13-Sep-2018 14:53:47 /data/tests/controller/common_helper_route.php:142
13-Sep-2018 14:53:47 /data/tests/controller/common_helper_route.php:46
13-Sep-2018 14:53:47
13-Sep-2018 14:53:47 669) phpbb_controller_helper_route_unclean_path_test::test_helper_url_absolute_with_rewrite with data set #10 ('controller2', array(1, 2, 'anchor'), true, 'custom-sid', 'http://localhost/foo/bar?t=1&...anchor', 'anchor in params-argument (ar...ion_id')
13-Sep-2018 14:53:47 Missing argument 6 for phpbb\routing\router::__construct(), called in /data/tests/controller/common_helper_route.php on line 142 and defined
13-Sep-2018 14:53:47
13-Sep-2018 14:53:47 /data/phpBB/phpbb/routing/router.php:98
13-Sep-2018 14:53:47 /data/tests/controller/common_helper_route.php:142
13-Sep-2018 14:53:47 /data/tests/controller/common_helper_route.php:46
13-Sep-2018 14:53:47
13-Sep-2018 14:53:47 670) phpbb_controller_helper_route_unclean_path_test::test_helper_url_absolute_with_rewrite with data set #11 ('controller2', array(1, 2, 'anchor'), false, 'custom-sid', 'http://localhost/foo/bar?t=1&...anchor', 'anchor in params-argument (ar...ion_id')
13-Sep-2018 14:53:47 Missing argument 6 for phpbb\routing\router::__construct(), called in /data/tests/controller/common_helper_route.php on line 142 and defined
13-Sep-2018 14:53:47
13-Sep-2018 14:53:47 /data/phpBB/phpbb/routing/router.php:98
13-Sep-2018 14:53:47 /data/tests/controller/common_helper_route.php:142
13-Sep-2018 14:53:47 /data/tests/controller/common_helper_route.php:46
13-Sep-2018 14:53:47
13-Sep-2018 14:53:47 671) phpbb_controller_helper_route_unclean_path_test::test_helper_url_absolute_with_rewrite with data set #12 ('controller3', array(3, 1, 2, 'anchor'), true, 'custom-sid', 'http://localhost/foo/bar/p-3?...anchor', 'anchor in params-argument (ar...ion_id')
13-Sep-2018 14:53:47 Missing argument 6 for phpbb\routing\router::__construct(), called in /data/tests/controller/common_helper_route.php on line 142 and defined
13-Sep-2018 14:53:47
13-Sep-2018 14:53:47 /data/phpBB/phpbb/routing/router.php:98
13-Sep-2018 14:53:47 /data/tests/controller/common_helper_route.php:142
13-Sep-2018 14:53:47 /data/tests/controller/common_helper_route.php:46
13-Sep-2018 14:53:47
13-Sep-2018 14:53:47 672) phpbb_controller_helper_route_unclean_path_test::test_helper_url_absolute_with_rewrite with data set #13 ('controller2', array(), true, false, 'http://localhost/foo/bar', 'no params using empty array')
13-Sep-2018 14:53:47 Missing argument 6 for phpbb\routing\router::__construct(), called in /data/tests/controller/common_helper_route.php on line 142 and defined
13-Sep-2018 14:53:47
13-Sep-2018 14:53:47 /data/phpBB/phpbb/routing/router.php:98
13-Sep-2018 14:53:47 /data/tests/controller/common_helper_route.php:142
13-Sep-2018 14:53:47 /data/tests/controller/common_helper_route.php:46
13-Sep-2018 14:53:47
13-Sep-2018 14:53:47 673) phpbb_controller_helper_route_unclean_path_test::test_helper_url_absolute_with_rewrite with data set #14 ('controller2', array(), false, false, 'http://localhost/foo/bar', 'no params using empty array')
13-Sep-2018 14:53:47 Missing argument 6 for phpbb\routing\router::__construct(), called in /data/tests/controller/common_helper_route.php on line 142 and defined
13-Sep-2018 14:53:47
13-Sep-2018 14:53:47 /data/phpBB/phpbb/routing/router.php:98
13-Sep-2018 14:53:47 /data/tests/controller/common_helper_route.php:142
13-Sep-2018 14:53:47 /data/tests/controller/common_helper_route.php:46
13-Sep-2018 14:53:47
13-Sep-2018 14:53:47 674) phpbb_controller_helper_route_unclean_path_test::test_helper_url_absolute_with_rewrite with data set #15 ('controller3', array(3), true, false, 'http://localhost/foo/bar/p-3', 'no params using empty array')
13-Sep-2018 14:53:47 Missing argument 6 for phpbb\routing\router::__construct(), called in /data/tests/controller/common_helper_route.php on line 142 and defined
13-Sep-2018 14:53:47
13-Sep-2018 14:53:47 /data/phpBB/phpbb/routing/router.php:98
13-Sep-2018 14:53:47 /data/tests/controller/common_helper_route.php:142
13-Sep-2018 14:53:47 /data/tests/controller/common_helper_route.php:46
13-Sep-2018 14:53:47
13-Sep-2018 14:53:47 675) phpbb_controller_helper_route_unclean_path_test::test_helper_url_absolute_with_rewrite with data set #16 ('controller4', array(), true, false, 'http://localhost/foo/test', 'di parameter')
13-Sep-2018 14:53:47 Missing argument 6 for phpbb\routing\router::__construct(), called in /data/tests/controller/common_helper_route.php on line 142 and defined
13-Sep-2018 14:53:47
13-Sep-2018 14:53:47 /data/phpBB/phpbb/routing/router.php:98
13-Sep-2018 14:53:47 /data/tests/controller/common_helper_route.php:142
13-Sep-2018 14:53:47 /data/tests/controller/common_helper_route.php:46
13-Sep-2018 14:53:47
13-Sep-2018 14:53:47 676) phpbb_controller_helper_route_unclean_path_test::test_helper_url_relative_path_with_rewrite with data set #0 ('controller2', array(1, 2), true, false, 'foo/bar?t=1&f=2', 'parameters in params-argument as array')
13-Sep-2018 14:53:47 Missing argument 6 for phpbb\routing\router::__construct(), called in /data/tests/controller/common_helper_route.php on line 142 and defined
13-Sep-2018 14:53:47
13-Sep-2018 14:53:47 /data/phpBB/phpbb/routing/router.php:98
13-Sep-2018 14:53:47 /data/tests/controller/common_helper_route.php:142
13-Sep-2018 14:53:47 /data/tests/controller/common_helper_route.php:46
13-Sep-2018 14:53:47
13-Sep-2018 14:53:47 677) phpbb_controller_helper_route_unclean_path_test::test_helper_url_relative_path_with_rewrite with data set #1 ('controller2', array(1, 2), false, false, 'foo/bar?t=1&f=2', 'parameters in params-argument as array')
13-Sep-2018 14:53:47 Missing argument 6 for phpbb\routing\router::__construct(), called in /data/tests/controller/common_helper_route.php on line 142 and defined
13-Sep-2018 14:53:47
13-Sep-2018 14:53:47 /data/phpBB/phpbb/routing/router.php:98
13-Sep-2018 14:53:47 /data/tests/controller/common_helper_route.php:142
13-Sep-2018 14:53:47 /data/tests/controller/common_helper_route.php:46
13-Sep-2018 14:53:47
13-Sep-2018 14:53:47 678) phpbb_controller_helper_route_unclean_path_test::test_helper_url_relative_path_with_rewrite with data set #2 ('controller3', array(3, 1, 2), true, false, 'foo/bar/p-3?t=1&f=2', 'parameters in params-argument as array')
13-Sep-2018 14:53:47 Missing argument 6 for phpbb\routing\router::__construct(), called in /data/tests/controller/common_helper_route.php on line 142 and defined
13-Sep-2018 14:53:47
13-Sep-2018 14:53:47 /data/phpBB/phpbb/routing/router.php:98
13-Sep-2018 14:53:47 /data/tests/controller/common_helper_route.php:142
13-Sep-2018 14:53:47 /data/tests/controller/common_helper_route.php:46
13-Sep-2018 14:53:47
13-Sep-2018 14:53:47 679) phpbb_controller_helper_route_unclean_path_test::test_helper_url_relative_path_with_rewrite with data set #3 ('controller3', array(3, 1, 2), false, false, 'foo/bar/p-3?t=1&f=2', 'parameters in params-argument as array')
13-Sep-2018 14:53:47 Missing argument 6 for phpbb\routing\router::__construct(), called in /data/tests/controller/common_helper_route.php on line 142 and defined
13-Sep-2018 14:53:47
13-Sep-2018 14:53:47 /data/phpBB/phpbb/routing/router.php:98
13-Sep-2018 14:53:47 /data/tests/controller/common_helper_route.php:142
13-Sep-2018 14:53:47 /data/tests/controller/common_helper_route.php:46
13-Sep-2018 14:53:47
13-Sep-2018 14:53:47 680) phpbb_controller_helper_route_unclean_path_test::test_helper_url_relative_path_with_rewrite with data set #4 ('controller2', array(1, 2), true, 'custom-sid', 'foo/bar?t=1&f=2&sid=custom-sid', 'params-argument (array) using...ion_id')
13-Sep-2018 14:53:47 Missing argument 6 for phpbb\routing\router::__construct(), called in /data/tests/controller/common_helper_route.php on line 142 and defined
13-Sep-2018 14:53:47
13-Sep-2018 14:53:47 /data/phpBB/phpbb/routing/router.php:98
13-Sep-2018 14:53:47 /data/tests/controller/common_helper_route.php:142
13-Sep-2018 14:53:47 /data/tests/controller/common_helper_route.php:46
13-Sep-2018 14:53:47
13-Sep-2018 14:53:47 681) phpbb_controller_helper_route_unclean_path_test::test_helper_url_relative_path_with_rewrite with data set #5 ('controller2', array(1, 2), false, 'custom-sid', 'foo/bar?t=1&f=2&sid=custom-sid', 'params-argument (array) using...ion_id')
13-Sep-2018 14:53:47 Missing argument 6 for phpbb\routing\router::__construct(), called in /data/tests/controller/common_helper_route.php on line 142 and defined
13-Sep-2018 14:53:47
13-Sep-2018 14:53:47 /data/phpBB/phpbb/routing/router.php:98
13-Sep-2018 14:53:47 /data/tests/controller/common_helper_route.php:142
13-Sep-2018 14:53:47 /data/tests/controller/common_helper_route.php:46
13-Sep-2018 14:53:47
13-Sep-2018 14:53:47 682) phpbb_controller_helper_route_unclean_path_test::test_helper_url_relative_path_with_rewrite with data set #6 ('controller3', array(3, 1, 2), true, 'custom-sid', 'foo/bar/p-3?t=1&f=2&s...om-sid', 'params-argument (array) using...ion_id')
13-Sep-2018 14:53:47 Missing argument 6 for phpbb\routing\router::__construct(), called in /data/tests/controller/common_helper_route.php on line 142 and defined
13-Sep-2018 14:53:47
13-Sep-2018 14:53:47 /data/phpBB/phpbb/routing/router.php:98
13-Sep-2018 14:53:47 /data/tests/controller/common_helper_route.php:142
13-Sep-2018 14:53:47 /data/tests/controller/common_helper_route.php:46
13-Sep-2018 14:53:47
13-Sep-2018 14:53:47 683) phpbb_controller_helper_route_unclean_path_test::test_helper_url_relative_path_with_rewrite with data set #7 ('controller2', array(1, 2, 'anchor'), true, false, 'foo/bar?t=1&f=2#anchor', 'anchor in params-argument (array)')
13-Sep-2018 14:53:47 Missing argument 6 for phpbb\routing\router::__construct(), called in /data/tests/controller/common_helper_route.php on line 142 and defined
13-Sep-2018 14:53:47
13-Sep-2018 14:53:47 /data/phpBB/phpbb/routing/router.php:98
13-Sep-2018 14:53:47 /data/tests/controller/common_helper_route.php:142
13-Sep-2018 14:53:47 /data/tests/controller/common_helper_route.php:46
13-Sep-2018 14:53:47
13-Sep-2018 14:53:47 684) phpbb_controller_helper_route_unclean_path_test::test_helper_url_relative_path_with_rewrite with data set #8 ('controller2', array(1, 2, 'anchor'), false, false, 'foo/bar?t=1&f=2#anchor', 'anchor in params-argument (array)')
13-Sep-2018 14:53:47 Missing argument 6 for phpbb\routing\router::__construct(), called in /data/tests/controller/common_helper_route.php on line 142 and defined
13-Sep-2018 14:53:47
13-Sep-2018 14:53:47 /data/phpBB/phpbb/routing/router.php:98
13-Sep-2018 14:53:47 /data/tests/controller/common_helper_route.php:142
13-Sep-2018 14:53:47 /data/tests/controller/common_helper_route.php:46
13-Sep-2018 14:53:47
13-Sep-2018 14:53:47 685) phpbb_controller_helper_route_unclean_path_test::test_helper_url_relative_path_with_rewrite with data set #9 ('controller3', array(3, 1, 2, 'anchor'), true, false, 'foo/bar/p-3?t=1&f=2#anchor', 'anchor in params-argument (array)')
13-Sep-2018 14:53:47 Missing argument 6 for phpbb\routing\router::__construct(), called in /data/tests/controller/common_helper_route.php on line 142 and defined
13-Sep-2018 14:53:47
13-Sep-2018 14:53:47 /data/phpBB/phpbb/routing/router.php:98
13-Sep-2018 14:53:47 /data/tests/controller/common_helper_route.php:142
13-Sep-2018 14:53:47 /data/tests/controller/common_helper_route.php:46
13-Sep-2018 14:53:47
13-Sep-2018 14:53:47 686) phpbb_controller_helper_route_unclean_path_test::test_helper_url_relative_path_with_rewrite with data set #10 ('controller2', array(1, 2, 'anchor'), true, 'custom-sid', 'foo/bar?t=1&f=2&sid=c...anchor', 'anchor in params-argument (ar...ion_id')
13-Sep-2018 14:53:47 Missing argument 6 for phpbb\routing\router::__construct(), called in /data/tests/controller/common_helper_route.php on line 142 and defined
13-Sep-2018 14:53:47
13-Sep-2018 14:53:47 /data/phpBB/phpbb/routing/router.php:98
13-Sep-2018 14:53:47 /data/tests/controller/common_helper_route.php:142
13-Sep-2018 14:53:47 /data/tests/controller/common_helper_route.php:46
13-Sep-2018 14:53:47
13-Sep-2018 14:53:47 687) phpbb_controller_helper_route_unclean_path_test::test_helper_url_relative_path_with_rewrite with data set #11 ('controller2', array(1, 2, 'anchor'), false, 'custom-sid', 'foo/bar?t=1&f=2&sid=custom-sid#anchor', 'anchor in params-argument (ar...ion_id')
13-Sep-2018 14:53:47 Missing argument 6 for phpbb\routing\router::__construct(), called in /data/tests/controller/common_helper_route.php on line 142 and defined
13-Sep-2018 14:53:47
13-Sep-2018 14:53:47 /data/phpBB/phpbb/routing/router.php:98
13-Sep-2018 14:53:47 /data/tests/controller/common_helper_route.php:142
13-Sep-2018 14:53:47 /data/tests/controller/common_helper_route.php:46
13-Sep-2018 14:53:47
13-Sep-2018 14:53:47 688) phpbb_controller_helper_route_unclean_path_test::test_helper_url_relative_path_with_rewrite with data set #12 ('controller3', array(3, 1, 2, 'anchor'), true, 'custom-sid', 'foo/bar/p-3?t=1&f=2&s...anchor', 'anchor in params-argument (ar...ion_id')
13-Sep-2018 14:53:47 Missing argument 6 for phpbb\routing\router::__construct(), called in /data/tests/controller/common_helper_route.php on line 142 and defined
13-Sep-2018 14:53:47
13-Sep-2018 14:53:47 /data/phpBB/phpbb/routing/router.php:98
13-Sep-2018 14:53:47 /data/tests/controller/common_helper_route.php:142
13-Sep-2018 14:53:47 /data/tests/controller/common_helper_route.php:46
13-Sep-2018 14:53:47
13-Sep-2018 14:53:47 689) phpbb_controller_helper_route_unclean_path_test::test_helper_url_relative_path_with_rewrite with data set #13 ('controller2', array(), true, false, 'foo/bar', 'no params using empty array')
13-Sep-2018 14:53:47 Missing argument 6 for phpbb\routing\router::__construct(), called in /data/tests/controller/common_helper_route.php on line 142 and defined
13-Sep-2018 14:53:47
13-Sep-2018 14:53:47 /data/phpBB/phpbb/routing/router.php:98
13-Sep-2018 14:53:47 /data/tests/controller/common_helper_route.php:142
13-Sep-2018 14:53:47 /data/tests/controller/common_helper_route.php:46
13-Sep-2018 14:53:47
13-Sep-2018 14:53:47 690) phpbb_controller_helper_route_unclean_path_test::test_helper_url_relative_path_with_rewrite with data set #14 ('controller2', array(), false, false, 'foo/bar', 'no params using empty array')
13-Sep-2018 14:53:47 Missing argument 6 for phpbb\routing\router::__construct(), called in /data/tests/controller/common_helper_route.php on line 142 and defined
13-Sep-2018 14:53:47
13-Sep-2018 14:53:47 /data/phpBB/phpbb/routing/router.php:98
13-Sep-2018 14:53:47 /data/tests/controller/common_helper_route.php:142
13-Sep-2018 14:53:47 /data/tests/controller/common_helper_route.php:46
13-Sep-2018 14:53:47
13-Sep-2018 14:53:47 691) phpbb_controller_helper_route_unclean_path_test::test_helper_url_relative_path_with_rewrite with data set #15 ('controller3', array(3), true, false, 'foo/bar/p-3', 'no params using empty array')
13-Sep-2018 14:53:47 Missing argument 6 for phpbb\routing\router::__construct(), called in /data/tests/controller/common_helper_route.php on line 142 and defined
13-Sep-2018 14:53:47
13-Sep-2018 14:53:47 /data/phpBB/phpbb/routing/router.php:98
13-Sep-2018 14:53:47 /data/tests/controller/common_helper_route.php:142
13-Sep-2018 14:53:47 /data/tests/controller/common_helper_route.php:46
13-Sep-2018 14:53:47
13-Sep-2018 14:53:47 692) phpbb_controller_helper_route_unclean_path_test::test_helper_url_network_with_rewrite with data set #0 ('controller2', array(1, 2), true, false, '//localhost/foo/bar?t=1&f=2', 'parameters in params-argument as array')
13-Sep-2018 14:53:47 Missing argument 6 for phpbb\routing\router::__construct(), called in /data/tests/controller/common_helper_route.php on line 142 and defined
13-Sep-2018 14:53:47
13-Sep-2018 14:53:47 /data/phpBB/phpbb/routing/router.php:98
13-Sep-2018 14:53:47 /data/tests/controller/common_helper_route.php:142
13-Sep-2018 14:53:47 /data/tests/controller/common_helper_route.php:46
13-Sep-2018 14:53:47
13-Sep-2018 14:53:47 693) phpbb_controller_helper_route_unclean_path_test::test_helper_url_network_with_rewrite with data set #1 ('controller2', array(1, 2), false, false, '//localhost/foo/bar?t=1&f=2', 'parameters in params-argument as array')
13-Sep-2018 14:53:47 Missing argument 6 for phpbb\routing\router::__construct(), called in /data/tests/controller/common_helper_route.php on line 142 and defined
13-Sep-2018 14:53:47
13-Sep-2018 14:53:47 /data/phpBB/phpbb/routing/router.php:98
13-Sep-2018 14:53:47 /data/tests/controller/common_helper_route.php:142
13-Sep-2018 14:53:47 /data/tests/controller/common_helper_route.php:46
13-Sep-2018 14:53:47
13-Sep-2018 14:53:47 694) phpbb_controller_helper_route_unclean_path_test::test_helper_url_network_with_rewrite with data set #2 ('controller3', array(3, 1, 2), true, false, '//localhost/foo/bar/p-3?t=1&f=2', 'parameters in params-argument as array')
13-Sep-2018 14:53:47 Missing argument 6 for phpbb\routing\router::__construct(), called in /data/tests/controller/common_helper_route.php on line 142 and defined
13-Sep-2018 14:53:47
13-Sep-2018 14:53:47 /data/phpBB/phpbb/routing/router.php:98
13-Sep-2018 14:53:47 /data/tests/controller/common_helper_route.php:142
13-Sep-2018 14:53:47 /data/tests/controller/common_helper_route.php:46
13-Sep-2018 14:53:47
13-Sep-2018 14:53:47 695) phpbb_controller_helper_route_unclean_path_test::test_helper_url_network_with_rewrite with data set #3 ('controller3', array(3, 1, 2), false, false, '//localhost/foo/bar/p-3?t=1&f=2', 'parameters in params-argument as array')
13-Sep-2018 14:53:47 Missing argument 6 for phpbb\routing\router::__construct(), called in /data/tests/controller/common_helper_route.php on line 142 and defined
13-Sep-2018 14:53:47
13-Sep-2018 14:53:47 /data/phpBB/phpbb/routing/router.php:98
13-Sep-2018 14:53:47 /data/tests/controller/common_helper_route.php:142
13-Sep-2018 14:53:47 /data/tests/controller/common_helper_route.php:46
13-Sep-2018 14:53:47
13-Sep-2018 14:53:47 696) phpbb_controller_helper_route_unclean_path_test::test_helper_url_network_with_rewrite with data set #4 ('controller2', array(1, 2), true, 'custom-sid', '//localhost/foo/bar?t=1&f...om-sid', 'params-argument (array) using...ion_id')
13-Sep-2018 14:53:47 Missing argument 6 for phpbb\routing\router::__construct(), called in /data/tests/controller/common_helper_route.php on line 142 and defined
13-Sep-2018 14:53:47
13-Sep-2018 14:53:47 /data/phpBB/phpbb/routing/router.php:98
13-Sep-2018 14:53:47 /data/tests/controller/common_helper_route.php:142
13-Sep-2018 14:53:47 /data/tests/controller/common_helper_route.php:46
13-Sep-2018 14:53:47
13-Sep-2018 14:53:47 697) phpbb_controller_helper_route_unclean_path_test::test_helper_url_network_with_rewrite with data set #5 ('controller2', array(1, 2), false, 'custom-sid', '//localhost/foo/bar?t=1&f=2&s...om-sid', 'params-argument (array) using...ion_id')
13-Sep-2018 14:53:47 Missing argument 6 for phpbb\routing\router::__construct(), called in /data/tests/controller/common_helper_route.php on line 142 and defined
13-Sep-2018 14:53:47
13-Sep-2018 14:53:47 /data/phpBB/phpbb/routing/router.php:98
13-Sep-2018 14:53:47 /data/tests/controller/common_helper_route.php:142
13-Sep-2018 14:53:47 /data/tests/controller/common_helper_route.php:46
13-Sep-2018 14:53:47
13-Sep-2018 14:53:47 698) phpbb_controller_helper_route_unclean_path_test::test_helper_url_network_with_rewrite with data set #6 ('controller3', array(3, 1, 2), true, 'custom-sid', '//localhost/foo/bar/p-3?t=1&a...om-sid', 'params-argument (array) using...ion_id')
13-Sep-2018 14:53:47 Missing argument 6 for phpbb\routing\router::__construct(), called in /data/tests/controller/common_helper_route.php on line 142 and defined
13-Sep-2018 14:53:47
13-Sep-2018 14:53:47 /data/phpBB/phpbb/routing/router.php:98
13-Sep-2018 14:53:47 /data/tests/controller/common_helper_route.php:142
13-Sep-2018 14:53:47 /data/tests/controller/common_helper_route.php:46
13-Sep-2018 14:53:47
13-Sep-2018 14:53:47 699) phpbb_controller_helper_route_unclean_path_test::test_helper_url_network_with_rewrite with data set #7 ('controller2', array(1, 2, 'anchor'), true, false, '//localhost/foo/bar?t=1&f=2#anchor', 'anchor in params-argument (array)')
13-Sep-2018 14:53:47 Missing argument 6 for phpbb\routing\router::__construct(), called in /data/tests/controller/common_helper_route.php on line 142 and defined
13-Sep-2018 14:53:47
13-Sep-2018 14:53:47 /data/phpBB/phpbb/routing/router.php:98
13-Sep-2018 14:53:47 /data/tests/controller/common_helper_route.php:142
13-Sep-2018 14:53:47 /data/tests/controller/common_helper_route.php:46
13-Sep-2018 14:53:47
13-Sep-2018 14:53:47 700) phpbb_controller_helper_route_unclean_path_test::test_helper_url_network_with_rewrite with data set #8 ('controller2', array(1, 2, 'anchor'), false, false, '//localhost/foo/bar?t=1&f=2#anchor', 'anchor in params-argument (array)')
13-Sep-2018 14:53:47 Missing argument 6 for phpbb\routing\router::__construct(), called in /data/tests/controller/common_helper_route.php on line 142 and defined
13-Sep-2018 14:53:47
13-Sep-2018 14:53:47 /data/phpBB/phpbb/routing/router.php:98
13-Sep-2018 14:53:47 /data/tests/controller/common_helper_route.php:142
13-Sep-2018 14:53:47 /data/tests/controller/common_helper_route.php:46
13-Sep-2018 14:53:47
13-Sep-2018 14:53:47 701) phpbb_controller_helper_route_unclean_path_test::test_helper_url_network_with_rewrite with data set #9 ('controller3', array(3, 1, 2, 'anchor'), true, false, '//localhost/foo/bar/p-3?t=1&a...anchor', 'anchor in params-argument (array)')
13-Sep-2018 14:53:47 Missing argument 6 for phpbb\routing\router::__construct(), called in /data/tests/controller/common_helper_route.php on line 142 and defined
13-Sep-2018 14:53:47
13-Sep-2018 14:53:47 /data/phpBB/phpbb/routing/router.php:98
13-Sep-2018 14:53:47 /data/tests/controller/common_helper_route.php:142
13-Sep-2018 14:53:47 /data/tests/controller/common_helper_route.php:46
13-Sep-2018 14:53:47
13-Sep-2018 14:53:47 702) phpbb_controller_helper_route_unclean_path_test::test_helper_url_network_with_rewrite with data set #10 ('controller2', array(1, 2, 'anchor'), true, 'custom-sid', '//localhost/foo/bar?t=1&f...anchor', 'anchor in params-argument (ar...ion_id')
13-Sep-2018 14:53:47 Missing argument 6 for phpbb\routing\router::__construct(), called in /data/tests/controller/common_helper_route.php on line 142 and defined
13-Sep-2018 14:53:47
13-Sep-2018 14:53:47 /data/phpBB/phpbb/routing/router.php:98
13-Sep-2018 14:53:47 /data/tests/controller/common_helper_route.php:142
13-Sep-2018 14:53:47 /data/tests/controller/common_helper_route.php:46
13-Sep-2018 14:53:47
13-Sep-2018 14:53:47 703) phpbb_controller_helper_route_unclean_path_test::test_helper_url_network_with_rewrite with data set #11 ('controller2', array(1, 2, 'anchor'), false, 'custom-sid', '//localhost/foo/bar?t=1&f=2&s...anchor', 'anchor in params-argument (ar...ion_id')
13-Sep-2018 14:53:47 Missing argument 6 for phpbb\routing\router::__construct(), called in /data/tests/controller/common_helper_route.php on line 142 and defined
13-Sep-2018 14:53:47
13-Sep-2018 14:53:47 /data/phpBB/phpbb/routing/router.php:98
13-Sep-2018 14:53:47 /data/tests/controller/common_helper_route.php:142
13-Sep-2018 14:53:47 /data/tests/controller/common_helper_route.php:46
13-Sep-2018 14:53:47
13-Sep-2018 14:53:47 704) phpbb_controller_helper_route_unclean_path_test::test_helper_url_network_with_rewrite with data set #12 ('controller3', array(3, 1, 2, 'anchor'), true, 'custom-sid', '//localhost/foo/bar/p-3?t=1&a...anchor', 'anchor in params-argument (ar...ion_id')
13-Sep-2018 14:53:47 Missing argument 6 for phpbb\routing\router::__construct(), called in /data/tests/controller/common_helper_route.php on line 142 and defined
13-Sep-2018 14:53:47
13-Sep-2018 14:53:47 /data/phpBB/phpbb/routing/router.php:98
13-Sep-2018 14:53:47 /data/tests/controller/common_helper_route.php:142
13-Sep-2018 14:53:47 /data/tests/controller/common_helper_route.php:46
13-Sep-2018 14:53:47
13-Sep-2018 14:53:47 705) phpbb_controller_helper_route_unclean_path_test::test_helper_url_network_with_rewrite with data set #13 ('controller2', array(), true, false, '//localhost/foo/bar', 'no params using empty array')
13-Sep-2018 14:53:47 Missing argument 6 for phpbb\routing\router::__construct(), called in /data/tests/controller/common_helper_route.php on line 142 and defined
13-Sep-2018 14:53:47
13-Sep-2018 14:53:47 /data/phpBB/phpbb/routing/router.php:98
13-Sep-2018 14:53:47 /data/tests/controller/common_helper_route.php:142
13-Sep-2018 14:53:47 /data/tests/controller/common_helper_route.php:46
13-Sep-2018 14:53:47
13-Sep-2018 14:53:47 706) phpbb_controller_helper_route_unclean_path_test::test_helper_url_network_with_rewrite with data set #14 ('controller2', array(), false, false, '//localhost/foo/bar', 'no params using empty array')
13-Sep-2018 14:53:47 Missing argument 6 for phpbb\routing\router::__construct(), called in /data/tests/controller/common_helper_route.php on line 142 and defined
13-Sep-2018 14:53:47
13-Sep-2018 14:53:47 /data/phpBB/phpbb/routing/router.php:98
13-Sep-2018 14:53:47 /data/tests/controller/common_helper_route.php:142
13-Sep-2018 14:53:47 /data/tests/controller/common_helper_route.php:46
13-Sep-2018 14:53:47
13-Sep-2018 14:53:47 707) phpbb_controller_helper_route_unclean_path_test::test_helper_url_network_with_rewrite with data set #15 ('controller3', array(3), true, false, '//localhost/foo/bar/p-3', 'no params using empty array')
13-Sep-2018 14:53:47 Missing argument 6 for phpbb\routing\router::__construct(), called in /data/tests/controller/common_helper_route.php on line 142 and defined
13-Sep-2018 14:53:47
13-Sep-2018 14:53:47 /data/phpBB/phpbb/routing/router.php:98
13-Sep-2018 14:53:47 /data/tests/controller/common_helper_route.php:142
13-Sep-2018 14:53:47 /data/tests/controller/common_helper_route.php:46
13-Sep-2018 14:53:47
13-Sep-2018 14:53:47 708) phpbb_controller_helper_route_unclean_path_test::test_helper_url_network_with_rewrite with data set #16 ('controller4', array(), true, false, '//localhost/foo/test', 'di parameter')
13-Sep-2018 14:53:47 Missing argument 6 for phpbb\routing\router::__construct(), called in /data/tests/controller/common_helper_route.php on line 142 and defined
13-Sep-2018 14:53:47
13-Sep-2018 14:53:47 /data/phpBB/phpbb/routing/router.php:98
13-Sep-2018 14:53:47 /data/tests/controller/common_helper_route.php:142
13-Sep-2018 14:53:47 /data/tests/controller/common_helper_route.php:46
13-Sep-2018 14:53:47
13-Sep-2018 14:53:47 709) phpbb_controller_helper_route_unclean_path_test::test_helper_url_force_server_vars with data set #0 (false, true, 'my_server', 443, '/my/board', 'http://', 0, 'http://my_server:443/my/board...hp/foo')
13-Sep-2018 14:53:47 Missing argument 6 for phpbb\routing\router::__construct(), called in /data/tests/controller/common_helper_route.php on line 142 and defined
13-Sep-2018 14:53:47
13-Sep-2018 14:53:47 /data/phpBB/phpbb/routing/router.php:98
13-Sep-2018 14:53:47 /data/tests/controller/common_helper_route.php:142
13-Sep-2018 14:53:47 /data/tests/controller/common_helper_route.php:46
13-Sep-2018 14:53:47
13-Sep-2018 14:53:47 710) phpbb_controller_helper_route_unclean_path_test::test_helper_url_force_server_vars with data set #1 (true, true, 'my_server', 444, '/my/board', 'https://', 0, 'https://my_server:444/my/board/foo')
13-Sep-2018 14:53:47 Missing argument 6 for phpbb\routing\router::__construct(), called in /data/tests/controller/common_helper_route.php on line 142 and defined
13-Sep-2018 14:53:47
13-Sep-2018 14:53:47 /data/phpBB/phpbb/routing/router.php:98
13-Sep-2018 14:53:47 /data/tests/controller/common_helper_route.php:142
13-Sep-2018 14:53:47 /data/tests/controller/common_helper_route.php:46
13-Sep-2018 14:53:47
13-Sep-2018 14:53:47 711) phpbb_controller_helper_route_unclean_path_test::test_helper_url_force_server_vars with data set #2 (false, true, 'my_server', 443, '/my/board', 'http://', 3, '//my_server:443/my/board/app.php/foo')
13-Sep-2018 14:53:47 Missing argument 6 for phpbb\routing\router::__construct(), called in /data/tests/controller/common_helper_route.php on line 142 and defined
13-Sep-2018 14:53:47
13-Sep-2018 14:53:47 /data/phpBB/phpbb/routing/router.php:98
13-Sep-2018 14:53:47 /data/tests/controller/common_helper_route.php:142
13-Sep-2018 14:53:47 /data/tests/controller/common_helper_route.php:46
13-Sep-2018 14:53:47
13-Sep-2018 14:53:47 712) phpbb_controller_helper_route_unclean_path_test::test_helper_url_force_server_vars with data set #3 (true, true, 'my_server', 444, '/my/board', 'https://', 3, '//my_server:444/my/board/foo')
13-Sep-2018 14:53:47 Missing argument 6 for phpbb\routing\router::__construct(), called in /data/tests/controller/common_helper_route.php on line 142 and defined
13-Sep-2018 14:53:47
13-Sep-2018 14:53:47 /data/phpBB/phpbb/routing/router.php:98
13-Sep-2018 14:53:47 /data/tests/controller/common_helper_route.php:142
13-Sep-2018 14:53:47 /data/tests/controller/common_helper_route.php:46
13-Sep-2018 14:53:47
13-Sep-2018 14:53:47 713) phpbb_controller_helper_route_unclean_path_test::test_helper_url_force_server_vars with data set #4 (false, true, 'my_server', 443, '/my/board', 'http://', 1, '/my/board/app.php/foo')
13-Sep-2018 14:53:47 Missing argument 6 for phpbb\routing\router::__construct(), called in /data/tests/controller/common_helper_route.php on line 142 and defined
13-Sep-2018 14:53:47
13-Sep-2018 14:53:47 /data/phpBB/phpbb/routing/router.php:98
13-Sep-2018 14:53:47 /data/tests/controller/common_helper_route.php:142
13-Sep-2018 14:53:47 /data/tests/controller/common_helper_route.php:46
13-Sep-2018 14:53:47
13-Sep-2018 14:53:47 714) phpbb_controller_helper_route_unclean_path_test::test_helper_url_force_server_vars with data set #5 (true, true, 'my_server', 443, '/my/board', 'http://', 1, '/my/board/foo')
13-Sep-2018 14:53:47 Missing argument 6 for phpbb\routing\router::__construct(), called in /data/tests/controller/common_helper_route.php on line 142 and defined
13-Sep-2018 14:53:47
13-Sep-2018 14:53:47 /data/phpBB/phpbb/routing/router.php:98
13-Sep-2018 14:53:47 /data/tests/controller/common_helper_route.php:142
13-Sep-2018 14:53:47 /data/tests/controller/common_helper_route.php:46
13-Sep-2018 14:53:47
13-Sep-2018 14:53:47 715) phpbb_controller_helper_route_unclean_path_test::test_helper_url_force_server_vars with data set #6 (false, true, 'my_server', 443, '/my/board', 'http://', 2, 'app.php/foo')
13-Sep-2018 14:53:47 Missing argument 6 for phpbb\routing\router::__construct(), called in /data/tests/controller/common_helper_route.php on line 142 and defined
13-Sep-2018 14:53:47
13-Sep-2018 14:53:47 /data/phpBB/phpbb/routing/router.php:98
13-Sep-2018 14:53:47 /data/tests/controller/common_helper_route.php:142
13-Sep-2018 14:53:47 /data/tests/controller/common_helper_route.php:46
13-Sep-2018 14:53:47
13-Sep-2018 14:53:47 716) phpbb_controller_helper_route_unclean_path_test::test_helper_url_force_server_vars with data set #7 (true, true, 'my_server', 443, '/my/board', 'http://', 2, 'foo')
13-Sep-2018 14:53:47 Missing argument 6 for phpbb\routing\router::__construct(), called in /data/tests/controller/common_helper_route.php on line 142 and defined
13-Sep-2018 14:53:47
13-Sep-2018 14:53:47 /data/phpBB/phpbb/routing/router.php:98
13-Sep-2018 14:53:47 /data/tests/controller/common_helper_route.php:142
13-Sep-2018 14:53:47 /data/tests/controller/common_helper_route.php:46
13-Sep-2018 14:53:47
13-Sep-2018 14:53:47 717) phpbb_pagination_pagination_test::test_generate_template_pagination with data set #0 ('page.php', 'start', 95, 10, 10, 'pagination\n                                :per_page:10\n        ...art=20')
13-Sep-2018 14:53:47 Missing argument 6 for phpbb\routing\router::__construct(), called in /data/tests/pagination/pagination_test.php on line 49 and defined
13-Sep-2018 14:53:47
13-Sep-2018 14:53:47 /data/phpBB/phpbb/routing/router.php:98
13-Sep-2018 14:53:47 /data/tests/pagination/pagination_test.php:49
13-Sep-2018 14:53:47
13-Sep-2018 14:53:47 718) phpbb_pagination_pagination_test::test_generate_template_pagination with data set #1 ('page.php', 'start', 95, 10, 20, 'pagination\n                                :per_page:10\n        ...art=30')
13-Sep-2018 14:53:47 Missing argument 6 for phpbb\routing\router::__construct(), called in /data/tests/pagination/pagination_test.php on line 49 and defined
13-Sep-2018 14:53:47
13-Sep-2018 14:53:47 /data/phpBB/phpbb/routing/router.php:98
13-Sep-2018 14:53:47 /data/tests/pagination/pagination_test.php:49
13-Sep-2018 14:53:47
13-Sep-2018 14:53:47 719) phpbb_pagination_pagination_test::test_generate_template_pagination with data set #2 (array(array('core_controller', 'core_page_controller')), 'page', 95, 10, 10, 'pagination\n                                :per_page:10\n        ...page/3')
13-Sep-2018 14:53:47 Missing argument 6 for phpbb\routing\router::__construct(), called in /data/tests/pagination/pagination_test.php on line 49 and defined
13-Sep-2018 14:53:47
13-Sep-2018 14:53:47 /data/phpBB/phpbb/routing/router.php:98
13-Sep-2018 14:53:47 /data/tests/pagination/pagination_test.php:49
13-Sep-2018 14:53:47
13-Sep-2018 14:53:47 720) phpbb_pagination_pagination_test::test_generate_template_pagination with data set #3 (array(array('core_controller', 'core_page_controller')), 'page', 95, 10, 20, 'pagination\n                                :per_page:10\n        ...page/4')
13-Sep-2018 14:53:47 Missing argument 6 for phpbb\routing\router::__construct(), called in /data/tests/pagination/pagination_test.php on line 49 and defined
13-Sep-2018 14:53:47
13-Sep-2018 14:53:47 /data/phpBB/phpbb/routing/router.php:98
13-Sep-2018 14:53:47 /data/tests/pagination/pagination_test.php:49
13-Sep-2018 14:53:47
13-Sep-2018 14:53:47 721) phpbb_pagination_pagination_test::test_generate_template_pagination_sub with data set #0 ('page.php', 'start', 95, 10, 10, 'pagination\n                                :per_page:10\n        ...art=20')
13-Sep-2018 14:53:47 Missing argument 6 for phpbb\routing\router::__construct(), called in /data/tests/pagination/pagination_test.php on line 49 and defined
13-Sep-2018 14:53:47
13-Sep-2018 14:53:47 /data/phpBB/phpbb/routing/router.php:98
13-Sep-2018 14:53:47 /data/tests/pagination/pagination_test.php:49
13-Sep-2018 14:53:47
13-Sep-2018 14:53:47 722) phpbb_pagination_pagination_test::test_generate_template_pagination_sub with data set #1 ('page.php', 'start', 95, 10, 20, 'pagination\n                                :per_page:10\n        ...art=30')
13-Sep-2018 14:53:47 Missing argument 6 for phpbb\routing\router::__construct(), called in /data/tests/pagination/pagination_test.php on line 49 and defined
13-Sep-2018 14:53:47
13-Sep-2018 14:53:47 /data/phpBB/phpbb/routing/router.php:98
13-Sep-2018 14:53:47 /data/tests/pagination/pagination_test.php:49
13-Sep-2018 14:53:47
13-Sep-2018 14:53:47 723) phpbb_pagination_pagination_test::test_generate_template_pagination_sub with data set #2 (array(array('core_controller', 'core_page_controller')), 'page', 95, 10, 10, 'pagination\n                                :per_page:10\n        ...page/3')
13-Sep-2018 14:53:47 Missing argument 6 for phpbb\routing\router::__construct(), called in /data/tests/pagination/pagination_test.php on line 49 and defined
13-Sep-2018 14:53:47
13-Sep-2018 14:53:47 /data/phpBB/phpbb/routing/router.php:98
13-Sep-2018 14:53:47 /data/tests/pagination/pagination_test.php:49
13-Sep-2018 14:53:47
13-Sep-2018 14:53:47 724) phpbb_pagination_pagination_test::test_generate_template_pagination_sub with data set #3 (array(array('core_controller', 'core_page_controller')), 'page', 95, 10, 20, 'pagination\n                                :per_page:10\n        ...page/4')
13-Sep-2018 14:53:47 Missing argument 6 for phpbb\routing\router::__construct(), called in /data/tests/pagination/pagination_test.php on line 49 and defined
13-Sep-2018 14:53:47
13-Sep-2018 14:53:47 /data/phpBB/phpbb/routing/router.php:98
13-Sep-2018 14:53:47 /data/tests/pagination/pagination_test.php:49
13-Sep-2018 14:53:47
13-Sep-2018 14:53:47 725) phpbb_pagination_pagination_test::test_generate_template_pagination_double_nested with data set #0 ('page.php', 'start', 95, 10, 10, 'pagination\n                                :per_page:10\n        ...art=20')
13-Sep-2018 14:53:47 Missing argument 6 for phpbb\routing\router::__construct(), called in /data/tests/pagination/pagination_test.php on line 49 and defined
13-Sep-2018 14:53:47
13-Sep-2018 14:53:47 /data/phpBB/phpbb/routing/router.php:98
13-Sep-2018 14:53:47 /data/tests/pagination/pagination_test.php:49
13-Sep-2018 14:53:47
13-Sep-2018 14:53:47 726) phpbb_pagination_pagination_test::test_generate_template_pagination_double_nested with data set #1 ('page.php', 'start', 95, 10, 20, 'pagination\n                                :per_page:10\n        ...art=30')
13-Sep-2018 14:53:47 Missing argument 6 for phpbb\routing\router::__construct(), called in /data/tests/pagination/pagination_test.php on line 49 and defined
13-Sep-2018 14:53:47
13-Sep-2018 14:53:47 /data/phpBB/phpbb/routing/router.php:98
13-Sep-2018 14:53:47 /data/tests/pagination/pagination_test.php:49
13-Sep-2018 14:53:47
13-Sep-2018 14:53:47 727) phpbb_pagination_pagination_test::test_generate_template_pagination_double_nested with data set #2 (array(array('core_controller', 'core_page_controller')), 'page', 95, 10, 10, 'pagination\n                                :per_page:10\n        ...page/3')
13-Sep-2018 14:53:47 Missing argument 6 for phpbb\routing\router::__construct(), called in /data/tests/pagination/pagination_test.php on line 49 and defined
13-Sep-2018 14:53:47
13-Sep-2018 14:53:47 /data/phpBB/phpbb/routing/router.php:98
13-Sep-2018 14:53:47 /data/tests/pagination/pagination_test.php:49
13-Sep-2018 14:53:47
13-Sep-2018 14:53:47 728) phpbb_pagination_pagination_test::test_generate_template_pagination_double_nested with data set #3 (array(array('core_controller', 'core_page_controller')), 'page', 95, 10, 20, 'pagination\n                                :per_page:10\n        ...page/4')
13-Sep-2018 14:53:47 Missing argument 6 for phpbb\routing\router::__construct(), called in /data/tests/pagination/pagination_test.php on line 49 and defined
13-Sep-2018 14:53:47
13-Sep-2018 14:53:47 /data/phpBB/phpbb/routing/router.php:98
13-Sep-2018 14:53:47 /data/tests/pagination/pagination_test.php:49
13-Sep-2018 14:53:47
13-Sep-2018 14:53:47 729) phpbb_pagination_pagination_test::test_on_page with data set #0 (10, 10, 0, 'PAGE_OF-1-1')
13-Sep-2018 14:53:47 Missing argument 6 for phpbb\routing\router::__construct(), called in /data/tests/pagination/pagination_test.php on line 49 and defined
13-Sep-2018 14:53:47
13-Sep-2018 14:53:47 /data/phpBB/phpbb/routing/router.php:98
13-Sep-2018 14:53:47 /data/tests/pagination/pagination_test.php:49
13-Sep-2018 14:53:47
13-Sep-2018 14:53:47 730) phpbb_pagination_pagination_test::test_on_page with data set #1 ('10', '10', '0', 'PAGE_OF-1-1')
13-Sep-2018 14:53:47 Missing argument 6 for phpbb\routing\router::__construct(), called in /data/tests/pagination/pagination_test.php on line 49 and defined
13-Sep-2018 14:53:47
13-Sep-2018 14:53:47 /data/phpBB/phpbb/routing/router.php:98
13-Sep-2018 14:53:47 /data/tests/pagination/pagination_test.php:49
13-Sep-2018 14:53:47
13-Sep-2018 14:53:47 731) phpbb_pagination_pagination_test::test_validate_start with data set #0 (0, 0, 0)
13-Sep-2018 14:53:47 Missing argument 6 for phpbb\routing\router::__construct(), called in /data/tests/pagination/pagination_test.php on line 49 and defined
13-Sep-2018 14:53:47
13-Sep-2018 14:53:47 /data/phpBB/phpbb/routing/router.php:98
13-Sep-2018 14:53:47 /data/tests/pagination/pagination_test.php:49
13-Sep-2018 14:53:47
13-Sep-2018 14:53:47 732) phpbb_pagination_pagination_test::test_validate_start with data set #1 (-1, 20, 0)
13-Sep-2018 14:53:47 Missing argument 6 for phpbb\routing\router::__construct(), called in /data/tests/pagination/pagination_test.php on line 49 and defined
13-Sep-2018 14:53:47
13-Sep-2018 14:53:47 /data/phpBB/phpbb/routing/router.php:98
13-Sep-2018 14:53:47 /data/tests/pagination/pagination_test.php:49
13-Sep-2018 14:53:47
13-Sep-2018 14:53:47 733) phpbb_pagination_pagination_test::test_validate_start with data set #2 (20, -30, 0)
13-Sep-2018 14:53:47 Missing argument 6 for phpbb\routing\router::__construct(), called in /data/tests/pagination/pagination_test.php on line 49 and defined
13-Sep-2018 14:53:47
13-Sep-2018 14:53:47 /data/phpBB/phpbb/routing/router.php:98
13-Sep-2018 14:53:47 /data/tests/pagination/pagination_test.php:49
13-Sep-2018 14:53:47
13-Sep-2018 14:53:47 734) phpbb_pagination_pagination_test::test_validate_start with data set #3 (0, 20, 0)
13-Sep-2018 14:53:47 Missing argument 6 for phpbb\routing\router::__construct(), called in /data/tests/pagination/pagination_test.php on line 49 and defined
13-Sep-2018 14:53:47
13-Sep-2018 14:53:47 /data/phpBB/phpbb/routing/router.php:98
13-Sep-2018 14:53:47 /data/tests/pagination/pagination_test.php:49
13-Sep-2018 14:53:47
13-Sep-2018 14:53:47 735) phpbb_pagination_pagination_test::test_validate_start with data set #4 (10, 20, 10)
13-Sep-2018 14:53:47 Missing argument 6 for phpbb\routing\router::__construct(), called in /data/tests/pagination/pagination_test.php on line 49 and defined
13-Sep-2018 14:53:47
13-Sep-2018 14:53:47 /data/phpBB/phpbb/routing/router.php:98
13-Sep-2018 14:53:47 /data/tests/pagination/pagination_test.php:49
13-Sep-2018 14:53:47
13-Sep-2018 14:53:47 736) phpbb_pagination_pagination_test::test_validate_start with data set #5 (20, 20, 10)
13-Sep-2018 14:53:47 Missing argument 6 for phpbb\routing\router::__construct(), called in /data/tests/pagination/pagination_test.php on line 49 and defined
13-Sep-2018 14:53:47
13-Sep-2018 14:53:47 /data/phpBB/phpbb/routing/router.php:98
13-Sep-2018 14:53:47 /data/tests/pagination/pagination_test.php:49
13-Sep-2018 14:53:47
13-Sep-2018 14:53:47 737) phpbb_pagination_pagination_test::test_validate_start with data set #6 (30, 20, 10)
13-Sep-2018 14:53:47 Missing argument 6 for phpbb\routing\router::__construct(), called in /data/tests/pagination/pagination_test.php on line 49 and defined
13-Sep-2018 14:53:47
13-Sep-2018 14:53:47 /data/phpBB/phpbb/routing/router.php:98
13-Sep-2018 14:53:47 /data/tests/pagination/pagination_test.php:49
13-Sep-2018 14:53:47
13-Sep-2018 14:53:47 738) phpbb_pagination_pagination_test::test_reverse_start with data set #0 (10, 5, 15, 0)
13-Sep-2018 14:53:47 Missing argument 6 for phpbb\routing\router::__construct(), called in /data/tests/pagination/pagination_test.php on line 49 and defined
13-Sep-2018 14:53:47
13-Sep-2018 14:53:47 /data/phpBB/phpbb/routing/router.php:98
13-Sep-2018 14:53:47 /data/tests/pagination/pagination_test.php:49
13-Sep-2018 14:53:47
13-Sep-2018 14:53:47 739) phpbb_pagination_pagination_test::test_reverse_start with data set #1 (10, 10, 25, 5)
13-Sep-2018 14:53:47 Missing argument 6 for phpbb\routing\router::__construct(), called in /data/tests/pagination/pagination_test.php on line 49 and defined
13-Sep-2018 14:53:47
13-Sep-2018 14:53:47 /data/phpBB/phpbb/routing/router.php:98
13-Sep-2018 14:53:47 /data/tests/pagination/pagination_test.php:49
13-Sep-2018 14:53:47
13-Sep-2018 14:53:47 740) phpbb_pagination_pagination_test::test_reverse_limit with data set #0 (10, 10, 15, 5)
13-Sep-2018 14:53:47 Missing argument 6 for phpbb\routing\router::__construct(), called in /data/tests/pagination/pagination_test.php on line 49 and defined
13-Sep-2018 14:53:47
13-Sep-2018 14:53:47 /data/phpBB/phpbb/routing/router.php:98
13-Sep-2018 14:53:47 /data/tests/pagination/pagination_test.php:49
13-Sep-2018 14:53:47
13-Sep-2018 14:53:47 741) phpbb_pagination_pagination_test::test_reverse_limit with data set #1 (20, 10, 15, 1)
13-Sep-2018 14:53:47 Missing argument 6 for phpbb\routing\router::__construct(), called in /data/tests/pagination/pagination_test.php on line 49 and defined
13-Sep-2018 14:53:47
13-Sep-2018 14:53:47 /data/phpBB/phpbb/routing/router.php:98
13-Sep-2018 14:53:47 /data/tests/pagination/pagination_test.php:49
13-Sep-2018 14:53:47
13-Sep-2018 14:53:47 --
13-Sep-2018 14:53:47
13-Sep-2018 14:53:47 There was 1 warning:
13-Sep-2018 14:53:47
13-Sep-2018 14:53:47 1) phpbb_console_user_add_test::test_add_dialog
13-Sep-2018 14:53:47 PHPUnit_Framework_TestCase::getMock() is deprecated, use PHPUnit_Framework_TestCase::createMock() or PHPUnit_Framework_TestCase::getMockBuilder() instead
13-Sep-2018 14:53:47
13-Sep-2018 14:53:47 ERRORS!
13-Sep-2018 14:53:47 Tests: 9512, Assertions: 98049, Errors: 741, Warnings: 1, Skipped: 297, Incomplete: 5.
13-Sep-2018 14:53:48 Error occurred while running Task 'Run tests(10)' of type com.atlassian.bamboo.plugins.bamboo-docker-plugin:task.docker.cli.
13-Sep-2018 14:53:48 com.atlassian.bamboo.task.TaskException: Failed to execute task
13-Sep-2018 14:53:48         at com.atlassian.bamboo.plugins.docker.service.RunService.execute(RunService.java:75)
13-Sep-2018 14:53:48         at com.atlassian.bamboo.plugins.docker.tasks.cli.DockerCliTask.execute(DockerCliTask.java:70)
13-Sep-2018 14:53:48         at com.atlassian.bamboo.task.TaskExecutorImpl.lambda$executeTasks$3(TaskExecutorImpl.java:285)
13-Sep-2018 14:53:48         at com.atlassian.bamboo.task.TaskExecutorImpl.executeTaskWithPrePostActions(TaskExecutorImpl.java:224)
13-Sep-2018 14:53:48         at com.atlassian.bamboo.task.TaskExecutorImpl.executeTasks(TaskExecutorImpl.java:285)
13-Sep-2018 14:53:48         at com.atlassian.bamboo.task.TaskExecutorImpl.execute(TaskExecutorImpl.java:112)
13-Sep-2018 14:53:48         at com.atlassian.bamboo.build.pipeline.tasks.ExecuteBuildTask.call(ExecuteBuildTask.java:71)
13-Sep-2018 14:53:48         at com.atlassian.bamboo.v2.build.agent.DefaultBuildAgent.executeBuildPhase(DefaultBuildAgent.java:203)
13-Sep-2018 14:53:48         at com.atlassian.bamboo.v2.build.agent.DefaultBuildAgent.build(DefaultBuildAgent.java:175)
13-Sep-2018 14:53:48         at com.atlassian.bamboo.v2.build.agent.BuildAgentControllerImpl.lambda$waitAndPerformBuild$0(BuildAgentControllerImpl.java:122)
13-Sep-2018 14:53:48         at com.atlassian.bamboo.variable.CustomVariableContextImpl.withVariableSubstitutor(CustomVariableContextImpl.java:185)
13-Sep-2018 14:53:48         at com.atlassian.bamboo.v2.build.agent.BuildAgentControllerImpl.waitAndPerformBuild(BuildAgentControllerImpl.java:117)
13-Sep-2018 14:53:48         at com.atlassian.bamboo.v2.build.agent.DefaultBuildAgent$1.run(DefaultBuildAgent.java:126)
13-Sep-2018 14:53:48         at com.atlassian.bamboo.utils.BambooRunnables$1.run(BambooRunnables.java:48)
13-Sep-2018 14:53:48         at com.atlassian.bamboo.security.ImpersonationHelper.runWith(ImpersonationHelper.java:26)
13-Sep-2018 14:53:48         at com.atlassian.bamboo.security.ImpersonationHelper.runWithSystemAuthority(ImpersonationHelper.java:17)
13-Sep-2018 14:53:48         at com.atlassian.bamboo.security.ImpersonationHelper$1.run(ImpersonationHelper.java:41)
13-Sep-2018 14:53:48         at java.lang.Thread.run(Thread.java:748)
13-Sep-2018 14:53:48 Caused by: com.atlassian.bamboo.docker.DockerException: Error running Docker run command
13-Sep-2018 14:53:48         at com.atlassian.bamboo.docker.DockerContainerServiceImpl.run(DockerContainerServiceImpl.java:118)
13-Sep-2018 14:53:48         at sun.reflect.GeneratedMethodAccessor2675.invoke(Unknown Source)
13-Sep-2018 14:53:48         at sun.reflect.DelegatingMethodAccessorImpl.invoke(DelegatingMethodAccessorImpl.java:43)
13-Sep-2018 14:53:48         at java.lang.reflect.Method.invoke(Method.java:498)
13-Sep-2018 14:53:48         at com.atlassian.plugin.util.ContextClassLoaderSettingInvocationHandler.invoke(ContextClassLoaderSettingInvocationHandler.java:26)
13-Sep-2018 14:53:48         at com.sun.proxy.$Proxy401.run(Unknown Source)
13-Sep-2018 14:53:48         at sun.reflect.GeneratedMethodAccessor2675.invoke(Unknown Source)
13-Sep-2018 14:53:48         at sun.reflect.DelegatingMethodAccessorImpl.invoke(DelegatingMethodAccessorImpl.java:43)
13-Sep-2018 14:53:48         at java.lang.reflect.Method.invoke(Method.java:498)
13-Sep-2018 14:53:48         at org.springframework.aop.support.AopUtils.invokeJoinpointUsingReflection(AopUtils.java:302)
13-Sep-2018 14:53:48         at org.eclipse.gemini.blueprint.service.importer.support.internal.aop.ServiceInvoker.doInvoke(ServiceInvoker.java:56)
13-Sep-2018 14:53:48         at org.eclipse.gemini.blueprint.service.importer.support.internal.aop.ServiceInvoker.invoke(ServiceInvoker.java:60)
13-Sep-2018 14:53:48         at org.springframework.aop.framework.ReflectiveMethodInvocation.proceed(ReflectiveMethodInvocation.java:179)
13-Sep-2018 14:53:48         at org.springframework.aop.support.DelegatingIntroductionInterceptor.doProceed(DelegatingIntroductionInterceptor.java:133)
13-Sep-2018 14:53:48         at org.springframework.aop.support.DelegatingIntroductionInterceptor.invoke(DelegatingIntroductionInterceptor.java:121)
13-Sep-2018 14:53:48         at org.springframework.aop.framework.ReflectiveMethodInvocation.proceed(ReflectiveMethodInvocation.java:179)
13-Sep-2018 14:53:48         at org.eclipse.gemini.blueprint.service.util.internal.aop.ServiceTCCLInterceptor.invokeUnprivileged(ServiceTCCLInterceptor.java:70)
13-Sep-2018 14:53:48         at org.eclipse.gemini.blueprint.service.util.internal.aop.ServiceTCCLInterceptor.invoke(ServiceTCCLInterceptor.java:53)
13-Sep-2018 14:53:48         at org.springframework.aop.framework.ReflectiveMethodInvocation.proceed(ReflectiveMethodInvocation.java:179)
13-Sep-2018 14:53:48         at org.eclipse.gemini.blueprint.service.importer.support.LocalBundleContextAdvice.invoke(LocalBundleContextAdvice.java:57)
13-Sep-2018 14:53:48         at org.springframework.aop.framework.ReflectiveMethodInvocation.proceed(ReflectiveMethodInvocation.java:179)
13-Sep-2018 14:53:48         at org.springframework.aop.support.DelegatingIntroductionInterceptor.doProceed(DelegatingIntroductionInterceptor.java:133)
13-Sep-2018 14:53:48         at org.springframework.aop.support.DelegatingIntroductionInterceptor.invoke(DelegatingIntroductionInterceptor.java:121)
13-Sep-2018 14:53:48         at org.springframework.aop.framework.ReflectiveMethodInvocation.proceed(ReflectiveMethodInvocation.java:179)
13-Sep-2018 14:53:48         at org.springframework.aop.framework.JdkDynamicAopProxy.invoke(JdkDynamicAopProxy.java:207)
13-Sep-2018 14:53:48         at com.sun.proxy.$Proxy680.run(Unknown Source)
13-Sep-2018 14:53:48         at com.atlassian.bamboo.plugins.docker.client.DockerCmd.run(DockerCmd.java:51)
13-Sep-2018 14:53:48         at com.atlassian.bamboo.plugins.docker.service.RunService.execute(RunService.java:64)
13-Sep-2018 14:53:48         ... 17 more
13-Sep-2018 14:53:48 Caused by: com.atlassian.utils.process.ProcessException: Error executing /usr/bin/docker run --volume /home/bamboo/xml-data/build-dir/PHPBB3-PR-JOB1:/data --workdir /data --rm -u=991 -t phpbb:php-5.6 /bin/bash -c "phpBB/vendor/bin/phpunit --log-junit build/logs/phpunit.xml"
13-Sep-2018 14:53:48         at com.atlassian.bamboo.docker.DockerContainerServiceImpl.execute(DockerContainerServiceImpl.java:252)
13-Sep-2018 14:53:48         at com.atlassian.bamboo.docker.DockerContainerServiceImpl.run(DockerContainerServiceImpl.java:106)
13-Sep-2018 14:53:48         ... 44 more
13-Sep-2018 14:53:48 Starting task 'Parsing test results produced by script' of type 'com.atlassian.bamboo.plugins.testresultparser:task.testresultparser.junit'
13-Sep-2018 14:53:48 Parsing test results under /home/bamboo/xml-data/build-dir/PHPBB3-PR-JOB1...
13-Sep-2018 14:53:48 Failing task since 741 failing test cases were found.
13-Sep-2018 14:53:48 Finished task 'Parsing test results produced by script' with result: Failed
13-Sep-2018 14:53:48
Substituting variable: ${bamboo.PRnumber} with 5334
13-Sep-2018 14:53:48
Substituting variable: ${bamboo.buildResultsUrl} with https://bamboo.phpbb.com/browse/PHPBB3-PR-JOB1-8763
13-Sep-2018 14:53:48
Substituting variable: ${bamboo.buildResultsUrl} with https://bamboo.phpbb.com/browse/PHPBB3-PR-JOB1-8763
13-Sep-2018 14:53:48 Starting task 'Set result build status' of type 'com.atlassian.bamboo.plugins.scripttask:task.builder.script'
13-Sep-2018 14:53:48
Beginning to execute external process for build 'phpBB3 - Pull Requests - Build and Test Job #8763 (PHPBB3-PR-JOB1-8763)'
... running command line:
/bin/sh /home/bamboo/temp/PHPBB3-PR-JOB1-8763-ScriptBuildTask-45380817469620683.sh
... in: /home/bamboo/xml-data/build-dir/PHPBB3-PR-JOB1
... using extra environment variables:
bamboo_planRepository_1_branch=3.1.x
bamboo_planRepository_1_branchDisplayName=3.1.x
bamboo_repository_revision_number=dc8ff9da28b8ab4ad11c7ea94cca526f17c87fe5
bamboo_PRref=master
bamboo_resultsUrl=https://bamboo.phpbb.com/browse/PHPBB3-PR-JOB1-8763
bamboo_capability_system_builder_command_Git=/usr/bin/git
bamboo_repository_75956235_git_username=bantu
bamboo_build_working_directory=/home/bamboo/xml-data/build-dir/PHPBB3-PR-JOB1
bamboo_planRepository_1_name=phpBB Ascraeus
bamboo_buildKey=PHPBB3-PR-JOB1
bamboo_capability_phpbb_tests=true
bamboo_shortPlanName=Pull Requests
bamboo_capability_system_builder_command_fop=/usr/bin/fop
bamboo_capability_dbms_sqlite_2=true
bamboo_planRepository_name=phpBB Ascraeus
bamboo_PRnumber=5334
bamboo_buildNumber=8763
bamboo_repository_75956235_git_repositoryUrl=https://github.com/phpbb/phpbb.git
bamboo_capability_system_builder_phpunit_PHPUnit=/usr/bin/phpunit
bamboo_shortJobName=Build and Test Job
bamboo_buildResultsUrl=https://bamboo.phpbb.com/browse/PHPBB3-PR-JOB1-8763
bamboo_repository_75956235_branch_name=3.1.x
bamboo_planRepository_repositoryUrl=https://github.com/phpbb/phpbb.git
bamboo_agentId=131073
bamboo_planName=phpBB3 - Pull Requests
bamboo_build_commandline_com_atlassian_bamboo_plugins_scripttask_task_builder_script_7=/bin/sh /home/bamboo/temp/PHPBB3-PR-JOB1-8763-ScriptBuildTask-712491111766561283.sh
bamboo_shortPlanKey=PR
bamboo_shortJobKey=JOB1
bamboo_capability_dbms_mysql_55=true
bamboo_capability_system_jdk_JDK_1_7_0_65=/usr/lib/jvm/java-7-openjdk-amd64
bamboo_planRepository_revision=dc8ff9da28b8ab4ad11c7ea94cca526f17c87fe5
bamboo_buildTimeStamp=2018-09-13T14:47:15.337Z
bamboo_repository_previous_revision_number=dc8ff9da28b8ab4ad11c7ea94cca526f17c87fe5
bamboo_capability_system_jdk_JDK_1_6_0_16=/usr/lib/jvm/java-6-sun-1.6.0.16
bamboo_capability_system_builder_mvn2_Maven_2=/usr/share/maven2
bamboo_planRepository_previousRevision=dc8ff9da28b8ab4ad11c7ea94cca526f17c87fe5
bamboo_build_commandline_com_atlassian_bamboo_plugins_scripttask_task_builder_script_4=/bin/sh /home/bamboo/temp/PHPBB3-PR-JOB1-8763-ScriptBuildTask-7715280315616914900.sh
bamboo_repository_git_branch=3.1.x
bamboo_buildResultKey=PHPBB3-PR-JOB1-8763
bamboo_repository_branch_name=3.1.x
bamboo_buildPlanName=phpBB3 - Pull Requests - Build and Test Job
bamboo_planRepository_1_revision=dc8ff9da28b8ab4ad11c7ea94cca526f17c87fe5
bamboo_repository_name=phpBB Ascraeus
bamboo_buildFailed=true
bamboo_build_commandline_com_atlassian_bamboo_plugins_bamboo_docker_plugin_task_docker_cli_10=/usr/bin/docker run --volume /home/bamboo/xml-data/build-dir/PHPBB3-PR-JOB1:/data --workdir /data --rm -u=991 -t phpbb:php-5.6 /bin/bash -c phpBB/vendor/bin/phpunit --log-junit build/logs/phpunit.xml
bamboo_capability_system_docker_executable=/usr/bin/docker
bamboo_build_commandline_com_atlassian_bamboo_plugins_bamboo_docker_plugin_task_docker_cli_11=/usr/bin/docker run --volume /home/bamboo/xml-data/build-dir/PHPBB3-PR-JOB1:/data --workdir /data/build --rm -u=991 phpbb:php-5.6 ../phpBB/vendor/bin/phing sniff
bamboo_build_commandline_com_atlassian_bamboo_plugins_bamboo_docker_plugin_task_docker_cli_12=/usr/bin/docker run --volume /home/bamboo/xml-data/build-dir/PHPBB3-PR-JOB1:/data --workdir /data/phpBB --rm -e HOME=/home/bamboo -u=991 phpbb:php-5.6 /bin/bash -c php ../composer.phar install --dev; cd ../build; ../phpBB/vendor/bin/phing clean prepare
bamboo_planRepository_branch=3.1.x
bamboo_agentWorkingDirectory=/home/bamboo/xml-data/build-dir
bamboo_jobFailed=true
bamboo_capability_system_git_executable=/usr/bin/git
bamboo_capability_system_builder_phpunit_PHPUnit_3_4=/usr/bin/phpunit
bamboo_repository_git_username=bantu
bamboo_planRepository_1_previousRevision=dc8ff9da28b8ab4ad11c7ea94cca526f17c87fe5
bamboo_repository_75956235_revision_number=dc8ff9da28b8ab4ad11c7ea94cca526f17c87fe5
bamboo_planRepository_branchDisplayName=3.1.x
bamboo_planRepository_1_type=gitv2
bamboo_planRepository_branchName=3.1.x
bamboo_repository_75956235_previous_revision_number=dc8ff9da28b8ab4ad11c7ea94cca526f17c87fe5
bamboo_capability_system_jdk_JDK=/usr/lib/jvm/java-6-sun
bamboo_plan_storageTag=PHPBB3-PR
bamboo_hg_cache_directory=/home/bamboo/xml-data/build-dir/_hg-repositories-cache
bamboo_planRepository_1_username=bantu
bamboo_planRepository_type=gitv2
bamboo_git_cache_directory=/home/bamboo/xml-data/build-dir/_git-repositories-cache
bamboo_ManualBuildTriggerReason_userName=Build Robot
bamboo_repository_git_repositoryUrl=https://github.com/phpbb/phpbb.git
bamboo_repository_75956235_git_branch=3.1.x
bamboo_capability_system_builder_ant_Ant=/usr/share/ant
bamboo_repository_75956235_name=phpBB Ascraeus
bamboo_tmp_directory=/home/bamboo/temp
bamboo_working_directory=/home/bamboo/xml-data/build-dir/PHPBB3-PR-JOB1
bamboo_planKey=PHPBB3-PR
bamboo_capability_local=true
bamboo_planRepository_1_repositoryUrl=https://github.com/phpbb/phpbb.git
bamboo_planRepository_username=bantu
bamboo_capability_system_jdk_JDK_1_6=/usr/lib/jvm/java-6-sun
bamboo_capability_system_jdk_JDK_1_7=/usr/lib/jvm/java-7-openjdk-amd64
bamboo_planRepository_1_branchName=3.1.x
13-Sep-2018 14:53:50 From https://github.com/phpbb/phpbb
13-Sep-2018 14:53:50 * branch            refs/pull/5334/head -> FETCH_HEAD
13-Sep-2018 14:53:50       <testsuite name="phpbb_controller_controller_test" file="/data/tests/controller/controller_test.php" tests="8" assertions="13" failures="0" errors="1" time="0.046334">
13-Sep-2018 14:53:50         <testsuite name="phpbb_controller_helper_route_adm_subdir_test::test_helper_url_force_server_vars" tests="8" assertions="0" failures="0" errors="8" time="0.021106">
13-Sep-2018 14:53:50         <testsuite name="phpbb_controller_helper_route_adm_test::test_helper_url_force_server_vars" tests="8" assertions="0" failures="0" errors="8" time="0.022279">
13-Sep-2018 14:53:50         <testsuite name="phpbb_controller_helper_route_test::test_helper_url_force_server_vars" tests="8" assertions="0" failures="0" errors="8" time="0.023587">
13-Sep-2018 14:53:50         <testsuite name="phpbb_controller_helper_route_slash_test::test_helper_url_force_server_vars" tests="8" assertions="0" failures="0" errors="8" time="0.188925">
13-Sep-2018 14:53:50         <testsuite name="phpbb_controller_helper_route_unclean_path_test::test_helper_url_force_server_vars" tests="8" assertions="0" failures="0" errors="8" time="0.206149">
13-Sep-2018 14:53:50         <testsuite name="phpbb_pagination_pagination_test::test_generate_template_pagination" tests="4" assertions="0" failures="0" errors="4" time="0.011141">
13-Sep-2018 14:53:50         <testsuite name="phpbb_pagination_pagination_test::test_generate_template_pagination_sub" tests="4" assertions="0" failures="0" errors="4" time="0.011098">
13-Sep-2018 14:53:50         <testsuite name="phpbb_pagination_pagination_test::test_generate_template_pagination_double_nested" tests="4" assertions="0" failures="0" errors="4" time="0.012344">
13-Sep-2018 14:53:50         <testsuite name="phpbb_pagination_pagination_test::test_on_page" tests="2" assertions="0" failures="0" errors="2" time="0.005836">
13-Sep-2018 14:53:50         <testsuite name="phpbb_pagination_pagination_test::test_validate_start" tests="7" assertions="0" failures="0" errors="7" time="0.027684">
13-Sep-2018 14:53:50         <testsuite name="phpbb_pagination_pagination_test::test_reverse_start" tests="2" assertions="0" failures="0" errors="2" time="0.007407">
13-Sep-2018 14:53:50         <testsuite name="phpbb_pagination_pagination_test::test_reverse_limit" tests="2" assertions="0" failures="0" errors="2" time="0.006599">
13-Sep-2018 14:53:50   % Total    % Received % Xferd  Average Speed   Time    Time     Time  Current
13-Sep-2018 14:53:50                                  Dload  Upload   Total   Spent    Left  Speed
13-Sep-2018 14:53:50
13-Sep-2018 14:53:50   0     0    0     0    0     0      0      0 --:--:-- --:--:-- --:--:--     0
13-Sep-2018 14:53:51   0     0    0     0    0     0      0      0 --:--:-- --:--:-- --:--:--     0
13-Sep-2018 14:53:51 100   267  100    93  100   174     70    131  0:00:01  0:00:01 --:--:--   131
13-Sep-2018 14:53:51 100   267  100    93  100   174     70    131  0:00:01  0:00:01 --:--:--   131
13-Sep-2018 14:53:51 Finished task 'Set result build status' with result: Success
13-Sep-2018 14:53:51 Running post build plugin 'NCover Results Collector'
13-Sep-2018 14:53:51 Running post build plugin 'Artifact Copier'
13-Sep-2018 14:53:51 Running post build plugin 'npm Cache Cleanup'
13-Sep-2018 14:53:51 Running post build plugin 'Clover Results Collector'
13-Sep-2018 14:53:51 Running post build plugin 'Docker Container Cleanup'
13-Sep-2018 14:53:52 Successfully removed working directory at '/home/bamboo/xml-data/build-dir/PHPBB3-PR-JOB1'
13-Sep-2018 14:53:52 Finalising the build...
13-Sep-2018 14:53:52 Stopping timer.
13-Sep-2018 14:53:52 Build PHPBB3-PR-JOB1-8763 completed.
13-Sep-2018 14:53:52 Running on server: post build plugin 'NCover Results Collector'
13-Sep-2018 14:53:52 Running on server: post build plugin 'Build Hanging Detection Configuration'
13-Sep-2018 14:53:52 Running on server: post build plugin 'Clover Delta Calculator'
13-Sep-2018 14:53:52 Running on server: post build plugin 'Maven Dependencies Postprocessor'
13-Sep-2018 14:53:52 All post build plugins have finished
13-Sep-2018 14:53:52 Generating build results summary...
13-Sep-2018 14:53:57 Saving build results to disk...
13-Sep-2018 14:53:57 Logging substituted variables...
13-Sep-2018 14:53:58 Indexing build results...
13-Sep-2018 14:53:58 Finished building PHPBB3-PR-JOB1-8763.
13-Sep-2018 14:53:58
Substituting variable: ${bamboo.PRnumber} with 5334