Tests pending pull requests

Build: #8764 failed

Job: Build and Test Job failed

Stages & jobs

  1. Build and Test

Build log

The build generated 408 lines of output. Download or view full build log

13-Sep-2018 14:59:48 Build phpBB3 - Pull Requests - Build and Test Job #8764 (PHPBB3-PR-JOB1-8764) started building on agent Default Agent
13-Sep-2018 14:59:48
13-Sep-2018 14:59:48 Build working directory is /home/bamboo/xml-data/build-dir/PHPBB3-PR-JOB1
13-Sep-2018 14:59:48 Executing build phpBB3 - Pull Requests - Build and Test Job #8764 (PHPBB3-PR-JOB1-8764)
13-Sep-2018 14:59:48 Starting task 'Checkout develop branch' of type 'com.atlassian.bamboo.plugins.vcs:task.vcs.checkout'
13-Sep-2018 14:59:48 Build always requires a clean checkout
13-Sep-2018 14:59:48 Cleaning build directory '/home/bamboo/xml-data/build-dir/PHPBB3-PR-JOB1'
13-Sep-2018 14:59:48 Checking out into /home/bamboo/xml-data/build-dir/PHPBB3-PR-JOB1
13-Sep-2018 14:59:48 Updating source code to revision: dc8ff9da28b8ab4ad11c7ea94cca526f17c87fe5
13-Sep-2018 14:59:48 Fetching 'refs/heads/3.1.x' from 'https://github.com/phpbb/phpbb.git'.
13-Sep-2018 14:59:49 Checking out revision dc8ff9da28b8ab4ad11c7ea94cca526f17c87fe5.
13-Sep-2018 14:59:49 Creating local git repository in '/home/bamboo/xml-data/build-dir/PHPBB3-PR-JOB1/.git'.
13-Sep-2018 14:59:49 Cloning into '/home/bamboo/xml-data/build-dir/PHPBB3-PR-JOB1'...
13-Sep-2018 14:59:49 done.
13-Sep-2018 14:59:51 Switched to a new branch '3.1.x'
13-Sep-2018 14:59:51 Branch 3.1.x set up to track remote branch 3.1.x from origin.
13-Sep-2018 14:59:51 Updated source code to revision: dc8ff9da28b8ab4ad11c7ea94cca526f17c87fe5
13-Sep-2018 14:59:51 Finished task 'Checkout develop branch' with result: Success
13-Sep-2018 14:59:51 Running pre-build action: VCS Version Collector
13-Sep-2018 14:59:51
Substituting variable: ${bamboo.PRnumber} with 5351
13-Sep-2018 14:59:51
Substituting variable: ${bamboo.buildResultsUrl} with https://bamboo.phpbb.com/browse/PHPBB3-PR-JOB1-8764
13-Sep-2018 14:59:51 Starting task 'Set pending build status' of type 'com.atlassian.bamboo.plugins.scripttask:task.builder.script'
13-Sep-2018 14:59:51
Beginning to execute external process for build 'phpBB3 - Pull Requests - Build and Test Job #8764 (PHPBB3-PR-JOB1-8764)'
... running command line:
/bin/sh /home/bamboo/temp/PHPBB3-PR-JOB1-8764-ScriptBuildTask-2682076938850240912.sh
... in: /home/bamboo/xml-data/build-dir/PHPBB3-PR-JOB1
... using extra environment variables:
bamboo_planRepository_1_branch=3.1.x
bamboo_planRepository_1_branchDisplayName=3.1.x
bamboo_repository_revision_number=dc8ff9da28b8ab4ad11c7ea94cca526f17c87fe5
bamboo_PRref=master
bamboo_resultsUrl=https://bamboo.phpbb.com/browse/PHPBB3-PR-JOB1-8764
bamboo_capability_system_builder_command_Git=/usr/bin/git
bamboo_repository_75956235_git_username=bantu
bamboo_build_working_directory=/home/bamboo/xml-data/build-dir/PHPBB3-PR-JOB1
bamboo_planRepository_1_name=phpBB Ascraeus
bamboo_buildKey=PHPBB3-PR-JOB1
bamboo_capability_phpbb_tests=true
bamboo_shortPlanName=Pull Requests
bamboo_capability_system_builder_command_fop=/usr/bin/fop
bamboo_capability_dbms_sqlite_2=true
bamboo_planRepository_name=phpBB Ascraeus
bamboo_PRnumber=5351
bamboo_buildNumber=8764
bamboo_repository_75956235_git_repositoryUrl=https://github.com/phpbb/phpbb.git
bamboo_capability_system_builder_phpunit_PHPUnit=/usr/bin/phpunit
bamboo_shortJobName=Build and Test Job
bamboo_buildResultsUrl=https://bamboo.phpbb.com/browse/PHPBB3-PR-JOB1-8764
bamboo_repository_75956235_branch_name=3.1.x
bamboo_planRepository_repositoryUrl=https://github.com/phpbb/phpbb.git
bamboo_agentId=131073
bamboo_planName=phpBB3 - Pull Requests
bamboo_shortPlanKey=PR
bamboo_shortJobKey=JOB1
bamboo_capability_dbms_mysql_55=true
bamboo_capability_system_jdk_JDK_1_7_0_65=/usr/lib/jvm/java-7-openjdk-amd64
bamboo_planRepository_revision=dc8ff9da28b8ab4ad11c7ea94cca526f17c87fe5
bamboo_buildTimeStamp=2018-09-13T14:59:48.149Z
bamboo_repository_previous_revision_number=dc8ff9da28b8ab4ad11c7ea94cca526f17c87fe5
bamboo_capability_system_jdk_JDK_1_6_0_16=/usr/lib/jvm/java-6-sun-1.6.0.16
bamboo_capability_system_builder_mvn2_Maven_2=/usr/share/maven2
bamboo_planRepository_previousRevision=dc8ff9da28b8ab4ad11c7ea94cca526f17c87fe5
bamboo_repository_git_branch=3.1.x
bamboo_buildResultKey=PHPBB3-PR-JOB1-8764
bamboo_repository_branch_name=3.1.x
bamboo_buildPlanName=phpBB3 - Pull Requests - Build and Test Job
bamboo_planRepository_1_revision=dc8ff9da28b8ab4ad11c7ea94cca526f17c87fe5
bamboo_repository_name=phpBB Ascraeus
bamboo_buildFailed=false
bamboo_capability_system_docker_executable=/usr/bin/docker
bamboo_planRepository_branch=3.1.x
bamboo_agentWorkingDirectory=/home/bamboo/xml-data/build-dir
bamboo_capability_system_git_executable=/usr/bin/git
bamboo_capability_system_builder_phpunit_PHPUnit_3_4=/usr/bin/phpunit
bamboo_repository_git_username=bantu
bamboo_planRepository_1_previousRevision=dc8ff9da28b8ab4ad11c7ea94cca526f17c87fe5
bamboo_repository_75956235_revision_number=dc8ff9da28b8ab4ad11c7ea94cca526f17c87fe5
bamboo_planRepository_branchDisplayName=3.1.x
bamboo_planRepository_1_type=gitv2
bamboo_planRepository_branchName=3.1.x
bamboo_repository_75956235_previous_revision_number=dc8ff9da28b8ab4ad11c7ea94cca526f17c87fe5
bamboo_capability_system_jdk_JDK=/usr/lib/jvm/java-6-sun
bamboo_plan_storageTag=PHPBB3-PR
bamboo_hg_cache_directory=/home/bamboo/xml-data/build-dir/_hg-repositories-cache
bamboo_planRepository_1_username=bantu
bamboo_planRepository_type=gitv2
bamboo_git_cache_directory=/home/bamboo/xml-data/build-dir/_git-repositories-cache
bamboo_ManualBuildTriggerReason_userName=Build Robot
bamboo_repository_git_repositoryUrl=https://github.com/phpbb/phpbb.git
bamboo_repository_75956235_git_branch=3.1.x
bamboo_capability_system_builder_ant_Ant=/usr/share/ant
bamboo_repository_75956235_name=phpBB Ascraeus
bamboo_tmp_directory=/home/bamboo/temp
bamboo_working_directory=/home/bamboo/xml-data/build-dir/PHPBB3-PR-JOB1
bamboo_planKey=PHPBB3-PR
bamboo_capability_local=true
bamboo_planRepository_1_repositoryUrl=https://github.com/phpbb/phpbb.git
bamboo_planRepository_username=bantu
bamboo_capability_system_jdk_JDK_1_6=/usr/lib/jvm/java-6-sun
bamboo_capability_system_jdk_JDK_1_7=/usr/lib/jvm/java-7-openjdk-amd64
bamboo_planRepository_1_branchName=3.1.x
13-Sep-2018 14:59:53 From https://github.com/phpbb/phpbb
13-Sep-2018 14:59:53 * branch            refs/pull/5351/head -> FETCH_HEAD
13-Sep-2018 14:59:53   % Total    % Received % Xferd  Average Speed   Time    Time     Time  Current
13-Sep-2018 14:59:53                                  Dload  Upload   Total   Spent    Left  Speed
13-Sep-2018 14:59:53
13-Sep-2018 14:59:54   0     0    0     0    0     0      0      0 --:--:-- --:--:-- --:--:--     0
13-Sep-2018 14:59:54 100   275  100    93  100   182    174    340 --:--:-- --:--:-- --:--:--   340
13-Sep-2018 14:59:54 Finished task 'Set pending build status' with result: Success
13-Sep-2018 14:59:54
Substituting variable: ${bamboo.PRnumber} with 5351
13-Sep-2018 14:59:54 Starting task 'Fetch PR' of type 'com.atlassian.bamboo.plugins.scripttask:task.builder.script'
13-Sep-2018 14:59:54
Beginning to execute external process for build 'phpBB3 - Pull Requests - Build and Test Job #8764 (PHPBB3-PR-JOB1-8764)'
... running command line:
/bin/sh /home/bamboo/temp/PHPBB3-PR-JOB1-8764-ScriptBuildTask-2880875636323329701.sh
... in: /home/bamboo/xml-data/build-dir/PHPBB3-PR-JOB1
... using extra environment variables:
bamboo_planRepository_1_branch=3.1.x
bamboo_planRepository_1_branchDisplayName=3.1.x
bamboo_repository_revision_number=dc8ff9da28b8ab4ad11c7ea94cca526f17c87fe5
bamboo_PRref=master
bamboo_resultsUrl=https://bamboo.phpbb.com/browse/PHPBB3-PR-JOB1-8764
bamboo_capability_system_builder_command_Git=/usr/bin/git
bamboo_repository_75956235_git_username=bantu
bamboo_build_working_directory=/home/bamboo/xml-data/build-dir/PHPBB3-PR-JOB1
bamboo_planRepository_1_name=phpBB Ascraeus
bamboo_buildKey=PHPBB3-PR-JOB1
bamboo_capability_phpbb_tests=true
bamboo_shortPlanName=Pull Requests
bamboo_capability_system_builder_command_fop=/usr/bin/fop
bamboo_capability_dbms_sqlite_2=true
bamboo_planRepository_name=phpBB Ascraeus
bamboo_PRnumber=5351
bamboo_buildNumber=8764
bamboo_repository_75956235_git_repositoryUrl=https://github.com/phpbb/phpbb.git
bamboo_capability_system_builder_phpunit_PHPUnit=/usr/bin/phpunit
bamboo_shortJobName=Build and Test Job
bamboo_buildResultsUrl=https://bamboo.phpbb.com/browse/PHPBB3-PR-JOB1-8764
bamboo_repository_75956235_branch_name=3.1.x
bamboo_planRepository_repositoryUrl=https://github.com/phpbb/phpbb.git
bamboo_agentId=131073
bamboo_planName=phpBB3 - Pull Requests
bamboo_build_commandline_com_atlassian_bamboo_plugins_scripttask_task_builder_script_7=/bin/sh /home/bamboo/temp/PHPBB3-PR-JOB1-8764-ScriptBuildTask-2682076938850240912.sh
bamboo_shortPlanKey=PR
bamboo_shortJobKey=JOB1
bamboo_capability_dbms_mysql_55=true
bamboo_capability_system_jdk_JDK_1_7_0_65=/usr/lib/jvm/java-7-openjdk-amd64
bamboo_planRepository_revision=dc8ff9da28b8ab4ad11c7ea94cca526f17c87fe5
bamboo_buildTimeStamp=2018-09-13T14:59:48.149Z
bamboo_repository_previous_revision_number=dc8ff9da28b8ab4ad11c7ea94cca526f17c87fe5
bamboo_capability_system_jdk_JDK_1_6_0_16=/usr/lib/jvm/java-6-sun-1.6.0.16
bamboo_capability_system_builder_mvn2_Maven_2=/usr/share/maven2
bamboo_planRepository_previousRevision=dc8ff9da28b8ab4ad11c7ea94cca526f17c87fe5
bamboo_repository_git_branch=3.1.x
bamboo_buildResultKey=PHPBB3-PR-JOB1-8764
bamboo_repository_branch_name=3.1.x
bamboo_buildPlanName=phpBB3 - Pull Requests - Build and Test Job
bamboo_planRepository_1_revision=dc8ff9da28b8ab4ad11c7ea94cca526f17c87fe5
bamboo_repository_name=phpBB Ascraeus
bamboo_buildFailed=false
bamboo_capability_system_docker_executable=/usr/bin/docker
bamboo_planRepository_branch=3.1.x
bamboo_agentWorkingDirectory=/home/bamboo/xml-data/build-dir
bamboo_capability_system_git_executable=/usr/bin/git
bamboo_capability_system_builder_phpunit_PHPUnit_3_4=/usr/bin/phpunit
bamboo_repository_git_username=bantu
bamboo_planRepository_1_previousRevision=dc8ff9da28b8ab4ad11c7ea94cca526f17c87fe5
bamboo_repository_75956235_revision_number=dc8ff9da28b8ab4ad11c7ea94cca526f17c87fe5
bamboo_planRepository_branchDisplayName=3.1.x
bamboo_planRepository_1_type=gitv2
bamboo_planRepository_branchName=3.1.x
bamboo_repository_75956235_previous_revision_number=dc8ff9da28b8ab4ad11c7ea94cca526f17c87fe5
bamboo_capability_system_jdk_JDK=/usr/lib/jvm/java-6-sun
bamboo_plan_storageTag=PHPBB3-PR
bamboo_hg_cache_directory=/home/bamboo/xml-data/build-dir/_hg-repositories-cache
bamboo_planRepository_1_username=bantu
bamboo_planRepository_type=gitv2
bamboo_git_cache_directory=/home/bamboo/xml-data/build-dir/_git-repositories-cache
bamboo_ManualBuildTriggerReason_userName=Build Robot
bamboo_repository_git_repositoryUrl=https://github.com/phpbb/phpbb.git
bamboo_repository_75956235_git_branch=3.1.x
bamboo_capability_system_builder_ant_Ant=/usr/share/ant
bamboo_repository_75956235_name=phpBB Ascraeus
bamboo_tmp_directory=/home/bamboo/temp
bamboo_working_directory=/home/bamboo/xml-data/build-dir/PHPBB3-PR-JOB1
bamboo_planKey=PHPBB3-PR
bamboo_capability_local=true
bamboo_planRepository_1_repositoryUrl=https://github.com/phpbb/phpbb.git
bamboo_planRepository_username=bantu
bamboo_capability_system_jdk_JDK_1_6=/usr/lib/jvm/java-6-sun
bamboo_capability_system_jdk_JDK_1_7=/usr/lib/jvm/java-7-openjdk-amd64
bamboo_planRepository_1_branchName=3.1.x
13-Sep-2018 14:59:56 From https://github.com/phpbb/phpbb
13-Sep-2018 14:59:56 * branch            refs/pull/5351/merge -> FETCH_HEAD
13-Sep-2018 14:59:56 Note: checking out 'FETCH_HEAD'.
13-Sep-2018 14:59:56
13-Sep-2018 14:59:56 You are in 'detached HEAD' state. You can look around, make experimental
13-Sep-2018 14:59:56 changes and commit them, and you can discard any commits you make in this
13-Sep-2018 14:59:56 state without impacting any branches by performing another checkout.
13-Sep-2018 14:59:56
13-Sep-2018 14:59:56 If you want to create a new branch to retain commits you create, you may
13-Sep-2018 14:59:56 do so (now or later) by using -b with the checkout command again. Example:
13-Sep-2018 14:59:56
13-Sep-2018 14:59:56   git checkout -b new_branch_name
13-Sep-2018 14:59:56
13-Sep-2018 14:59:56 HEAD is now at db25106... Merge f5bb0fe308293bc90245a41b42087878bcdcf949 into d5c6808db541560884cc04c2dd6f587885d52534
13-Sep-2018 14:59:56 Finished task 'Fetch PR' with result: Success
13-Sep-2018 14:59:56 Skipping execution of task 'Prepare directory' as it is disabled
13-Sep-2018 14:59:56
Substituting variable: ${bamboo.working.directory} with /home/bamboo/xml-data/build-dir/PHPBB3-PR-JOB1
13-Sep-2018 14:59:56 Starting task 'Prepare directory' of type 'com.atlassian.bamboo.plugins.bamboo-docker-plugin:task.docker.cli'
13-Sep-2018 14:59:56 Running image name (phpbb:php-5.6)
13-Sep-2018 14:59:56
Beginning to execute external process for build 'phpBB3 - Pull Requests - Build and Test Job #8764 (PHPBB3-PR-JOB1-8764)'
... running command line:
/usr/bin/docker run --volume /home/bamboo/xml-data/build-dir/PHPBB3-PR-JOB1:/data --workdir /data/phpBB --rm -e HOME=/home/bamboo -u=991 phpbb:php-5.6 /bin/bash -c php ../composer.phar install --dev; cd ../build; ../phpBB/vendor/bin/phing clean prepare
... in: /home/bamboo/xml-data/build-dir/PHPBB3-PR-JOB1
... using extra environment variables:
bamboo_planRepository_1_branch=3.1.x
bamboo_planRepository_1_branchDisplayName=3.1.x
bamboo_repository_revision_number=dc8ff9da28b8ab4ad11c7ea94cca526f17c87fe5
bamboo_PRref=master
bamboo_resultsUrl=https://bamboo.phpbb.com/browse/PHPBB3-PR-JOB1-8764
bamboo_capability_system_builder_command_Git=/usr/bin/git
bamboo_repository_75956235_git_username=bantu
bamboo_build_working_directory=/home/bamboo/xml-data/build-dir/PHPBB3-PR-JOB1
bamboo_planRepository_1_name=phpBB Ascraeus
bamboo_buildKey=PHPBB3-PR-JOB1
bamboo_capability_phpbb_tests=true
bamboo_shortPlanName=Pull Requests
bamboo_capability_system_builder_command_fop=/usr/bin/fop
bamboo_capability_dbms_sqlite_2=true
bamboo_planRepository_name=phpBB Ascraeus
bamboo_PRnumber=5351
bamboo_buildNumber=8764
bamboo_repository_75956235_git_repositoryUrl=https://github.com/phpbb/phpbb.git
bamboo_capability_system_builder_phpunit_PHPUnit=/usr/bin/phpunit
bamboo_shortJobName=Build and Test Job
bamboo_buildResultsUrl=https://bamboo.phpbb.com/browse/PHPBB3-PR-JOB1-8764
bamboo_repository_75956235_branch_name=3.1.x
bamboo_planRepository_repositoryUrl=https://github.com/phpbb/phpbb.git
bamboo_agentId=131073
bamboo_planName=phpBB3 - Pull Requests
bamboo_build_commandline_com_atlassian_bamboo_plugins_scripttask_task_builder_script_7=/bin/sh /home/bamboo/temp/PHPBB3-PR-JOB1-8764-ScriptBuildTask-2682076938850240912.sh
bamboo_shortPlanKey=PR
bamboo_shortJobKey=JOB1
bamboo_capability_dbms_mysql_55=true
bamboo_capability_system_jdk_JDK_1_7_0_65=/usr/lib/jvm/java-7-openjdk-amd64
bamboo_planRepository_revision=dc8ff9da28b8ab4ad11c7ea94cca526f17c87fe5
bamboo_buildTimeStamp=2018-09-13T14:59:48.149Z
bamboo_repository_previous_revision_number=dc8ff9da28b8ab4ad11c7ea94cca526f17c87fe5
bamboo_capability_system_jdk_JDK_1_6_0_16=/usr/lib/jvm/java-6-sun-1.6.0.16
bamboo_capability_system_builder_mvn2_Maven_2=/usr/share/maven2
bamboo_planRepository_previousRevision=dc8ff9da28b8ab4ad11c7ea94cca526f17c87fe5
bamboo_build_commandline_com_atlassian_bamboo_plugins_scripttask_task_builder_script_4=/bin/sh /home/bamboo/temp/PHPBB3-PR-JOB1-8764-ScriptBuildTask-2880875636323329701.sh
bamboo_repository_git_branch=3.1.x
bamboo_buildResultKey=PHPBB3-PR-JOB1-8764
bamboo_repository_branch_name=3.1.x
bamboo_buildPlanName=phpBB3 - Pull Requests - Build and Test Job
bamboo_planRepository_1_revision=dc8ff9da28b8ab4ad11c7ea94cca526f17c87fe5
bamboo_repository_name=phpBB Ascraeus
bamboo_buildFailed=false
bamboo_capability_system_docker_executable=/usr/bin/docker
bamboo_planRepository_branch=3.1.x
bamboo_agentWorkingDirectory=/home/bamboo/xml-data/build-dir
bamboo_capability_system_git_executable=/usr/bin/git
bamboo_capability_system_builder_phpunit_PHPUnit_3_4=/usr/bin/phpunit
bamboo_repository_git_username=bantu
bamboo_planRepository_1_previousRevision=dc8ff9da28b8ab4ad11c7ea94cca526f17c87fe5
bamboo_repository_75956235_revision_number=dc8ff9da28b8ab4ad11c7ea94cca526f17c87fe5
bamboo_planRepository_branchDisplayName=3.1.x
bamboo_planRepository_1_type=gitv2
bamboo_planRepository_branchName=3.1.x
bamboo_repository_75956235_previous_revision_number=dc8ff9da28b8ab4ad11c7ea94cca526f17c87fe5
bamboo_capability_system_jdk_JDK=/usr/lib/jvm/java-6-sun
bamboo_plan_storageTag=PHPBB3-PR
bamboo_hg_cache_directory=/home/bamboo/xml-data/build-dir/_hg-repositories-cache
bamboo_planRepository_1_username=bantu
bamboo_planRepository_type=gitv2
bamboo_git_cache_directory=/home/bamboo/xml-data/build-dir/_git-repositories-cache
bamboo_ManualBuildTriggerReason_userName=Build Robot
bamboo_repository_git_repositoryUrl=https://github.com/phpbb/phpbb.git
bamboo_repository_75956235_git_branch=3.1.x
bamboo_capability_system_builder_ant_Ant=/usr/share/ant
bamboo_repository_75956235_name=phpBB Ascraeus
bamboo_tmp_directory=/home/bamboo/temp
bamboo_working_directory=/home/bamboo/xml-data/build-dir/PHPBB3-PR-JOB1
bamboo_planKey=PHPBB3-PR
bamboo_capability_local=true
bamboo_planRepository_1_repositoryUrl=https://github.com/phpbb/phpbb.git
bamboo_planRepository_username=bantu
bamboo_capability_system_jdk_JDK_1_6=/usr/lib/jvm/java-6-sun
bamboo_capability_system_jdk_JDK_1_7=/usr/lib/jvm/java-7-openjdk-amd64
bamboo_planRepository_1_branchName=3.1.x
13-Sep-2018 14:59:58 Cannot create cache directory /home/bamboo/.composer/cache/repo/https---packagist.org/, or directory is not writable. Proceeding without cache
13-Sep-2018 14:59:58 Cannot create cache directory /home/bamboo/.composer/cache/files/, or directory is not writable. Proceeding without cache
13-Sep-2018 14:59:58 You are using the deprecated option "dev". Dev packages are installed by default now.
13-Sep-2018 14:59:58 Loading composer repositories with package information
13-Sep-2018 14:59:58 Installing dependencies (including require-dev) from lock file
13-Sep-2018 14:59:58 Package operations: 76 installs, 0 updates, 0 removals
13-Sep-2018 14:59:59   - Installing composer/installers (v1.5.0): Downloading (connecting...)Downloading (0%)           Downloading (5%)Downloading (20%)Downloading (40%)Downloading (45%)Downloading (50%)Downloading (65%)Downloading (70%)Downloading (75%)Downloading (90%)Downloading (95%)Downloading (100%)
13-Sep-2018 15:00:00   - Installing bantu/ini-get-wrapper (v1.0.1): Downloading (connecting...)Downloading (100%)         
13-Sep-2018 15:00:01   - Installing symfony/process (v3.4.3): Downloading (connecting...)Downloading (0%)           Downloading (5%)Downloading (30%)Downloading (35%)Downloading (70%)Downloading (75%)Downloading (80%)Downloading (100%)
13-Sep-2018 15:00:03   - Installing symfony/finder (v3.4.3): Downloading (connecting...)Downloading (0%)           Downloading (5%)Downloading (10%)Downloading (60%)Downloading (65%)Downloading (70%)Downloading (75%)Downloading (100%)
13-Sep-2018 15:00:03   - Installing symfony/filesystem (v3.4.3): Downloading (connecting...)Downloading (0%)           Downloading (5%)Downloading (100%)
13-Sep-2018 15:00:04   - Installing symfony/polyfill-mbstring (v1.9.0): Downloading (connecting...)Downloading (0%)           Downloading (30%)Downloading (40%)Downloading (70%)Downloading (85%)Downloading (100%)
13-Sep-2018 15:00:04   - Installing psr/log (1.0.2): Downloading (connecting...)Downloading (0%)           Downloading (15%)Downloading (100%)
13-Sep-2018 15:00:05   - Installing symfony/debug (v3.4.3): Downloading (connecting...)Downloading (100%)         
13-Sep-2018 15:00:06   - Installing symfony/console (v3.4.3): Downloading (connecting...)Downloading (0%)           Downloading (5%)Downloading (10%)Downloading (15%)Downloading (20%)Downloading (25%)Downloading (30%)Downloading (35%)Downloading (40%)Downloading (45%)Downloading (50%)Downloading (55%)Downloading (60%)Downloading (65%)Downloading (70%)Downloading (75%)Downloading (80%)Downloading (85%)Downloading (90%)Downloading (95%)Downloading (100%)
13-Sep-2018 15:00:09   - Installing seld/phar-utils (1.0.1): Downloading (connecting...)Downloading (0%)           Downloading (30%)Downloading (60%)Downloading (100%)
13-Sep-2018 15:00:09   - Installing seld/jsonlint (1.7.0): Downloading (connecting...)Downloading (100%)         
13-Sep-2018 15:00:10   - Installing seld/cli-prompt (1.0.3): Downloading (connecting...)Downloading (100%)         
13-Sep-2018 15:00:10   - Installing justinrainbow/json-schema (5.2.6): Downloading (connecting...)Downloading (0%)           Downloading (25%)Downloading (40%)Downloading (45%)Downloading (70%)Downloading (75%)Downloading (90%)Downloading (95%)Downloading (100%)
13-Sep-2018 15:00:11   - Installing composer/spdx-licenses (1.2.0): Downloading (connecting...)Downloading (100%)         
13-Sep-2018 15:00:11   - Installing composer/semver (1.4.2): Downloading (connecting...)Downloading (0%)           Downloading (35%)Downloading (75%)Downloading (100%)
13-Sep-2018 15:00:13   - Installing composer/ca-bundle (1.1.0): Downloading (connecting...)Downloading (0%)           Downloading (5%)Downloading (10%)Downloading (15%)Downloading (20%)Downloading (25%)Downloading (30%)Downloading (35%)Downloading (40%)Downloading (45%)Downloading (50%)Downloading (55%)Downloading (60%)Downloading (65%)Downloading (70%)Downloading (75%)Downloading (80%)Downloading (85%)Downloading (90%)Downloading (95%)Downloading (100%)
13-Sep-2018 15:00:14   - Installing composer/composer (1.6.2): Downloading (connecting...)Downloading (100%)         
13-Sep-2018 15:00:15   - Installing google/recaptcha (1.1.3): Downloading (connecting...)Downloading (100%)         
13-Sep-2018 15:00:15   - Installing guzzlehttp/promises (v1.3.1): Downloading (connecting...)Downloading (0%)           Downloading (30%)Downloading (60%)Downloading (80%)Downloading (100%)
13-Sep-2018 15:00:16   - Installing psr/http-message (1.0.1): Downloading (connecting...)Downloading (0%)           Downloading (100%)
13-Sep-2018 15:00:17   - Installing guzzlehttp/psr7 (1.4.2): Downloading (connecting...)Downloading (0%)           Downloading (5%)Downloading (10%)Downloading (15%)Downloading (35%)Downloading (40%)Downloading (45%)Downloading (50%)Downloading (55%)Downloading (60%)Downloading (65%)Downloading (85%)Downloading (90%)Downloading (95%)Downloading (100%)
13-Sep-2018 15:00:18   - Installing lusitanian/oauth (v0.8.11): Downloading (connecting...)Downloading (0%)           Downloading (5%)Downloading (10%)Downloading (15%)Downloading (20%)Downloading (30%)Downloading (35%)Downloading (45%)Downloading (50%)Downloading (55%)Downloading (60%)Downloading (65%)Downloading (70%)Downloading (75%)Downloading (85%)Downloading (90%)Downloading (100%)
13-Sep-2018 15:00:18   - Installing marc1706/fast-image-size (v1.1.4): Downloading (connecting...)Downloading (100%)         
13-Sep-2018 15:00:19   - Installing patchwork/utf8 (v1.3.1): Downloading (connecting...)Downloading (100%)         
13-Sep-2018 15:00:20   - Installing psr/container (1.0.0): Downloading (connecting...)Downloading (0%)           Downloading (75%)Downloading (100%)
13-Sep-2018 15:00:20   - Installing s9e/text-formatter (0.13.1): Downloading (connecting...)Downloading (100%)         
13-Sep-2018 15:00:21   - Installing symfony/config (v3.4.3): Downloading (connecting...)Downloading (100%)         
13-Sep-2018 15:00:22   - Installing paragonie/random_compat (v1.4.3): Downloading (connecting...)Downloading (0%)           Downloading (10%)Downloading (35%)Downloading (45%)Downloading (55%)Downloading (80%)Downloading (90%)Downloading (100%)
13-Sep-2018 15:00:22   - Installing symfony/polyfill-php70 (v1.6.0): Downloading (connecting...)Downloading (100%)         
13-Sep-2018 15:00:23   - Installing symfony/http-foundation (v3.4.3): Downloading (connecting...)Downloading (100%)         
13-Sep-2018 15:00:24   - Installing symfony/event-dispatcher (v3.4.3): Downloading (connecting...)Downloading (0%)           Downloading (5%)Downloading (90%)Downloading (95%)Downloading (100%)
13-Sep-2018 15:00:24   - Installing symfony/http-kernel (v3.4.3): Downloading (connecting...)Downloading (100%)         
13-Sep-2018 15:00:25   - Installing symfony/dependency-injection (v3.4.3): Downloading (connecting...)Downloading (100%)         
13-Sep-2018 15:00:26   - Installing zendframework/zend-eventmanager (3.2.0): Downloading (connecting...)Downloading (0%)           Downloading (25%)Downloading (35%)Downloading (50%)Downloading (70%)Downloading (95%)Downloading (100%)
13-Sep-2018 15:00:27   - Installing zendframework/zend-code (2.6.3): Downloading (connecting...)Downloading (0%)           Downloading (5%)Downloading (10%)Downloading (15%)Downloading (20%)Downloading (25%)Downloading (30%)Downloading (35%)Downloading (40%)Downloading (45%)Downloading (50%)Downloading (55%)Downloading (60%)Downloading (65%)Downloading (70%)Downloading (75%)Downloading (80%)Downloading (85%)Downloading (90%)Downloading (95%)Downloading (100%)
13-Sep-2018 15:00:28   - Installing ocramius/proxy-manager (1.0.2): Downloading (connecting...)Downloading (0%)           Downloading (5%)Downloading (10%)Downloading (15%)Downloading (20%)Downloading (25%)Downloading (30%)Downloading (35%)Downloading (40%)Downloading (45%)Downloading (50%)Downloading (55%)Downloading (60%)Downloading (65%)Downloading (70%)Downloading (75%)Downloading (80%)Downloading (85%)Downloading (90%)Downloading (95%)Downloading (100%)
13-Sep-2018 15:00:28   - Installing symfony/proxy-manager-bridge (v3.4.3): Downloading (connecting...)Downloading (0%)           Downloading (75%)Downloading (100%)
13-Sep-2018 15:00:29   - Installing symfony/routing (v3.4.3): Downloading (connecting...)Downloading (100%)         
13-Sep-2018 15:00:29   - Installing symfony/polyfill-ctype (v1.9.0): Downloading (connecting...)Downloading (0%)           Downloading (100%)
13-Sep-2018 15:00:33   - Installing twig/twig (v1.35.4): Downloading (connecting...)Downloading (0%)           Downloading (5%)Downloading (10%)Downloading (15%)Downloading (20%)Downloading (25%)Downloading (30%)Downloading (35%)Downloading (40%)Downloading (45%)Downloading (50%)Downloading (55%)Downloading (60%)Downloading (65%)Downloading (70%)Downloading (75%)Downloading (80%)Downloading (85%)Downloading (90%)Downloading (95%)Downloading (100%)
13-Sep-2018 15:00:34   - Installing symfony/twig-bridge (v3.4.3): Downloading (connecting...)Downloading (100%)         
13-Sep-2018 15:00:35   - Installing symfony/dom-crawler (v3.4.3): Downloading (connecting...)Downloading (100%)         
13-Sep-2018 15:00:35   - Installing symfony/css-selector (v3.4.3): Downloading (connecting...)Downloading (0%)           Downloading (5%)Downloading (10%)Downloading (70%)Downloading (75%)Downloading (100%)
13-Sep-2018 15:00:36   - Installing symfony/browser-kit (v3.4.3): Downloading (connecting...)Downloading (100%)         
13-Sep-2018 15:00:36   - Installing guzzlehttp/guzzle (6.3.0): Downloading (connecting...)Downloading (0%)           Downloading (5%)Downloading (10%)Downloading (20%)Downloading (25%)Downloading (35%)Downloading (40%)Downloading (45%)Downloading (50%)Downloading (55%)Downloading (60%)Downloading (65%)Downloading (75%)Downloading (80%)Downloading (90%)Downloading (95%)Downloading (100%)
13-Sep-2018 15:00:37   - Installing fabpot/goutte (v3.2.2): Downloading (connecting...)Downloading (0%)           Downloading (55%)Downloading (100%)
13-Sep-2018 15:00:37   - Installing facebook/webdriver (1.5.0): Downloading (connecting...)Downloading (0%)           Downloading (5%)Downloading (10%)Downloading (15%)Downloading (20%)Downloading (25%)Downloading (30%)Downloading (35%)Downloading (40%)Downloading (45%)Downloading (50%)Downloading (55%)Downloading (60%)Downloading (65%)Downloading (70%)Downloading (75%)Downloading (80%)Downloading (85%)Downloading (90%)Downloading (95%)Downloading (100%)
13-Sep-2018 15:00:38   - Installing symfony/yaml (v3.4.3): Downloading (connecting...)Downloading (100%)         
13-Sep-2018 15:00:39   - Installing laravel/homestead (v7.7.0): Downloading (connecting...)Downloading (0%)           Downloading (5%)Downloading (10%)Downloading (50%)Downloading (80%)Downloading (100%)
13-Sep-2018 15:00:41   - Installing phing/phing (2.4.14): Downloading (connecting...)Downloading (100%)         
13-Sep-2018 15:00:42   - Installing webmozart/assert (1.2.0): Downloading (connecting...)Downloading (0%)           Downloading (55%)Downloading (60%)Downloading (100%)
13-Sep-2018 15:00:43   - Installing phpdocumentor/reflection-common (1.0.1): Downloading (connecting...)Downloading (0%)           Downloading (100%)
13-Sep-2018 15:00:43   - Installing phpdocumentor/type-resolver (0.4.0): Downloading (connecting...)Downloading (0%)           Downloading (5%)Downloading (35%)Downloading (40%)Downloading (45%)Downloading (50%)Downloading (80%)Downloading (85%)Downloading (90%)Downloading (100%)
13-Sep-2018 15:00:44   - Installing phpdocumentor/reflection-docblock (3.3.2): Downloading (connecting...)Downloading (0%)           Downloading (5%)Downloading (10%)Downloading (15%)Downloading (30%)Downloading (50%)Downloading (55%)Downloading (70%)Downloading (75%)Downloading (80%)Downloading (85%)Downloading (90%)Downloading (95%)Downloading (100%)
13-Sep-2018 15:00:44   - Installing sebastian/version (2.0.1): Downloading (connecting...)Downloading (0%)           Downloading (100%)
13-Sep-2018 15:00:44   - Installing sebastian/resource-operations (1.0.0): Downloading (connecting...)Downloading (0%)           Downloading (65%)Downloading (100%)
13-Sep-2018 15:00:45   - Installing sebastian/recursion-context (2.0.0): Downloading (connecting...)Downloading (0%)           Downloading (100%)
13-Sep-2018 15:00:46   - Installing sebastian/object-enumerator (2.0.1): Downloading (connecting...)Downloading (0%)           Downloading (100%)
13-Sep-2018 15:00:46   - Installing sebastian/global-state (1.1.1): Downloading (connecting...)Downloading (0%)           Downloading (40%)Downloading (85%)Downloading (100%)
13-Sep-2018 15:00:47   - Installing sebastian/exporter (2.0.0): Downloading (connecting...)Downloading (0%)           Downloading (100%)
13-Sep-2018 15:00:47   - Installing sebastian/environment (2.0.0): Downloading (connecting...)Downloading (0%)           Downloading (15%)Downloading (30%)Downloading (45%)Downloading (60%)Downloading (75%)Downloading (90%)Downloading (100%)
13-Sep-2018 15:00:48   - Installing sebastian/diff (1.4.3): Downloading (connecting...)Downloading (0%)           Downloading (35%)Downloading (40%)Downloading (75%)Downloading (100%)
13-Sep-2018 15:00:48   - Installing sebastian/comparator (1.2.4): Downloading (connecting...)Downloading (0%)           Downloading (10%)Downloading (45%)Downloading (55%)Downloading (65%)Downloading (70%)Downloading (100%)
13-Sep-2018 15:00:49   - Installing phpunit/php-text-template (1.2.1): Downloading (connecting...)Downloading (0%)           Downloading (35%)Downloading (100%)
13-Sep-2018 15:00:49   - Installing doctrine/instantiator (1.0.5): Downloading (connecting...)Downloading (0%)           Downloading (15%)Downloading (30%)Downloading (45%)Downloading (60%)Downloading (85%)Downloading (100%)
13-Sep-2018 15:00:50   - Installing phpunit/phpunit-mock-objects (3.4.4): Downloading (connecting...)Downloading (0%)           Downloading (5%)Downloading (10%)Downloading (15%)Downloading (20%)Downloading (30%)Downloading (35%)Downloading (40%)Downloading (45%)Downloading (50%)Downloading (55%)Downloading (60%)Downloading (65%)Downloading (70%)Downloading (80%)Downloading (85%)Downloading (90%)Downloading (95%)Downloading (100%)
13-Sep-2018 15:00:51   - Installing phpunit/php-timer (1.0.9): Downloading (connecting...)Downloading (0%)           Downloading (45%)Downloading (90%)Downloading (100%)
13-Sep-2018 15:00:51   - Installing phpunit/php-file-iterator (1.4.5): Downloading (connecting...)Downloading (0%)           Downloading (100%)
13-Sep-2018 15:00:51   - Installing sebastian/code-unit-reverse-lookup (1.0.1): Downloading (connecting...)Downloading (0%)           Downloading (55%)Downloading (100%)
13-Sep-2018 15:00:52   - Installing phpunit/php-token-stream (1.4.12): Downloading (connecting...)Downloading (0%)           Downloading (5%)Downloading (10%)Downloading (15%)Downloading (20%)Downloading (65%)Downloading (70%)Downloading (75%)Downloading (80%)Downloading (85%)Downloading (90%)Downloading (100%)
13-Sep-2018 15:00:52   - Installing phpunit/php-code-coverage (4.0.8): Downloading (connecting...)Downloading (0%)           Downloading (5%)Downloading (10%)Downloading (15%)Downloading (20%)Downloading (25%)Downloading (30%)Downloading (35%)Downloading (40%)Downloading (45%)Downloading (50%)Downloading (55%)Downloading (60%)Downloading (65%)Downloading (70%)Downloading (75%)Downloading (80%)Downloading (85%)Downloading (90%)Downloading (95%)Downloading (100%)
13-Sep-2018 15:00:53   - Installing phpspec/prophecy (1.8.0): Downloading (connecting...)Downloading (0%)           Downloading (15%)Downloading (25%)Downloading (35%)Downloading (40%)Downloading (50%)Downloading (60%)Downloading (70%)Downloading (80%)Downloading (90%)Downloading (100%)
13-Sep-2018 15:00:55   - Installing myclabs/deep-copy (1.7.0): Downloading (connecting...)Downloading (0%)           Downloading (15%)Downloading (20%)Downloading (35%)Downloading (40%)Downloading (55%)Downloading (60%)Downloading (75%)Downloading (90%)Downloading (95%)Downloading (100%)
13-Sep-2018 15:00:55   - Installing phpunit/phpunit (5.7.26): Downloading (connecting...)Downloading (100%)         
13-Sep-2018 15:00:56   - Installing phpunit/dbunit (2.0.3): Downloading (connecting...)Downloading (100%)         
13-Sep-2018 15:00:59   - Installing squizlabs/php_codesniffer (2.9.1): Downloading (connecting...)Downloading (0%)           Downloading (5%)Downloading (10%)Downloading (15%)Downloading (20%)Downloading (25%)Downloading (30%)Downloading (35%)Downloading (40%)Downloading (45%)Downloading (50%)Downloading (55%)Downloading (60%)Downloading (65%)Downloading (70%)Downloading (75%)Downloading (80%)Downloading (85%)Downloading (90%)Downloading (95%)Downloading (100%)
13-Sep-2018 15:00:59 symfony/console suggests installing symfony/lock ()
13-Sep-2018 15:00:59 lusitanian/oauth suggests installing predis/predis (Allows using the Redis storage backend.)
13-Sep-2018 15:00:59 patchwork/utf8 suggests installing ext-intl (Use Intl for best performance)
13-Sep-2018 15:00:59 patchwork/utf8 suggests installing ext-wfio (Use WFIO for UTF-8 filesystem access on Windows)
13-Sep-2018 15:00:59 s9e/text-formatter suggests installing ext-intl (Allows international URLs to be accepted by the URL filter)
13-Sep-2018 15:00:59 s9e/text-formatter suggests installing ext-xsl (Enables the XSLT renderer)
13-Sep-2018 15:00:59 paragonie/random_compat suggests installing ext-libsodium (Provides a modern crypto API that can be used to generate random bytes.)
13-Sep-2018 15:00:59 symfony/http-kernel suggests installing symfony/var-dumper ()
13-Sep-2018 15:00:59 symfony/dependency-injection suggests installing symfony/expression-language (For using expressions in service container configuration)
13-Sep-2018 15:00:59 zendframework/zend-eventmanager suggests installing container-interop/container-interop (^1.1.0, to use the lazy listeners feature)
13-Sep-2018 15:00:59 zendframework/zend-eventmanager suggests installing zendframework/zend-stdlib (^2.7.3 || ^3.0, to use the FilterChain feature)
13-Sep-2018 15:00:59 zendframework/zend-code suggests installing doctrine/annotations (Doctrine\Common\Annotations >=1.0 for annotation features)
13-Sep-2018 15:00:59 zendframework/zend-code suggests installing zendframework/zend-stdlib (Zend\Stdlib component)
13-Sep-2018 15:00:59 ocramius/proxy-manager suggests installing ocramius/generated-hydrator (To have very fast object to array to object conversion for ghost objects)
13-Sep-2018 15:00:59 ocramius/proxy-manager suggests installing zendframework/zend-json (To have the JsonRpc adapter (Remote Object feature))
13-Sep-2018 15:00:59 ocramius/proxy-manager suggests installing zendframework/zend-soap (To have the Soap adapter (Remote Object feature))
13-Sep-2018 15:00:59 ocramius/proxy-manager suggests installing zendframework/zend-stdlib (To use the hydrator proxy)
13-Sep-2018 15:00:59 ocramius/proxy-manager suggests installing zendframework/zend-xmlrpc (To have the XmlRpc adapter (Remote Object feature))
13-Sep-2018 15:00:59 symfony/routing suggests installing doctrine/annotations (For using the annotation loader)
13-Sep-2018 15:00:59 symfony/routing suggests installing symfony/expression-language (For using expression matching)
13-Sep-2018 15:00:59 symfony/twig-bridge suggests installing symfony/asset (For using the AssetExtension)
13-Sep-2018 15:00:59 symfony/twig-bridge suggests installing symfony/expression-language (For using the ExpressionExtension)
13-Sep-2018 15:00:59 symfony/twig-bridge suggests installing symfony/form (For using the FormExtension)
13-Sep-2018 15:00:59 symfony/twig-bridge suggests installing symfony/security (For using the SecurityExtension)
13-Sep-2018 15:00:59 symfony/twig-bridge suggests installing symfony/stopwatch (For using the StopwatchExtension)
13-Sep-2018 15:00:59 symfony/twig-bridge suggests installing symfony/templating (For using the TwigEngine)
13-Sep-2018 15:00:59 symfony/twig-bridge suggests installing symfony/translation (For using the TranslationExtension)
13-Sep-2018 15:00:59 symfony/twig-bridge suggests installing symfony/var-dumper (For using the DumpExtension)
13-Sep-2018 15:00:59 symfony/twig-bridge suggests installing symfony/web-link (For using the WebLinkExtension)
13-Sep-2018 15:00:59 sebastian/global-state suggests installing ext-uopz (*)
13-Sep-2018 15:00:59 phpunit/phpunit-mock-objects suggests installing ext-soap (*)
13-Sep-2018 15:00:59 phpunit/phpunit suggests installing phpunit/php-invoker (~1.1)
13-Sep-2018 15:00:59 Generating autoload files
13-Sep-2018 15:01:00 Buildfile: /data/build/build.xml
13-Sep-2018 15:01:00
13-Sep-2018 15:01:00 phpBB > clean:
13-Sep-2018 15:01:00
13-Sep-2018 15:01:00    [delete] Directory /data/build/logs does not exist or is not a directory.
13-Sep-2018 15:01:00    [delete] Directory /data/build/api does not exist or is not a directory.
13-Sep-2018 15:01:00    [delete] Directory /data/build/codebrowser does not exist or is not a directory.
13-Sep-2018 15:01:00    [delete] Directory /data/build/coverage does not exist or is not a directory.
13-Sep-2018 15:01:00    [delete] Directory /data/build/cpd does not exist or is not a directory.
13-Sep-2018 15:01:00    [delete] Directory /data/build/dependencies does not exist or is not a directory.
13-Sep-2018 15:01:00    [delete] Directory /data/build/new_version does not exist or is not a directory.
13-Sep-2018 15:01:00    [delete] Directory /data/build/old_versions does not exist or is not a directory.
13-Sep-2018 15:01:00    [delete] Directory /data/build/save does not exist or is not a directory.
13-Sep-2018 15:01:00
13-Sep-2018 15:01:00 phpBB > prepare:
13-Sep-2018 15:01:00
13-Sep-2018 15:01:00     [mkdir] Created dir: /data/build/logs
13-Sep-2018 15:01:00     [mkdir] Created dir: /data/build/api
13-Sep-2018 15:01:00     [mkdir] Created dir: /data/build/codebrowser
13-Sep-2018 15:01:00     [mkdir] Created dir: /data/build/coverage
13-Sep-2018 15:01:00     [mkdir] Created dir: /data/build/cpd
13-Sep-2018 15:01:00     [mkdir] Created dir: /data/build/dependencies
13-Sep-2018 15:01:00     [mkdir] Created dir: /data/build/new_version
13-Sep-2018 15:01:00     [mkdir] Created dir: /data/build/new_version/files
13-Sep-2018 15:01:00     [mkdir] Created dir: /data/build/new_version/patches
13-Sep-2018 15:01:00     [mkdir] Created dir: /data/build/new_version/release_files
13-Sep-2018 15:01:00     [mkdir] Created dir: /data/build/new_version/update
13-Sep-2018 15:01:00     [mkdir] Created dir: /data/build/old_versions
13-Sep-2018 15:01:00     [mkdir] Created dir: /data/build/save
13-Sep-2018 15:01:00
13-Sep-2018 15:01:00 BUILD FINISHED
13-Sep-2018 15:01:00
13-Sep-2018 15:01:00 Total time: 0.1154 seconds
13-Sep-2018 15:01:00
13-Sep-2018 15:01:01 Finished task 'Prepare directory' with result: Success
13-Sep-2018 15:01:01 Skipping execution of task 'Run sniffs' as it is disabled
13-Sep-2018 15:01:01
Substituting variable: ${bamboo.working.directory} with /home/bamboo/xml-data/build-dir/PHPBB3-PR-JOB1
13-Sep-2018 15:01:01 Starting task 'Run sniffs' of type 'com.atlassian.bamboo.plugins.bamboo-docker-plugin:task.docker.cli'
13-Sep-2018 15:01:01 Running image name (phpbb:php-5.6)
13-Sep-2018 15:01:01
Beginning to execute external process for build 'phpBB3 - Pull Requests - Build and Test Job #8764 (PHPBB3-PR-JOB1-8764)'
... running command line:
/usr/bin/docker run --volume /home/bamboo/xml-data/build-dir/PHPBB3-PR-JOB1:/data --workdir /data/build --rm -u=991 phpbb:php-5.6 ../phpBB/vendor/bin/phing sniff
... in: /home/bamboo/xml-data/build-dir/PHPBB3-PR-JOB1
... using extra environment variables:
bamboo_planRepository_1_branch=3.1.x
bamboo_planRepository_1_branchDisplayName=3.1.x
bamboo_repository_revision_number=dc8ff9da28b8ab4ad11c7ea94cca526f17c87fe5
bamboo_PRref=master
bamboo_resultsUrl=https://bamboo.phpbb.com/browse/PHPBB3-PR-JOB1-8764
bamboo_capability_system_builder_command_Git=/usr/bin/git
bamboo_repository_75956235_git_username=bantu
bamboo_build_working_directory=/home/bamboo/xml-data/build-dir/PHPBB3-PR-JOB1
bamboo_planRepository_1_name=phpBB Ascraeus
bamboo_buildKey=PHPBB3-PR-JOB1
bamboo_capability_phpbb_tests=true
bamboo_shortPlanName=Pull Requests
bamboo_capability_system_builder_command_fop=/usr/bin/fop
bamboo_capability_dbms_sqlite_2=true
bamboo_planRepository_name=phpBB Ascraeus
bamboo_PRnumber=5351
bamboo_buildNumber=8764
bamboo_repository_75956235_git_repositoryUrl=https://github.com/phpbb/phpbb.git
bamboo_capability_system_builder_phpunit_PHPUnit=/usr/bin/phpunit
bamboo_shortJobName=Build and Test Job
bamboo_buildResultsUrl=https://bamboo.phpbb.com/browse/PHPBB3-PR-JOB1-8764
bamboo_repository_75956235_branch_name=3.1.x
bamboo_planRepository_repositoryUrl=https://github.com/phpbb/phpbb.git
bamboo_agentId=131073
bamboo_planName=phpBB3 - Pull Requests
bamboo_build_commandline_com_atlassian_bamboo_plugins_scripttask_task_builder_script_7=/bin/sh /home/bamboo/temp/PHPBB3-PR-JOB1-8764-ScriptBuildTask-2682076938850240912.sh
bamboo_shortPlanKey=PR
bamboo_shortJobKey=JOB1
bamboo_capability_dbms_mysql_55=true
bamboo_capability_system_jdk_JDK_1_7_0_65=/usr/lib/jvm/java-7-openjdk-amd64
bamboo_planRepository_revision=dc8ff9da28b8ab4ad11c7ea94cca526f17c87fe5
bamboo_buildTimeStamp=2018-09-13T14:59:48.149Z
bamboo_repository_previous_revision_number=dc8ff9da28b8ab4ad11c7ea94cca526f17c87fe5
bamboo_capability_system_jdk_JDK_1_6_0_16=/usr/lib/jvm/java-6-sun-1.6.0.16
bamboo_capability_system_builder_mvn2_Maven_2=/usr/share/maven2
bamboo_planRepository_previousRevision=dc8ff9da28b8ab4ad11c7ea94cca526f17c87fe5
bamboo_build_commandline_com_atlassian_bamboo_plugins_scripttask_task_builder_script_4=/bin/sh /home/bamboo/temp/PHPBB3-PR-JOB1-8764-ScriptBuildTask-2880875636323329701.sh
bamboo_repository_git_branch=3.1.x
bamboo_buildResultKey=PHPBB3-PR-JOB1-8764
bamboo_repository_branch_name=3.1.x
bamboo_buildPlanName=phpBB3 - Pull Requests - Build and Test Job
bamboo_planRepository_1_revision=dc8ff9da28b8ab4ad11c7ea94cca526f17c87fe5
bamboo_repository_name=phpBB Ascraeus
bamboo_buildFailed=false
bamboo_capability_system_docker_executable=/usr/bin/docker
bamboo_build_commandline_com_atlassian_bamboo_plugins_bamboo_docker_plugin_task_docker_cli_12=/usr/bin/docker run --volume /home/bamboo/xml-data/build-dir/PHPBB3-PR-JOB1:/data --workdir /data/phpBB --rm -e HOME=/home/bamboo -u=991 phpbb:php-5.6 /bin/bash -c php ../composer.phar install --dev; cd ../build; ../phpBB/vendor/bin/phing clean prepare
bamboo_planRepository_branch=3.1.x
bamboo_agentWorkingDirectory=/home/bamboo/xml-data/build-dir
bamboo_capability_system_git_executable=/usr/bin/git
bamboo_capability_system_builder_phpunit_PHPUnit_3_4=/usr/bin/phpunit
bamboo_repository_git_username=bantu
bamboo_planRepository_1_previousRevision=dc8ff9da28b8ab4ad11c7ea94cca526f17c87fe5
bamboo_repository_75956235_revision_number=dc8ff9da28b8ab4ad11c7ea94cca526f17c87fe5
bamboo_planRepository_branchDisplayName=3.1.x
bamboo_planRepository_1_type=gitv2
bamboo_planRepository_branchName=3.1.x
bamboo_repository_75956235_previous_revision_number=dc8ff9da28b8ab4ad11c7ea94cca526f17c87fe5
bamboo_capability_system_jdk_JDK=/usr/lib/jvm/java-6-sun
bamboo_plan_storageTag=PHPBB3-PR
bamboo_hg_cache_directory=/home/bamboo/xml-data/build-dir/_hg-repositories-cache
bamboo_planRepository_1_username=bantu
bamboo_planRepository_type=gitv2
bamboo_git_cache_directory=/home/bamboo/xml-data/build-dir/_git-repositories-cache
bamboo_ManualBuildTriggerReason_userName=Build Robot
bamboo_repository_git_repositoryUrl=https://github.com/phpbb/phpbb.git
bamboo_repository_75956235_git_branch=3.1.x
bamboo_capability_system_builder_ant_Ant=/usr/share/ant
bamboo_repository_75956235_name=phpBB Ascraeus
bamboo_tmp_directory=/home/bamboo/temp
bamboo_working_directory=/home/bamboo/xml-data/build-dir/PHPBB3-PR-JOB1
bamboo_planKey=PHPBB3-PR
bamboo_capability_local=true
bamboo_planRepository_1_repositoryUrl=https://github.com/phpbb/phpbb.git
bamboo_planRepository_username=bantu
bamboo_capability_system_jdk_JDK_1_6=/usr/lib/jvm/java-6-sun
bamboo_capability_system_jdk_JDK_1_7=/usr/lib/jvm/java-7-openjdk-amd64
bamboo_planRepository_1_branchName=3.1.x
13-Sep-2018 15:01:01 Buildfile: /data/build/build.xml
13-Sep-2018 15:01:01
13-Sep-2018 15:01:01 phpBB > sniff:
13-Sep-2018 15:01:01
13-Sep-2018 15:01:09 ............................................................  60 / 759 (8%)
13-Sep-2018 15:01:10 ............................................................ 120 / 759 (16%)
13-Sep-2018 15:01:11 ............................................................ 180 / 759 (24%)
13-Sep-2018 15:01:12 ............................................................ 240 / 759 (32%)
13-Sep-2018 15:01:14 ............................................................ 300 / 759 (40%)
13-Sep-2018 15:01:20 ............................................................ 360 / 759 (47%)
13-Sep-2018 15:01:26 ............................................................ 420 / 759 (55%)
13-Sep-2018 15:01:30 ............................................................ 480 / 759 (63%)
13-Sep-2018 15:01:33 ............................................................ 540 / 759 (71%)
13-Sep-2018 15:01:37 ............................................................ 600 / 759 (79%)
13-Sep-2018 15:01:42 ...................................................E........ 660 / 759 (87%)
13-Sep-2018 15:01:45 ............................................................ 720 / 759 (95%)
13-Sep-2018 15:01:47 .......................................
13-Sep-2018 15:01:47
13-Sep-2018 15:01:47
13-Sep-2018 15:01:47 FILE: /data/phpBB/phpbb/privatemessage/view.php
13-Sep-2018 15:01:47 ----------------------------------------------------------------------
13-Sep-2018 15:01:47 FOUND 16 ERRORS AFFECTING 16 LINES
13-Sep-2018 15:01:47 ----------------------------------------------------------------------
13-Sep-2018 15:01:47 210 | ERROR | [x] Whitespace found at end of line
13-Sep-2018 15:01:47      |       |     (Squiz.WhiteSpace.SuperfluousWhitespace.EndLine)
13-Sep-2018 15:01:47 218 | ERROR | [x] Whitespace found at end of line
13-Sep-2018 15:01:47      |       |     (Squiz.WhiteSpace.SuperfluousWhitespace.EndLine)
13-Sep-2018 15:01:47 226 | ERROR | [x] Whitespace found at end of line
13-Sep-2018 15:01:47      |       |     (Squiz.WhiteSpace.SuperfluousWhitespace.EndLine)
13-Sep-2018 15:01:47 229 | ERROR | [x] Whitespace found at end of line
13-Sep-2018 15:01:47      |       |     (Squiz.WhiteSpace.SuperfluousWhitespace.EndLine)
13-Sep-2018 15:01:47 236 | ERROR | [x] Whitespace found at end of line
13-Sep-2018 15:01:47      |       |     (Squiz.WhiteSpace.SuperfluousWhitespace.EndLine)
13-Sep-2018 15:01:47 242 | ERROR | [x] Whitespace found at end of line
13-Sep-2018 15:01:47      |       |     (Squiz.WhiteSpace.SuperfluousWhitespace.EndLine)
13-Sep-2018 15:01:47 245 | ERROR | [x] Whitespace found at end of line
13-Sep-2018 15:01:47      |       |     (Squiz.WhiteSpace.SuperfluousWhitespace.EndLine)
13-Sep-2018 15:01:47 251 | ERROR | [x] Whitespace found at end of line
13-Sep-2018 15:01:47      |       |     (Squiz.WhiteSpace.SuperfluousWhitespace.EndLine)
13-Sep-2018 15:01:47 257 | ERROR | [x] Whitespace found at end of line
13-Sep-2018 15:01:47      |       |     (Squiz.WhiteSpace.SuperfluousWhitespace.EndLine)
13-Sep-2018 15:01:47 267 | ERROR | [x] Whitespace found at end of line
13-Sep-2018 15:01:47      |       |     (Squiz.WhiteSpace.SuperfluousWhitespace.EndLine)
13-Sep-2018 15:01:47 273 | ERROR | [x] Whitespace found at end of line
13-Sep-2018 15:01:47      |       |     (Squiz.WhiteSpace.SuperfluousWhitespace.EndLine)
13-Sep-2018 15:01:47 279 | ERROR | [x] Whitespace found at end of line
13-Sep-2018 15:01:47      |       |     (Squiz.WhiteSpace.SuperfluousWhitespace.EndLine)
13-Sep-2018 15:01:47 288 | ERROR | [x] Whitespace found at end of line
13-Sep-2018 15:01:47      |       |     (Squiz.WhiteSpace.SuperfluousWhitespace.EndLine)
13-Sep-2018 15:01:47 291 | ERROR | [x] Whitespace found at end of line
13-Sep-2018 15:01:47      |       |     (Squiz.WhiteSpace.SuperfluousWhitespace.EndLine)
13-Sep-2018 15:01:47 297 | ERROR | [x] Whitespace found at end of line
13-Sep-2018 15:01:47      |       |     (Squiz.WhiteSpace.SuperfluousWhitespace.EndLine)
13-Sep-2018 15:01:47 302 | ERROR | [x] Whitespace found at end of line
13-Sep-2018 15:01:47      |       |     (Squiz.WhiteSpace.SuperfluousWhitespace.EndLine)
13-Sep-2018 15:01:47 ----------------------------------------------------------------------
13-Sep-2018 15:01:47 PHPCBF CAN FIX THE 16 MARKED SNIFF VIOLATIONS AUTOMATICALLY
13-Sep-2018 15:01:47 ----------------------------------------------------------------------
13-Sep-2018 15:01:47
13-Sep-2018 15:01:47 Time: 45.45 secs; Memory: 64.25Mb
13-Sep-2018 15:01:47
13-Sep-2018 15:01:55 ............................................................  60 / 210 (29%)
13-Sep-2018 15:02:15 ........E................................................... 120 / 210 (57%)
13-Sep-2018 15:02:29 ............................................................ 180 / 210 (86%)
13-Sep-2018 15:02:37 ...................E..........
13-Sep-2018 15:02:37
13-Sep-2018 15:02:37
13-Sep-2018 15:02:37 FILE: /data/phpBB/includes/functions_privmsgs.php
13-Sep-2018 15:02:37 ----------------------------------------------------------------------
13-Sep-2018 15:02:37 FOUND 2 ERRORS AFFECTING 1 LINE
13-Sep-2018 15:02:37 ----------------------------------------------------------------------
13-Sep-2018 15:02:37 1879 | ERROR | [x] Expected 1 space between comma and argument
13-Sep-2018 15:02:37       |       |     "$sql_limit"; 0 found
13-Sep-2018 15:02:37       |       |     (Squiz.Functions.FunctionDeclarationArgumentSpacing.NoSpaceBeforeArg)
13-Sep-2018 15:02:37 1879 | ERROR | [x] Expected 1 space between comma and argument
13-Sep-2018 15:02:37       |       |     "$sql_start"; 0 found
13-Sep-2018 15:02:37       |       |     (Squiz.Functions.FunctionDeclarationArgumentSpacing.NoSpaceBeforeArg)
13-Sep-2018 15:02:37 ----------------------------------------------------------------------
13-Sep-2018 15:02:37 PHPCBF CAN FIX THE 2 MARKED SNIFF VIOLATIONS AUTOMATICALLY
13-Sep-2018 15:02:37 ----------------------------------------------------------------------
13-Sep-2018 15:02:37
13-Sep-2018 15:02:37
13-Sep-2018 15:02:37 FILE: /data/phpBB/includes/ucp/ucp_pm.php
13-Sep-2018 15:02:37 ----------------------------------------------------------------------
13-Sep-2018 15:02:37 FOUND 1 ERROR AFFECTING 1 LINE
13-Sep-2018 15:02:37 ----------------------------------------------------------------------
13-Sep-2018 15:02:37 52 | ERROR | [x] Functions must not contain multiple empty lines in a
13-Sep-2018 15:02:37     |       |     row; found 11 empty lines
13-Sep-2018 15:02:37     |       |     (Squiz.WhiteSpace.SuperfluousWhitespace.EmptyLines)
13-Sep-2018 15:02:37 ----------------------------------------------------------------------
13-Sep-2018 15:02:37 PHPCBF CAN FIX THE 1 MARKED SNIFF VIOLATIONS AUTOMATICALLY
13-Sep-2018 15:02:37 ----------------------------------------------------------------------
13-Sep-2018 15:02:37
13-Sep-2018 15:02:37 Time: 50.83 secs; Memory: 60.75Mb
13-Sep-2018 15:02:37
13-Sep-2018 15:02:38
13-Sep-2018 15:02:38
13-Sep-2018 15:02:38 Time: 21ms; Memory: 3.75Mb
13-Sep-2018 15:02:38
13-Sep-2018 15:02:38        [if] Error in IfTask
13-Sep-2018 15:02:38 Execution of target "sniff" failed for the following reason: /data/build/build.xml:109:6: /data/build/build.xml:115:9: PHP Code Sniffer failed.
13-Sep-2018 15:02:38
13-Sep-2018 15:02:38 BUILD FAILED
13-Sep-2018 15:02:38 /data/build/build.xml:109:6: /data/build/build.xml:115:9: PHP Code Sniffer failed.
13-Sep-2018 15:02:38 Total time: 2 minutes  36.65 seconds
13-Sep-2018 15:02:38
13-Sep-2018 15:02:38 Error occurred while running Task 'Run sniffs(11)' of type com.atlassian.bamboo.plugins.bamboo-docker-plugin:task.docker.cli.
13-Sep-2018 15:02:38 com.atlassian.bamboo.task.TaskException: Failed to execute task
13-Sep-2018 15:02:38         at com.atlassian.bamboo.plugins.docker.service.RunService.execute(RunService.java:75)
13-Sep-2018 15:02:38         at com.atlassian.bamboo.plugins.docker.tasks.cli.DockerCliTask.execute(DockerCliTask.java:70)
13-Sep-2018 15:02:38         at com.atlassian.bamboo.task.TaskExecutorImpl.lambda$executeTasks$3(TaskExecutorImpl.java:285)
13-Sep-2018 15:02:38         at com.atlassian.bamboo.task.TaskExecutorImpl.executeTaskWithPrePostActions(TaskExecutorImpl.java:224)
13-Sep-2018 15:02:38         at com.atlassian.bamboo.task.TaskExecutorImpl.executeTasks(TaskExecutorImpl.java:285)
13-Sep-2018 15:02:38         at com.atlassian.bamboo.task.TaskExecutorImpl.execute(TaskExecutorImpl.java:112)
13-Sep-2018 15:02:38         at com.atlassian.bamboo.build.pipeline.tasks.ExecuteBuildTask.call(ExecuteBuildTask.java:71)
13-Sep-2018 15:02:38         at com.atlassian.bamboo.v2.build.agent.DefaultBuildAgent.executeBuildPhase(DefaultBuildAgent.java:203)
13-Sep-2018 15:02:38         at com.atlassian.bamboo.v2.build.agent.DefaultBuildAgent.build(DefaultBuildAgent.java:175)
13-Sep-2018 15:02:38         at com.atlassian.bamboo.v2.build.agent.BuildAgentControllerImpl.lambda$waitAndPerformBuild$0(BuildAgentControllerImpl.java:122)
13-Sep-2018 15:02:38         at com.atlassian.bamboo.variable.CustomVariableContextImpl.withVariableSubstitutor(CustomVariableContextImpl.java:185)
13-Sep-2018 15:02:38         at com.atlassian.bamboo.v2.build.agent.BuildAgentControllerImpl.waitAndPerformBuild(BuildAgentControllerImpl.java:117)
13-Sep-2018 15:02:38         at com.atlassian.bamboo.v2.build.agent.DefaultBuildAgent$1.run(DefaultBuildAgent.java:126)
13-Sep-2018 15:02:38         at com.atlassian.bamboo.utils.BambooRunnables$1.run(BambooRunnables.java:48)
13-Sep-2018 15:02:38         at com.atlassian.bamboo.security.ImpersonationHelper.runWith(ImpersonationHelper.java:26)
13-Sep-2018 15:02:38         at com.atlassian.bamboo.security.ImpersonationHelper.runWithSystemAuthority(ImpersonationHelper.java:17)
13-Sep-2018 15:02:38         at com.atlassian.bamboo.security.ImpersonationHelper$1.run(ImpersonationHelper.java:41)
13-Sep-2018 15:02:38         at java.lang.Thread.run(Thread.java:748)
13-Sep-2018 15:02:38 Caused by: com.atlassian.bamboo.docker.DockerException: Error running Docker run command
13-Sep-2018 15:02:38         at com.atlassian.bamboo.docker.DockerContainerServiceImpl.run(DockerContainerServiceImpl.java:118)
13-Sep-2018 15:02:38         at sun.reflect.GeneratedMethodAccessor2675.invoke(Unknown Source)
13-Sep-2018 15:02:38         at sun.reflect.DelegatingMethodAccessorImpl.invoke(DelegatingMethodAccessorImpl.java:43)
13-Sep-2018 15:02:38         at java.lang.reflect.Method.invoke(Method.java:498)
13-Sep-2018 15:02:38         at com.atlassian.plugin.util.ContextClassLoaderSettingInvocationHandler.invoke(ContextClassLoaderSettingInvocationHandler.java:26)
13-Sep-2018 15:02:38         at com.sun.proxy.$Proxy401.run(Unknown Source)
13-Sep-2018 15:02:38         at sun.reflect.GeneratedMethodAccessor2675.invoke(Unknown Source)
13-Sep-2018 15:02:38         at sun.reflect.DelegatingMethodAccessorImpl.invoke(DelegatingMethodAccessorImpl.java:43)
13-Sep-2018 15:02:38         at java.lang.reflect.Method.invoke(Method.java:498)
13-Sep-2018 15:02:38         at org.springframework.aop.support.AopUtils.invokeJoinpointUsingReflection(AopUtils.java:302)
13-Sep-2018 15:02:38         at org.eclipse.gemini.blueprint.service.importer.support.internal.aop.ServiceInvoker.doInvoke(ServiceInvoker.java:56)
13-Sep-2018 15:02:38         at org.eclipse.gemini.blueprint.service.importer.support.internal.aop.ServiceInvoker.invoke(ServiceInvoker.java:60)
13-Sep-2018 15:02:38         at org.springframework.aop.framework.ReflectiveMethodInvocation.proceed(ReflectiveMethodInvocation.java:179)
13-Sep-2018 15:02:38         at org.springframework.aop.support.DelegatingIntroductionInterceptor.doProceed(DelegatingIntroductionInterceptor.java:133)
13-Sep-2018 15:02:38         at org.springframework.aop.support.DelegatingIntroductionInterceptor.invoke(DelegatingIntroductionInterceptor.java:121)
13-Sep-2018 15:02:38         at org.springframework.aop.framework.ReflectiveMethodInvocation.proceed(ReflectiveMethodInvocation.java:179)
13-Sep-2018 15:02:38         at org.eclipse.gemini.blueprint.service.util.internal.aop.ServiceTCCLInterceptor.invokeUnprivileged(ServiceTCCLInterceptor.java:70)
13-Sep-2018 15:02:38         at org.eclipse.gemini.blueprint.service.util.internal.aop.ServiceTCCLInterceptor.invoke(ServiceTCCLInterceptor.java:53)
13-Sep-2018 15:02:38         at org.springframework.aop.framework.ReflectiveMethodInvocation.proceed(ReflectiveMethodInvocation.java:179)
13-Sep-2018 15:02:38         at org.eclipse.gemini.blueprint.service.importer.support.LocalBundleContextAdvice.invoke(LocalBundleContextAdvice.java:57)
13-Sep-2018 15:02:38         at org.springframework.aop.framework.ReflectiveMethodInvocation.proceed(ReflectiveMethodInvocation.java:179)
13-Sep-2018 15:02:38         at org.springframework.aop.support.DelegatingIntroductionInterceptor.doProceed(DelegatingIntroductionInterceptor.java:133)
13-Sep-2018 15:02:38         at org.springframework.aop.support.DelegatingIntroductionInterceptor.invoke(DelegatingIntroductionInterceptor.java:121)
13-Sep-2018 15:02:38         at org.springframework.aop.framework.ReflectiveMethodInvocation.proceed(ReflectiveMethodInvocation.java:179)
13-Sep-2018 15:02:38         at org.springframework.aop.framework.JdkDynamicAopProxy.invoke(JdkDynamicAopProxy.java:207)
13-Sep-2018 15:02:38         at com.sun.proxy.$Proxy680.run(Unknown Source)
13-Sep-2018 15:02:38         at com.atlassian.bamboo.plugins.docker.client.DockerCmd.run(DockerCmd.java:51)
13-Sep-2018 15:02:38         at com.atlassian.bamboo.plugins.docker.service.RunService.execute(RunService.java:64)
13-Sep-2018 15:02:38         ... 17 more
13-Sep-2018 15:02:38 Caused by: com.atlassian.utils.process.ProcessException: Error executing /usr/bin/docker run --volume /home/bamboo/xml-data/build-dir/PHPBB3-PR-JOB1:/data --workdir /data/build --rm -u=991 phpbb:php-5.6 ../phpBB/vendor/bin/phing sniff
13-Sep-2018 15:02:38         at com.atlassian.bamboo.docker.DockerContainerServiceImpl.execute(DockerContainerServiceImpl.java:252)
13-Sep-2018 15:02:38         at com.atlassian.bamboo.docker.DockerContainerServiceImpl.run(DockerContainerServiceImpl.java:106)
13-Sep-2018 15:02:38         ... 44 more
13-Sep-2018 15:02:38 Starting task 'Parsing test results produced by script' of type 'com.atlassian.bamboo.plugins.testresultparser:task.testresultparser.junit'
13-Sep-2018 15:02:38 Parsing test results under /home/bamboo/xml-data/build-dir/PHPBB3-PR-JOB1...
13-Sep-2018 15:02:38 Failing task since test cases were expected but none were found.
13-Sep-2018 15:02:38 Finished task 'Parsing test results produced by script' with result: Failed
13-Sep-2018 15:02:38
Substituting variable: ${bamboo.PRnumber} with 5351
13-Sep-2018 15:02:38
Substituting variable: ${bamboo.buildResultsUrl} with https://bamboo.phpbb.com/browse/PHPBB3-PR-JOB1-8764
13-Sep-2018 15:02:38
Substituting variable: ${bamboo.buildResultsUrl} with https://bamboo.phpbb.com/browse/PHPBB3-PR-JOB1-8764
13-Sep-2018 15:02:38 Starting task 'Set result build status' of type 'com.atlassian.bamboo.plugins.scripttask:task.builder.script'
13-Sep-2018 15:02:38
Beginning to execute external process for build 'phpBB3 - Pull Requests - Build and Test Job #8764 (PHPBB3-PR-JOB1-8764)'
... running command line:
/bin/sh /home/bamboo/temp/PHPBB3-PR-JOB1-8764-ScriptBuildTask-2418020272666098502.sh
... in: /home/bamboo/xml-data/build-dir/PHPBB3-PR-JOB1
... using extra environment variables:
bamboo_planRepository_1_branch=3.1.x
bamboo_planRepository_1_branchDisplayName=3.1.x
bamboo_repository_revision_number=dc8ff9da28b8ab4ad11c7ea94cca526f17c87fe5
bamboo_PRref=master
bamboo_resultsUrl=https://bamboo.phpbb.com/browse/PHPBB3-PR-JOB1-8764
bamboo_capability_system_builder_command_Git=/usr/bin/git
bamboo_repository_75956235_git_username=bantu
bamboo_build_working_directory=/home/bamboo/xml-data/build-dir/PHPBB3-PR-JOB1
bamboo_planRepository_1_name=phpBB Ascraeus
bamboo_buildKey=PHPBB3-PR-JOB1
bamboo_capability_phpbb_tests=true
bamboo_shortPlanName=Pull Requests
bamboo_capability_system_builder_command_fop=/usr/bin/fop
bamboo_capability_dbms_sqlite_2=true
bamboo_planRepository_name=phpBB Ascraeus
bamboo_PRnumber=5351
bamboo_buildNumber=8764
bamboo_repository_75956235_git_repositoryUrl=https://github.com/phpbb/phpbb.git
bamboo_capability_system_builder_phpunit_PHPUnit=/usr/bin/phpunit
bamboo_shortJobName=Build and Test Job
bamboo_buildResultsUrl=https://bamboo.phpbb.com/browse/PHPBB3-PR-JOB1-8764
bamboo_repository_75956235_branch_name=3.1.x
bamboo_planRepository_repositoryUrl=https://github.com/phpbb/phpbb.git
bamboo_agentId=131073
bamboo_planName=phpBB3 - Pull Requests
bamboo_build_commandline_com_atlassian_bamboo_plugins_scripttask_task_builder_script_7=/bin/sh /home/bamboo/temp/PHPBB3-PR-JOB1-8764-ScriptBuildTask-2682076938850240912.sh
bamboo_shortPlanKey=PR
bamboo_shortJobKey=JOB1
bamboo_capability_dbms_mysql_55=true
bamboo_capability_system_jdk_JDK_1_7_0_65=/usr/lib/jvm/java-7-openjdk-amd64
bamboo_planRepository_revision=dc8ff9da28b8ab4ad11c7ea94cca526f17c87fe5
bamboo_buildTimeStamp=2018-09-13T14:59:48.149Z
bamboo_repository_previous_revision_number=dc8ff9da28b8ab4ad11c7ea94cca526f17c87fe5
bamboo_capability_system_jdk_JDK_1_6_0_16=/usr/lib/jvm/java-6-sun-1.6.0.16
bamboo_capability_system_builder_mvn2_Maven_2=/usr/share/maven2
bamboo_planRepository_previousRevision=dc8ff9da28b8ab4ad11c7ea94cca526f17c87fe5
bamboo_build_commandline_com_atlassian_bamboo_plugins_scripttask_task_builder_script_4=/bin/sh /home/bamboo/temp/PHPBB3-PR-JOB1-8764-ScriptBuildTask-2880875636323329701.sh
bamboo_repository_git_branch=3.1.x
bamboo_buildResultKey=PHPBB3-PR-JOB1-8764
bamboo_repository_branch_name=3.1.x
bamboo_buildPlanName=phpBB3 - Pull Requests - Build and Test Job
bamboo_planRepository_1_revision=dc8ff9da28b8ab4ad11c7ea94cca526f17c87fe5
bamboo_repository_name=phpBB Ascraeus
bamboo_buildFailed=true
bamboo_capability_system_docker_executable=/usr/bin/docker
bamboo_build_commandline_com_atlassian_bamboo_plugins_bamboo_docker_plugin_task_docker_cli_11=/usr/bin/docker run --volume /home/bamboo/xml-data/build-dir/PHPBB3-PR-JOB1:/data --workdir /data/build --rm -u=991 phpbb:php-5.6 ../phpBB/vendor/bin/phing sniff
bamboo_build_commandline_com_atlassian_bamboo_plugins_bamboo_docker_plugin_task_docker_cli_12=/usr/bin/docker run --volume /home/bamboo/xml-data/build-dir/PHPBB3-PR-JOB1:/data --workdir /data/phpBB --rm -e HOME=/home/bamboo -u=991 phpbb:php-5.6 /bin/bash -c php ../composer.phar install --dev; cd ../build; ../phpBB/vendor/bin/phing clean prepare
bamboo_planRepository_branch=3.1.x
bamboo_agentWorkingDirectory=/home/bamboo/xml-data/build-dir
bamboo_jobFailed=true
bamboo_capability_system_git_executable=/usr/bin/git
bamboo_capability_system_builder_phpunit_PHPUnit_3_4=/usr/bin/phpunit
bamboo_repository_git_username=bantu
bamboo_planRepository_1_previousRevision=dc8ff9da28b8ab4ad11c7ea94cca526f17c87fe5
bamboo_repository_75956235_revision_number=dc8ff9da28b8ab4ad11c7ea94cca526f17c87fe5
bamboo_planRepository_branchDisplayName=3.1.x
bamboo_planRepository_1_type=gitv2
bamboo_planRepository_branchName=3.1.x
bamboo_repository_75956235_previous_revision_number=dc8ff9da28b8ab4ad11c7ea94cca526f17c87fe5
bamboo_capability_system_jdk_JDK=/usr/lib/jvm/java-6-sun
bamboo_plan_storageTag=PHPBB3-PR
bamboo_hg_cache_directory=/home/bamboo/xml-data/build-dir/_hg-repositories-cache
bamboo_planRepository_1_username=bantu
bamboo_planRepository_type=gitv2
bamboo_git_cache_directory=/home/bamboo/xml-data/build-dir/_git-repositories-cache
bamboo_ManualBuildTriggerReason_userName=Build Robot
bamboo_repository_git_repositoryUrl=https://github.com/phpbb/phpbb.git
bamboo_repository_75956235_git_branch=3.1.x
bamboo_capability_system_builder_ant_Ant=/usr/share/ant
bamboo_repository_75956235_name=phpBB Ascraeus
bamboo_tmp_directory=/home/bamboo/temp
bamboo_working_directory=/home/bamboo/xml-data/build-dir/PHPBB3-PR-JOB1
bamboo_planKey=PHPBB3-PR
bamboo_capability_local=true
bamboo_planRepository_1_repositoryUrl=https://github.com/phpbb/phpbb.git
bamboo_planRepository_username=bantu
bamboo_capability_system_jdk_JDK_1_6=/usr/lib/jvm/java-6-sun
bamboo_capability_system_jdk_JDK_1_7=/usr/lib/jvm/java-7-openjdk-amd64
bamboo_planRepository_1_branchName=3.1.x
13-Sep-2018 15:02:38 From https://github.com/phpbb/phpbb
13-Sep-2018 15:02:38 * branch            refs/pull/5351/head -> FETCH_HEAD
13-Sep-2018 15:02:38 grep: build/logs/phpunit.xml: No such file or directory
13-Sep-2018 15:02:38 grep: build/logs/phpunit.xml: No such file or directory
13-Sep-2018 15:02:38   % Total    % Received % Xferd  Average Speed   Time    Time     Time  Current
13-Sep-2018 15:02:38                                  Dload  Upload   Total   Spent    Left  Speed
13-Sep-2018 15:02:38
13-Sep-2018 15:02:38   0     0    0     0    0     0      0      0 --:--:-- --:--:-- --:--:--     0
13-Sep-2018 15:02:38 100   273  100    93  100   180    319    617 --:--:-- --:--:-- --:--:--   618
13-Sep-2018 15:02:38 Finished task 'Set result build status' with result: Success
13-Sep-2018 15:02:38 Running post build plugin 'NCover Results Collector'
13-Sep-2018 15:02:38 Running post build plugin 'Artifact Copier'
13-Sep-2018 15:02:38 Running post build plugin 'npm Cache Cleanup'
13-Sep-2018 15:02:38 Running post build plugin 'Clover Results Collector'
13-Sep-2018 15:02:38 Running post build plugin 'Docker Container Cleanup'
13-Sep-2018 15:02:39 Successfully removed working directory at '/home/bamboo/xml-data/build-dir/PHPBB3-PR-JOB1'
13-Sep-2018 15:02:39 Finalising the build...
13-Sep-2018 15:02:39 Stopping timer.
13-Sep-2018 15:02:39 Build PHPBB3-PR-JOB1-8764 completed.
13-Sep-2018 15:02:39 Running on server: post build plugin 'NCover Results Collector'
13-Sep-2018 15:02:39 Running on server: post build plugin 'Build Hanging Detection Configuration'
13-Sep-2018 15:02:39 Running on server: post build plugin 'Clover Delta Calculator'
13-Sep-2018 15:02:39 Running on server: post build plugin 'Maven Dependencies Postprocessor'
13-Sep-2018 15:02:39 All post build plugins have finished
13-Sep-2018 15:02:39 Generating build results summary...
13-Sep-2018 15:02:39 Saving build results to disk...
13-Sep-2018 15:02:39 Logging substituted variables...
13-Sep-2018 15:02:39 Indexing build results...
13-Sep-2018 15:02:39 Finished building PHPBB3-PR-JOB1-8764.
13-Sep-2018 15:02:39
Substituting variable: ${bamboo.PRnumber} with 5351