Tests pending pull requests

Build: #8918 failed

Job: Build and Test Job failed

Stages & jobs

  1. Build and Test

Build log

The build generated 494 lines of output. Download or view full build log

18-Oct-2018 08:25:18 Build phpBB3 - Pull Requests - Build and Test Job #8918 (PHPBB3-PR-JOB1-8918) started building on agent Default Agent
18-Oct-2018 08:25:18
18-Oct-2018 08:25:18 Build working directory is /home/bamboo/xml-data/build-dir/PHPBB3-PR-JOB1
18-Oct-2018 08:25:18 Executing build phpBB3 - Pull Requests - Build and Test Job #8918 (PHPBB3-PR-JOB1-8918)
18-Oct-2018 08:25:18 Starting task 'Checkout develop branch' of type 'com.atlassian.bamboo.plugins.vcs:task.vcs.checkout'
18-Oct-2018 08:25:18 Build always requires a clean checkout
18-Oct-2018 08:25:18 Cleaning build directory '/home/bamboo/xml-data/build-dir/PHPBB3-PR-JOB1'
18-Oct-2018 08:25:18 Checking out into /home/bamboo/xml-data/build-dir/PHPBB3-PR-JOB1
18-Oct-2018 08:25:18 Updating source code to revision: dc8ff9da28b8ab4ad11c7ea94cca526f17c87fe5
18-Oct-2018 08:25:18 Fetching 'refs/heads/3.1.x' from 'https://github.com/phpbb/phpbb.git'.
18-Oct-2018 08:25:19 Checking out revision dc8ff9da28b8ab4ad11c7ea94cca526f17c87fe5.
18-Oct-2018 08:25:19 Creating local git repository in '/home/bamboo/xml-data/build-dir/PHPBB3-PR-JOB1/.git'.
18-Oct-2018 08:25:19 Cloning into '/home/bamboo/xml-data/build-dir/PHPBB3-PR-JOB1'...
18-Oct-2018 08:25:19 done.
18-Oct-2018 08:25:24 Branch 3.1.x set up to track remote branch 3.1.x from origin.
18-Oct-2018 08:25:24 Switched to a new branch '3.1.x'
18-Oct-2018 08:25:24 Updated source code to revision: dc8ff9da28b8ab4ad11c7ea94cca526f17c87fe5
18-Oct-2018 08:25:24 Finished task 'Checkout develop branch' with result: Success
18-Oct-2018 08:25:24 Running pre-build action: VCS Version Collector
18-Oct-2018 08:25:24
Substituting variable: ${bamboo.PRnumber} with 5351
18-Oct-2018 08:25:24
Substituting variable: ${bamboo.buildResultsUrl} with https://bamboo.phpbb.com/browse/PHPBB3-PR-JOB1-8918
18-Oct-2018 08:25:24 Starting task 'Set pending build status' of type 'com.atlassian.bamboo.plugins.scripttask:task.builder.script'
18-Oct-2018 08:25:24
Beginning to execute external process for build 'phpBB3 - Pull Requests - Build and Test Job #8918 (PHPBB3-PR-JOB1-8918)'
... running command line:
/bin/sh /home/bamboo/temp/PHPBB3-PR-JOB1-8918-ScriptBuildTask-335586744424094268.sh
... in: /home/bamboo/xml-data/build-dir/PHPBB3-PR-JOB1
... using extra environment variables:
bamboo_planRepository_1_branch=3.1.x
bamboo_planRepository_1_branchDisplayName=3.1.x
bamboo_repository_revision_number=dc8ff9da28b8ab4ad11c7ea94cca526f17c87fe5
bamboo_PRref=master
bamboo_resultsUrl=https://bamboo.phpbb.com/browse/PHPBB3-PR-JOB1-8918
bamboo_capability_system_builder_command_Git=/usr/bin/git
bamboo_repository_75956235_git_username=bantu
bamboo_build_working_directory=/home/bamboo/xml-data/build-dir/PHPBB3-PR-JOB1
bamboo_planRepository_1_name=phpBB Ascraeus
bamboo_buildKey=PHPBB3-PR-JOB1
bamboo_capability_phpbb_tests=true
bamboo_shortPlanName=Pull Requests
bamboo_capability_system_builder_command_fop=/usr/bin/fop
bamboo_capability_dbms_sqlite_2=true
bamboo_planRepository_name=phpBB Ascraeus
bamboo_PRnumber=5351
bamboo_buildNumber=8918
bamboo_repository_75956235_git_repositoryUrl=https://github.com/phpbb/phpbb.git
bamboo_capability_system_builder_phpunit_PHPUnit=/usr/bin/phpunit
bamboo_shortJobName=Build and Test Job
bamboo_buildResultsUrl=https://bamboo.phpbb.com/browse/PHPBB3-PR-JOB1-8918
bamboo_repository_75956235_branch_name=3.1.x
bamboo_planRepository_repositoryUrl=https://github.com/phpbb/phpbb.git
bamboo_agentId=131073
bamboo_planName=phpBB3 - Pull Requests
bamboo_shortPlanKey=PR
bamboo_shortJobKey=JOB1
bamboo_capability_dbms_mysql_55=true
bamboo_capability_system_jdk_JDK_1_7_0_65=/usr/lib/jvm/java-7-openjdk-amd64
bamboo_planRepository_revision=dc8ff9da28b8ab4ad11c7ea94cca526f17c87fe5
bamboo_buildTimeStamp=2018-10-18T08:25:18.664Z
bamboo_repository_previous_revision_number=dc8ff9da28b8ab4ad11c7ea94cca526f17c87fe5
bamboo_capability_system_jdk_JDK_1_6_0_16=/usr/lib/jvm/java-6-sun-1.6.0.16
bamboo_capability_system_builder_mvn2_Maven_2=/usr/share/maven2
bamboo_planRepository_previousRevision=dc8ff9da28b8ab4ad11c7ea94cca526f17c87fe5
bamboo_repository_git_branch=3.1.x
bamboo_buildResultKey=PHPBB3-PR-JOB1-8918
bamboo_repository_branch_name=3.1.x
bamboo_buildPlanName=phpBB3 - Pull Requests - Build and Test Job
bamboo_planRepository_1_revision=dc8ff9da28b8ab4ad11c7ea94cca526f17c87fe5
bamboo_repository_name=phpBB Ascraeus
bamboo_buildFailed=false
bamboo_capability_system_docker_executable=/usr/bin/docker
bamboo_planRepository_branch=3.1.x
bamboo_agentWorkingDirectory=/home/bamboo/xml-data/build-dir
bamboo_capability_system_git_executable=/usr/bin/git
bamboo_capability_system_builder_phpunit_PHPUnit_3_4=/usr/bin/phpunit
bamboo_repository_git_username=bantu
bamboo_planRepository_1_previousRevision=dc8ff9da28b8ab4ad11c7ea94cca526f17c87fe5
bamboo_repository_75956235_revision_number=dc8ff9da28b8ab4ad11c7ea94cca526f17c87fe5
bamboo_planRepository_branchDisplayName=3.1.x
bamboo_planRepository_1_type=gitv2
bamboo_planRepository_branchName=3.1.x
bamboo_repository_75956235_previous_revision_number=dc8ff9da28b8ab4ad11c7ea94cca526f17c87fe5
bamboo_capability_system_jdk_JDK=/usr/lib/jvm/java-6-sun
bamboo_plan_storageTag=PHPBB3-PR
bamboo_hg_cache_directory=/home/bamboo/xml-data/build-dir/_hg-repositories-cache
bamboo_planRepository_1_username=bantu
bamboo_planRepository_type=gitv2
bamboo_git_cache_directory=/home/bamboo/xml-data/build-dir/_git-repositories-cache
bamboo_ManualBuildTriggerReason_userName=Build Robot
bamboo_repository_git_repositoryUrl=https://github.com/phpbb/phpbb.git
bamboo_repository_75956235_git_branch=3.1.x
bamboo_capability_system_builder_ant_Ant=/usr/share/ant
bamboo_repository_75956235_name=phpBB Ascraeus
bamboo_tmp_directory=/home/bamboo/temp
bamboo_working_directory=/home/bamboo/xml-data/build-dir/PHPBB3-PR-JOB1
bamboo_planKey=PHPBB3-PR
bamboo_capability_local=true
bamboo_planRepository_1_repositoryUrl=https://github.com/phpbb/phpbb.git
bamboo_planRepository_username=bantu
bamboo_capability_system_jdk_JDK_1_6=/usr/lib/jvm/java-6-sun
bamboo_capability_system_jdk_JDK_1_7=/usr/lib/jvm/java-7-openjdk-amd64
bamboo_planRepository_1_branchName=3.1.x
18-Oct-2018 08:25:28 From https://github.com/phpbb/phpbb
18-Oct-2018 08:25:28 * branch            refs/pull/5351/head -> FETCH_HEAD
18-Oct-2018 08:25:28   % Total    % Received % Xferd  Average Speed   Time    Time     Time  Current
18-Oct-2018 08:25:28                                  Dload  Upload   Total   Spent    Left  Speed
18-Oct-2018 08:25:28
18-Oct-2018 08:25:28   0     0    0     0    0     0      0      0 --:--:-- --:--:-- --:--:--     0
18-Oct-2018 08:25:28   0     0    0     0    0     0      0      0 --:--:-- --:--:-- --:--:--     0
18-Oct-2018 08:25:28 100   275  100    93  100   182    173    338 --:--:-- --:--:-- --:--:--   338
18-Oct-2018 08:25:28 Finished task 'Set pending build status' with result: Success
18-Oct-2018 08:25:28
Substituting variable: ${bamboo.PRnumber} with 5351
18-Oct-2018 08:25:28 Starting task 'Fetch PR' of type 'com.atlassian.bamboo.plugins.scripttask:task.builder.script'
18-Oct-2018 08:25:28
Beginning to execute external process for build 'phpBB3 - Pull Requests - Build and Test Job #8918 (PHPBB3-PR-JOB1-8918)'
... running command line:
/bin/sh /home/bamboo/temp/PHPBB3-PR-JOB1-8918-ScriptBuildTask-2451018515074073577.sh
... in: /home/bamboo/xml-data/build-dir/PHPBB3-PR-JOB1
... using extra environment variables:
bamboo_planRepository_1_branch=3.1.x
bamboo_planRepository_1_branchDisplayName=3.1.x
bamboo_repository_revision_number=dc8ff9da28b8ab4ad11c7ea94cca526f17c87fe5
bamboo_PRref=master
bamboo_resultsUrl=https://bamboo.phpbb.com/browse/PHPBB3-PR-JOB1-8918
bamboo_capability_system_builder_command_Git=/usr/bin/git
bamboo_repository_75956235_git_username=bantu
bamboo_build_working_directory=/home/bamboo/xml-data/build-dir/PHPBB3-PR-JOB1
bamboo_planRepository_1_name=phpBB Ascraeus
bamboo_buildKey=PHPBB3-PR-JOB1
bamboo_capability_phpbb_tests=true
bamboo_shortPlanName=Pull Requests
bamboo_capability_system_builder_command_fop=/usr/bin/fop
bamboo_capability_dbms_sqlite_2=true
bamboo_planRepository_name=phpBB Ascraeus
bamboo_PRnumber=5351
bamboo_buildNumber=8918
bamboo_repository_75956235_git_repositoryUrl=https://github.com/phpbb/phpbb.git
bamboo_capability_system_builder_phpunit_PHPUnit=/usr/bin/phpunit
bamboo_shortJobName=Build and Test Job
bamboo_buildResultsUrl=https://bamboo.phpbb.com/browse/PHPBB3-PR-JOB1-8918
bamboo_repository_75956235_branch_name=3.1.x
bamboo_planRepository_repositoryUrl=https://github.com/phpbb/phpbb.git
bamboo_agentId=131073
bamboo_planName=phpBB3 - Pull Requests
bamboo_build_commandline_com_atlassian_bamboo_plugins_scripttask_task_builder_script_7=/bin/sh /home/bamboo/temp/PHPBB3-PR-JOB1-8918-ScriptBuildTask-335586744424094268.sh
bamboo_shortPlanKey=PR
bamboo_shortJobKey=JOB1
bamboo_capability_dbms_mysql_55=true
bamboo_capability_system_jdk_JDK_1_7_0_65=/usr/lib/jvm/java-7-openjdk-amd64
bamboo_planRepository_revision=dc8ff9da28b8ab4ad11c7ea94cca526f17c87fe5
bamboo_buildTimeStamp=2018-10-18T08:25:18.664Z
bamboo_repository_previous_revision_number=dc8ff9da28b8ab4ad11c7ea94cca526f17c87fe5
bamboo_capability_system_jdk_JDK_1_6_0_16=/usr/lib/jvm/java-6-sun-1.6.0.16
bamboo_capability_system_builder_mvn2_Maven_2=/usr/share/maven2
bamboo_planRepository_previousRevision=dc8ff9da28b8ab4ad11c7ea94cca526f17c87fe5
bamboo_repository_git_branch=3.1.x
bamboo_buildResultKey=PHPBB3-PR-JOB1-8918
bamboo_repository_branch_name=3.1.x
bamboo_buildPlanName=phpBB3 - Pull Requests - Build and Test Job
bamboo_planRepository_1_revision=dc8ff9da28b8ab4ad11c7ea94cca526f17c87fe5
bamboo_repository_name=phpBB Ascraeus
bamboo_buildFailed=false
bamboo_capability_system_docker_executable=/usr/bin/docker
bamboo_planRepository_branch=3.1.x
bamboo_agentWorkingDirectory=/home/bamboo/xml-data/build-dir
bamboo_capability_system_git_executable=/usr/bin/git
bamboo_capability_system_builder_phpunit_PHPUnit_3_4=/usr/bin/phpunit
bamboo_repository_git_username=bantu
bamboo_planRepository_1_previousRevision=dc8ff9da28b8ab4ad11c7ea94cca526f17c87fe5
bamboo_repository_75956235_revision_number=dc8ff9da28b8ab4ad11c7ea94cca526f17c87fe5
bamboo_planRepository_branchDisplayName=3.1.x
bamboo_planRepository_1_type=gitv2
bamboo_planRepository_branchName=3.1.x
bamboo_repository_75956235_previous_revision_number=dc8ff9da28b8ab4ad11c7ea94cca526f17c87fe5
bamboo_capability_system_jdk_JDK=/usr/lib/jvm/java-6-sun
bamboo_plan_storageTag=PHPBB3-PR
bamboo_hg_cache_directory=/home/bamboo/xml-data/build-dir/_hg-repositories-cache
bamboo_planRepository_1_username=bantu
bamboo_planRepository_type=gitv2
bamboo_git_cache_directory=/home/bamboo/xml-data/build-dir/_git-repositories-cache
bamboo_ManualBuildTriggerReason_userName=Build Robot
bamboo_repository_git_repositoryUrl=https://github.com/phpbb/phpbb.git
bamboo_repository_75956235_git_branch=3.1.x
bamboo_capability_system_builder_ant_Ant=/usr/share/ant
bamboo_repository_75956235_name=phpBB Ascraeus
bamboo_tmp_directory=/home/bamboo/temp
bamboo_working_directory=/home/bamboo/xml-data/build-dir/PHPBB3-PR-JOB1
bamboo_planKey=PHPBB3-PR
bamboo_capability_local=true
bamboo_planRepository_1_repositoryUrl=https://github.com/phpbb/phpbb.git
bamboo_planRepository_username=bantu
bamboo_capability_system_jdk_JDK_1_6=/usr/lib/jvm/java-6-sun
bamboo_capability_system_jdk_JDK_1_7=/usr/lib/jvm/java-7-openjdk-amd64
bamboo_planRepository_1_branchName=3.1.x
18-Oct-2018 08:25:31 From https://github.com/phpbb/phpbb
18-Oct-2018 08:25:31 * branch            refs/pull/5351/merge -> FETCH_HEAD
18-Oct-2018 08:25:31 Note: checking out 'FETCH_HEAD'.
18-Oct-2018 08:25:31
18-Oct-2018 08:25:31 You are in 'detached HEAD' state. You can look around, make experimental
18-Oct-2018 08:25:31 changes and commit them, and you can discard any commits you make in this
18-Oct-2018 08:25:31 state without impacting any branches by performing another checkout.
18-Oct-2018 08:25:31
18-Oct-2018 08:25:31 If you want to create a new branch to retain commits you create, you may
18-Oct-2018 08:25:31 do so (now or later) by using -b with the checkout command again. Example:
18-Oct-2018 08:25:31
18-Oct-2018 08:25:31   git checkout -b new_branch_name
18-Oct-2018 08:25:31
18-Oct-2018 08:25:31 HEAD is now at f54b0a6... Merge 10742ddce5f99363d853f4a76b3b3d9ac046ec81 into c45a9173baba4f70f79b602897c9677dc071e2c9
18-Oct-2018 08:25:31 Finished task 'Fetch PR' with result: Success
18-Oct-2018 08:25:31 Skipping execution of task 'Prepare directory' as it is disabled
18-Oct-2018 08:25:31
Substituting variable: ${bamboo.working.directory} with /home/bamboo/xml-data/build-dir/PHPBB3-PR-JOB1
18-Oct-2018 08:25:31 Starting task 'Prepare directory' of type 'com.atlassian.bamboo.plugins.bamboo-docker-plugin:task.docker.cli'
18-Oct-2018 08:25:31 Running image name (phpbb:php-5.6)
18-Oct-2018 08:25:31
Beginning to execute external process for build 'phpBB3 - Pull Requests - Build and Test Job #8918 (PHPBB3-PR-JOB1-8918)'
... running command line:
/usr/bin/docker run --volume /home/bamboo/xml-data/build-dir/PHPBB3-PR-JOB1:/data --workdir /data/phpBB --rm -e HOME=/home/bamboo -u=991 phpbb:php-5.6 /bin/bash -c php ../composer.phar install --dev; cd ../build; ../phpBB/vendor/bin/phing clean prepare
... in: /home/bamboo/xml-data/build-dir/PHPBB3-PR-JOB1
... using extra environment variables:
bamboo_planRepository_1_branch=3.1.x
bamboo_planRepository_1_branchDisplayName=3.1.x
bamboo_repository_revision_number=dc8ff9da28b8ab4ad11c7ea94cca526f17c87fe5
bamboo_PRref=master
bamboo_resultsUrl=https://bamboo.phpbb.com/browse/PHPBB3-PR-JOB1-8918
bamboo_capability_system_builder_command_Git=/usr/bin/git
bamboo_repository_75956235_git_username=bantu
bamboo_build_working_directory=/home/bamboo/xml-data/build-dir/PHPBB3-PR-JOB1
bamboo_planRepository_1_name=phpBB Ascraeus
bamboo_buildKey=PHPBB3-PR-JOB1
bamboo_capability_phpbb_tests=true
bamboo_shortPlanName=Pull Requests
bamboo_capability_system_builder_command_fop=/usr/bin/fop
bamboo_capability_dbms_sqlite_2=true
bamboo_planRepository_name=phpBB Ascraeus
bamboo_PRnumber=5351
bamboo_buildNumber=8918
bamboo_repository_75956235_git_repositoryUrl=https://github.com/phpbb/phpbb.git
bamboo_capability_system_builder_phpunit_PHPUnit=/usr/bin/phpunit
bamboo_shortJobName=Build and Test Job
bamboo_buildResultsUrl=https://bamboo.phpbb.com/browse/PHPBB3-PR-JOB1-8918
bamboo_repository_75956235_branch_name=3.1.x
bamboo_planRepository_repositoryUrl=https://github.com/phpbb/phpbb.git
bamboo_agentId=131073
bamboo_planName=phpBB3 - Pull Requests
bamboo_build_commandline_com_atlassian_bamboo_plugins_scripttask_task_builder_script_7=/bin/sh /home/bamboo/temp/PHPBB3-PR-JOB1-8918-ScriptBuildTask-335586744424094268.sh
bamboo_shortPlanKey=PR
bamboo_shortJobKey=JOB1
bamboo_capability_dbms_mysql_55=true
bamboo_capability_system_jdk_JDK_1_7_0_65=/usr/lib/jvm/java-7-openjdk-amd64
bamboo_planRepository_revision=dc8ff9da28b8ab4ad11c7ea94cca526f17c87fe5
bamboo_buildTimeStamp=2018-10-18T08:25:18.664Z
bamboo_repository_previous_revision_number=dc8ff9da28b8ab4ad11c7ea94cca526f17c87fe5
bamboo_capability_system_jdk_JDK_1_6_0_16=/usr/lib/jvm/java-6-sun-1.6.0.16
bamboo_capability_system_builder_mvn2_Maven_2=/usr/share/maven2
bamboo_planRepository_previousRevision=dc8ff9da28b8ab4ad11c7ea94cca526f17c87fe5
bamboo_build_commandline_com_atlassian_bamboo_plugins_scripttask_task_builder_script_4=/bin/sh /home/bamboo/temp/PHPBB3-PR-JOB1-8918-ScriptBuildTask-2451018515074073577.sh
bamboo_repository_git_branch=3.1.x
bamboo_buildResultKey=PHPBB3-PR-JOB1-8918
bamboo_repository_branch_name=3.1.x
bamboo_buildPlanName=phpBB3 - Pull Requests - Build and Test Job
bamboo_planRepository_1_revision=dc8ff9da28b8ab4ad11c7ea94cca526f17c87fe5
bamboo_repository_name=phpBB Ascraeus
bamboo_buildFailed=false
bamboo_capability_system_docker_executable=/usr/bin/docker
bamboo_planRepository_branch=3.1.x
bamboo_agentWorkingDirectory=/home/bamboo/xml-data/build-dir
bamboo_capability_system_git_executable=/usr/bin/git
bamboo_capability_system_builder_phpunit_PHPUnit_3_4=/usr/bin/phpunit
bamboo_repository_git_username=bantu
bamboo_planRepository_1_previousRevision=dc8ff9da28b8ab4ad11c7ea94cca526f17c87fe5
bamboo_repository_75956235_revision_number=dc8ff9da28b8ab4ad11c7ea94cca526f17c87fe5
bamboo_planRepository_branchDisplayName=3.1.x
bamboo_planRepository_1_type=gitv2
bamboo_planRepository_branchName=3.1.x
bamboo_repository_75956235_previous_revision_number=dc8ff9da28b8ab4ad11c7ea94cca526f17c87fe5
bamboo_capability_system_jdk_JDK=/usr/lib/jvm/java-6-sun
bamboo_plan_storageTag=PHPBB3-PR
bamboo_hg_cache_directory=/home/bamboo/xml-data/build-dir/_hg-repositories-cache
bamboo_planRepository_1_username=bantu
bamboo_planRepository_type=gitv2
bamboo_git_cache_directory=/home/bamboo/xml-data/build-dir/_git-repositories-cache
bamboo_ManualBuildTriggerReason_userName=Build Robot
bamboo_repository_git_repositoryUrl=https://github.com/phpbb/phpbb.git
bamboo_repository_75956235_git_branch=3.1.x
bamboo_capability_system_builder_ant_Ant=/usr/share/ant
bamboo_repository_75956235_name=phpBB Ascraeus
bamboo_tmp_directory=/home/bamboo/temp
bamboo_working_directory=/home/bamboo/xml-data/build-dir/PHPBB3-PR-JOB1
bamboo_planKey=PHPBB3-PR
bamboo_capability_local=true
bamboo_planRepository_1_repositoryUrl=https://github.com/phpbb/phpbb.git
bamboo_planRepository_username=bantu
bamboo_capability_system_jdk_JDK_1_6=/usr/lib/jvm/java-6-sun
bamboo_capability_system_jdk_JDK_1_7=/usr/lib/jvm/java-7-openjdk-amd64
bamboo_planRepository_1_branchName=3.1.x
18-Oct-2018 08:25:32 Cannot create cache directory /home/bamboo/.composer/cache/repo/https---repo.packagist.org/, or directory is not writable. Proceeding without cache
18-Oct-2018 08:25:32 Cannot create cache directory /home/bamboo/.composer/cache/files/, or directory is not writable. Proceeding without cache
18-Oct-2018 08:25:32 You are using the deprecated option "dev". Dev packages are installed by default now.
18-Oct-2018 08:25:32 Loading composer repositories with package information
18-Oct-2018 08:25:32 Installing dependencies (including require-dev) from lock file
18-Oct-2018 08:25:32 Package operations: 76 installs, 0 updates, 0 removals
18-Oct-2018 08:25:33   - Installing composer/installers (v1.5.0): Downloading (connecting...)Downloading (0%)           Downloading (5%)Downloading (20%)Downloading (45%)Downloading (55%)Downloading (60%)Downloading (65%)Downloading (80%)Downloading (85%)Downloading (90%)Downloading (100%)
18-Oct-2018 08:25:34   - Installing bantu/ini-get-wrapper (v1.0.1): Downloading (connecting...)Downloading (100%)         
18-Oct-2018 08:25:34   - Installing symfony/process (v3.4.15): Downloading (connecting...)Downloading (0%)           Downloading (5%)Downloading (30%)Downloading (35%)Downloading (70%)Downloading (95%)Downloading (100%)
18-Oct-2018 08:25:35   - Installing symfony/finder (v3.4.15): Downloading (connecting...)Downloading (0%)           Downloading (5%)Downloading (20%)Downloading (25%)Downloading (30%)Downloading (50%)Downloading (55%)Downloading (60%)Downloading (65%)Downloading (95%)Downloading (100%)
18-Oct-2018 08:25:36   - Installing symfony/polyfill-ctype (v1.9.0): Downloading (connecting...)Downloading (0%)           Downloading (100%)
18-Oct-2018 08:25:37   - Installing symfony/filesystem (v3.4.15): Downloading (connecting...)Downloading (100%)         
18-Oct-2018 08:25:38   - Installing symfony/polyfill-mbstring (v1.9.0): Downloading (connecting...)Downloading (0%)           Downloading (30%)Downloading (55%)Downloading (85%)Downloading (100%)
18-Oct-2018 08:25:38   - Installing psr/log (1.0.2): Downloading (connecting...)Downloading (0%)           Downloading (15%)Downloading (100%)
18-Oct-2018 08:25:39   - Installing symfony/debug (v3.4.15): Downloading (connecting...)Downloading (0%)           Downloading (5%)Downloading (20%)Downloading (25%)Downloading (30%)Downloading (35%)Downloading (40%)Downloading (55%)Downloading (60%)Downloading (65%)Downloading (80%)Downloading (85%)Downloading (100%)
18-Oct-2018 08:25:40   - Installing symfony/console (v3.4.15): Downloading (connecting...)Downloading (0%)           Downloading (5%)Downloading (10%)Downloading (15%)Downloading (20%)Downloading (25%)Downloading (30%)Downloading (35%)Downloading (40%)Downloading (45%)Downloading (50%)Downloading (55%)Downloading (60%)Downloading (65%)Downloading (70%)Downloading (75%)Downloading (80%)Downloading (85%)Downloading (90%)Downloading (95%)Downloading (100%)
18-Oct-2018 08:25:41   - Installing seld/phar-utils (1.0.1): Downloading (connecting...)Downloading (0%)           Downloading (30%)Downloading (60%)Downloading (90%)Downloading (100%)
18-Oct-2018 08:25:41   - Installing seld/jsonlint (1.7.1): Downloading (connecting...)Downloading (0%)           Downloading (15%)Downloading (50%)Downloading (100%)
18-Oct-2018 08:25:43   - Installing justinrainbow/json-schema (5.2.7): Downloading (connecting...)Downloading (0%)           Downloading (20%)Downloading (25%)Downloading (30%)Downloading (35%)Downloading (50%)Downloading (55%)Downloading (70%)Downloading (75%)Downloading (95%)Downloading (100%)
18-Oct-2018 08:25:43   - Installing composer/xdebug-handler (1.3.0): Downloading (connecting...)Downloading (0%)           Downloading (25%)Downloading (95%)Downloading (100%)
18-Oct-2018 08:25:44   - Installing composer/spdx-licenses (1.4.0): Downloading (connecting...)Downloading (0%)           Downloading (10%)Downloading (100%)
18-Oct-2018 08:25:45   - Installing composer/semver (1.4.2): Downloading (connecting...)Downloading (0%)           Downloading (35%)Downloading (85%)Downloading (100%)
18-Oct-2018 08:25:46   - Installing composer/ca-bundle (1.1.2): Downloading (connecting...)Downloading (0%)           Downloading (5%)Downloading (15%)Downloading (20%)Downloading (25%)Downloading (30%)Downloading (35%)Downloading (40%)Downloading (45%)Downloading (50%)Downloading (55%)Downloading (60%)Downloading (65%)Downloading (70%)Downloading (75%)Downloading (80%)Downloading (85%)Downloading (90%)Downloading (95%)Downloading (100%)
18-Oct-2018 08:25:46   - Installing composer/composer (1.7.2): Downloading (connecting...)Downloading (0%)           Downloading (5%)Downloading (10%)Downloading (15%)Downloading (20%)Downloading (25%)Downloading (30%)Downloading (35%)Downloading (40%)Downloading (45%)Downloading (50%)Downloading (55%)Downloading (60%)Downloading (65%)Downloading (75%)Downloading (80%)Downloading (90%)Downloading (95%)Downloading (100%)
18-Oct-2018 08:25:47   - Installing google/recaptcha (1.2.1): Downloading (connecting...)Downloading (0%)           Downloading (5%)Downloading (10%)Downloading (15%)Downloading (20%)Downloading (25%)Downloading (30%)Downloading (35%)Downloading (40%)Downloading (45%)Downloading (50%)Downloading (95%)Downloading (100%)
18-Oct-2018 08:25:48   - Installing guzzlehttp/promises (v1.3.1): Downloading (connecting...)Downloading (0%)           Downloading (30%)Downloading (40%)Downloading (70%)Downloading (100%)
18-Oct-2018 08:25:49   - Installing psr/http-message (1.0.1): Downloading (connecting...)Downloading (0%)           Downloading (100%)
18-Oct-2018 08:25:50   - Installing guzzlehttp/psr7 (1.4.2): Downloading (connecting...)Downloading (0%)           Downloading (5%)Downloading (10%)Downloading (15%)Downloading (20%)Downloading (25%)Downloading (30%)Downloading (100%)
18-Oct-2018 08:25:51   - Installing lusitanian/oauth (v0.8.11): Downloading (connecting...)Downloading (0%)           Downloading (5%)Downloading (10%)Downloading (15%)Downloading (20%)Downloading (30%)Downloading (35%)Downloading (40%)Downloading (45%)Downloading (50%)Downloading (55%)Downloading (60%)Downloading (65%)Downloading (70%)Downloading (75%)Downloading (80%)Downloading (85%)Downloading (90%)Downloading (95%)Downloading (100%)
18-Oct-2018 08:25:52   - Installing marc1706/fast-image-size (v1.1.4): Downloading (connecting...)Downloading (100%)         
18-Oct-2018 08:25:53   - Installing patchwork/utf8 (v1.3.1): Downloading (connecting...)Downloading (0%)           Downloading (5%)Downloading (10%)Downloading (15%)Downloading (20%)Downloading (25%)Downloading (30%)Downloading (35%)Downloading (40%)Downloading (45%)Downloading (50%)Downloading (55%)Downloading (60%)Downloading (65%)Downloading (70%)Downloading (75%)Downloading (80%)Downloading (85%)Downloading (90%)Downloading (95%)Downloading (100%)
18-Oct-2018 08:25:54   - Installing psr/container (1.0.0): Downloading (connecting...)Downloading (0%)           Downloading (75%)Downloading (100%)
18-Oct-2018 08:25:55   - Installing s9e/text-formatter (0.13.1): Downloading (connecting...)Downloading (100%)         
18-Oct-2018 08:25:56   - Installing symfony/config (v3.4.15): Downloading (connecting...)Downloading (0%)           Downloading (5%)Downloading (10%)Downloading (15%)Downloading (20%)Downloading (25%)Downloading (30%)Downloading (35%)Downloading (40%)Downloading (45%)Downloading (50%)Downloading (55%)Downloading (60%)Downloading (65%)Downloading (70%)Downloading (75%)Downloading (80%)Downloading (85%)Downloading (90%)Downloading (95%)Downloading (100%)
18-Oct-2018 08:25:57   - Installing paragonie/random_compat (v1.4.3): Downloading (connecting...)Downloading (0%)           Downloading (10%)Downloading (35%)Downloading (45%)Downloading (50%)Downloading (60%)Downloading (85%)Downloading (95%)Downloading (100%)
18-Oct-2018 08:25:57   - Installing symfony/polyfill-php70 (v1.9.0): Downloading (connecting...)Downloading (0%)           Downloading (85%)Downloading (100%)
18-Oct-2018 08:25:59   - Installing symfony/http-foundation (v3.4.15): Downloading (connecting...)Downloading (0%)           Downloading (5%)Downloading (10%)Downloading (15%)Downloading (20%)Downloading (25%)Downloading (30%)Downloading (35%)Downloading (40%)Downloading (45%)Downloading (50%)Downloading (55%)Downloading (60%)Downloading (65%)Downloading (70%)Downloading (75%)Downloading (80%)Downloading (85%)Downloading (90%)Downloading (95%)Downloading (100%)
18-Oct-2018 08:25:59   - Installing symfony/event-dispatcher (v3.4.15): Downloading (connecting...)Downloading (0%)           Downloading (5%)Downloading (100%)
18-Oct-2018 08:26:00   - Installing symfony/http-kernel (v3.4.15): Downloading (connecting...)Downloading (0%)           Downloading (5%)Downloading (10%)Downloading (15%)Downloading (20%)Downloading (25%)Downloading (35%)Downloading (40%)Downloading (45%)Downloading (50%)Downloading (55%)Downloading (60%)Downloading (65%)Downloading (70%)Downloading (75%)Downloading (80%)Downloading (85%)Downloading (90%)Downloading (95%)Downloading (100%)
18-Oct-2018 08:26:03   - Installing symfony/dependency-injection (v3.4.15): Downloading (connecting...)Downloading (0%)           Downloading (5%)Downloading (10%)Downloading (15%)Downloading (20%)Downloading (25%)Downloading (30%)Downloading (35%)Downloading (40%)Downloading (45%)Downloading (50%)Downloading (55%)Downloading (60%)Downloading (65%)Downloading (70%)Downloading (75%)Downloading (80%)Downloading (85%)Downloading (90%)Downloading (95%)Downloading (100%)
18-Oct-2018 08:26:04   - Installing zendframework/zend-eventmanager (3.2.1): Downloading (connecting...)Downloading (0%)           Downloading (15%)Downloading (20%)Downloading (35%)Downloading (45%)Downloading (65%)Downloading (80%)Downloading (85%)Downloading (100%)
18-Oct-2018 08:26:05   - Installing zendframework/zend-code (2.6.3): Downloading (connecting...)Downloading (100%)         
18-Oct-2018 08:26:06   - Installing ocramius/proxy-manager (1.0.2): Downloading (connecting...)Downloading (0%)           Downloading (5%)Downloading (10%)Downloading (15%)Downloading (20%)Downloading (25%)Downloading (30%)Downloading (35%)Downloading (40%)Downloading (45%)Downloading (50%)Downloading (55%)Downloading (60%)Downloading (65%)Downloading (70%)Downloading (75%)Downloading (80%)Downloading (85%)Downloading (90%)Downloading (95%)Downloading (100%)
18-Oct-2018 08:26:07   - Installing symfony/proxy-manager-bridge (v3.4.15): Downloading (connecting...)Downloading (0%)           Downloading (25%)Downloading (50%)Downloading (60%)Downloading (85%)Downloading (100%)
18-Oct-2018 08:26:08   - Installing symfony/routing (v3.4.15): Downloading (connecting...)Downloading (0%)           Downloading (5%)Downloading (10%)Downloading (15%)Downloading (20%)Downloading (25%)Downloading (30%)Downloading (35%)Downloading (40%)Downloading (45%)Downloading (50%)Downloading (55%)Downloading (60%)Downloading (65%)Downloading (70%)Downloading (75%)Downloading (80%)Downloading (85%)Downloading (90%)Downloading (95%)Downloading (100%)
18-Oct-2018 08:26:11   - Installing twig/twig (v1.35.4): Downloading (connecting...)Downloading (0%)           Downloading (5%)Downloading (10%)Downloading (15%)Downloading (20%)Downloading (25%)Downloading (30%)Downloading (35%)Downloading (40%)Downloading (45%)Downloading (50%)Downloading (55%)Downloading (60%)Downloading (65%)Downloading (70%)Downloading (75%)Downloading (80%)Downloading (85%)Downloading (90%)Downloading (95%)Downloading (100%)
18-Oct-2018 08:26:13   - Installing symfony/twig-bridge (v3.4.15): Downloading (connecting...)Downloading (0%)           Downloading (5%)Downloading (10%)Downloading (15%)Downloading (20%)Downloading (25%)Downloading (30%)Downloading (35%)Downloading (40%)Downloading (45%)Downloading (50%)Downloading (55%)Downloading (60%)Downloading (65%)Downloading (70%)Downloading (75%)Downloading (80%)Downloading (90%)Downloading (95%)Downloading (100%)
18-Oct-2018 08:26:13   - Installing symfony/dom-crawler (v3.4.15): Downloading (connecting...)Downloading (100%)         
18-Oct-2018 08:26:14   - Installing symfony/css-selector (v3.4.15): Downloading (connecting...)Downloading (0%)           Downloading (5%)Downloading (10%)Downloading (15%)Downloading (20%)Downloading (25%)Downloading (30%)Downloading (35%)Downloading (40%)Downloading (75%)Downloading (80%)Downloading (85%)Downloading (90%)Downloading (95%)Downloading (100%)
18-Oct-2018 08:26:15   - Installing symfony/browser-kit (v3.4.15): Downloading (connecting...)Downloading (0%)           Downloading (5%)Downloading (65%)Downloading (70%)Downloading (100%)
18-Oct-2018 08:26:15   - Installing guzzlehttp/guzzle (6.3.3): Downloading (connecting...)Downloading (0%)           Downloading (5%)Downloading (15%)Downloading (20%)Downloading (30%)Downloading (35%)Downloading (45%)Downloading (50%)Downloading (55%)Downloading (60%)Downloading (70%)Downloading (75%)Downloading (85%)Downloading (90%)Downloading (95%)Downloading (100%)
18-Oct-2018 08:26:16   - Installing fabpot/goutte (v3.2.3): Downloading (connecting...)Downloading (0%)           Downloading (40%)Downloading (100%)
18-Oct-2018 08:26:18   - Installing facebook/webdriver (1.6.0): Downloading (connecting...)Downloading (0%)           Downloading (5%)Downloading (10%)Downloading (15%)Downloading (20%)Downloading (25%)Downloading (30%)Downloading (35%)Downloading (40%)Downloading (45%)Downloading (50%)Downloading (55%)Downloading (60%)Downloading (65%)Downloading (70%)Downloading (75%)Downloading (80%)Downloading (85%)Downloading (90%)Downloading (95%)Downloading (100%)
18-Oct-2018 08:26:18   - Installing symfony/yaml (v3.4.15): Downloading (connecting...)Downloading (0%)           Downloading (5%)Downloading (10%)Downloading (20%)Downloading (25%)Downloading (35%)Downloading (40%)Downloading (60%)Downloading (65%)Downloading (70%)Downloading (75%)Downloading (80%)Downloading (85%)Downloading (90%)Downloading (95%)Downloading (100%)
18-Oct-2018 08:26:19   - Installing laravel/homestead (v7.17.0): Downloading (connecting...)Downloading (100%)         
18-Oct-2018 08:26:21   - Installing phing/phing (2.4.14): Downloading (connecting...)Downloading (100%)         
18-Oct-2018 08:26:22   - Installing webmozart/assert (1.3.0): Downloading (connecting...)Downloading (0%)           Downloading (65%)Downloading (85%)Downloading (100%)
18-Oct-2018 08:26:23   - Installing phpdocumentor/reflection-common (1.0.1): Downloading (connecting...)Downloading (0%)           Downloading (100%)
18-Oct-2018 08:26:24   - Installing phpdocumentor/type-resolver (0.4.0): Downloading (connecting...)Downloading (0%)           Downloading (5%)Downloading (100%)
18-Oct-2018 08:26:24   - Installing phpdocumentor/reflection-docblock (3.3.2): Downloading (connecting...)Downloading (0%)           Downloading (5%)Downloading (10%)Downloading (15%)Downloading (50%)Downloading (55%)Downloading (70%)Downloading (75%)Downloading (80%)Downloading (100%)
18-Oct-2018 08:26:25   - Installing sebastian/version (2.0.1): Downloading (connecting...)Downloading (0%)           Downloading (100%)
18-Oct-2018 08:26:26   - Installing sebastian/resource-operations (1.0.0): Downloading (connecting...)Downloading (0%)           Downloading (65%)Downloading (100%)
18-Oct-2018 08:26:26   - Installing sebastian/recursion-context (2.0.0): Downloading (connecting...)Downloading (0%)           Downloading (100%)
18-Oct-2018 08:26:27   - Installing sebastian/object-enumerator (2.0.1): Downloading (connecting...)Downloading (0%)           Downloading (100%)
18-Oct-2018 08:26:28   - Installing sebastian/global-state (1.1.1): Downloading (connecting...)Downloading (0%)           Downloading (40%)Downloading (70%)Downloading (100%)
18-Oct-2018 08:26:28   - Installing sebastian/exporter (2.0.0): Downloading (connecting...)Downloading (0%)           Downloading (100%)
18-Oct-2018 08:26:29   - Installing sebastian/environment (2.0.0): Downloading (connecting...)Downloading (0%)           Downloading (15%)Downloading (30%)Downloading (45%)Downloading (60%)Downloading (75%)Downloading (90%)Downloading (100%)
18-Oct-2018 08:26:30   - Installing sebastian/diff (1.4.3): Downloading (connecting...)Downloading (0%)           Downloading (35%)Downloading (50%)Downloading (85%)Downloading (90%)Downloading (100%)
18-Oct-2018 08:26:31   - Installing sebastian/comparator (1.2.4): Downloading (connecting...)Downloading (0%)           Downloading (10%)Downloading (55%)Downloading (65%)Downloading (70%)Downloading (100%)
18-Oct-2018 08:26:31   - Installing phpunit/php-text-template (1.2.1): Downloading (connecting...)Downloading (0%)           Downloading (35%)Downloading (100%)
18-Oct-2018 08:26:32   - Installing doctrine/instantiator (1.0.5): Downloading (connecting...)Downloading (0%)           Downloading (15%)Downloading (30%)Downloading (45%)Downloading (50%)Downloading (65%)Downloading (80%)Downloading (95%)Downloading (100%)
18-Oct-2018 08:26:33   - Installing phpunit/phpunit-mock-objects (3.4.4): Downloading (connecting...)Downloading (0%)           Downloading (5%)Downloading (10%)Downloading (15%)Downloading (20%)Downloading (30%)Downloading (35%)Downloading (40%)Downloading (45%)Downloading (55%)Downloading (60%)Downloading (65%)Downloading (70%)Downloading (80%)Downloading (85%)Downloading (90%)Downloading (95%)Downloading (100%)
18-Oct-2018 08:26:34   - Installing phpunit/php-timer (1.0.9): Downloading (connecting...)Downloading (0%)           Downloading (45%)Downloading (90%)Downloading (100%)
18-Oct-2018 08:26:34   - Installing phpunit/php-file-iterator (1.4.5): Downloading (connecting...)Downloading (0%)           Downloading (100%)
18-Oct-2018 08:26:35   - Installing sebastian/code-unit-reverse-lookup (1.0.1): Downloading (connecting...)Downloading (0%)           Downloading (55%)Downloading (100%)
18-Oct-2018 08:26:35   - Installing phpunit/php-token-stream (1.4.12): Downloading (connecting...)Downloading (0%)           Downloading (5%)Downloading (10%)Downloading (15%)Downloading (20%)Downloading (65%)Downloading (70%)Downloading (75%)Downloading (80%)Downloading (85%)Downloading (90%)Downloading (100%)
18-Oct-2018 08:26:36   - Installing phpunit/php-code-coverage (4.0.8): Downloading (connecting...)Downloading (0%)           Downloading (5%)Downloading (10%)Downloading (15%)Downloading (20%)Downloading (25%)Downloading (30%)Downloading (35%)Downloading (40%)Downloading (45%)Downloading (50%)Downloading (55%)Downloading (60%)Downloading (65%)Downloading (70%)Downloading (75%)Downloading (80%)Downloading (85%)Downloading (90%)Downloading (95%)Downloading (100%)
18-Oct-2018 08:26:37   - Installing phpspec/prophecy (1.8.0): Downloading (connecting...)Downloading (0%)           Downloading (10%)Downloading (20%)Downloading (35%)Downloading (40%)Downloading (50%)Downloading (60%)Downloading (70%)Downloading (75%)Downloading (80%)Downloading (85%)Downloading (90%)Downloading (95%)Downloading (100%)
18-Oct-2018 08:26:38   - Installing myclabs/deep-copy (1.7.0): Downloading (connecting...)Downloading (0%)           Downloading (15%)Downloading (30%)Downloading (55%)Downloading (70%)Downloading (90%)Downloading (100%)
18-Oct-2018 08:26:38   - Installing phpunit/phpunit (5.7.27): Downloading (connecting...)Downloading (0%)           Downloading (5%)Downloading (10%)Downloading (15%)Downloading (20%)Downloading (25%)Downloading (30%)Downloading (35%)Downloading (40%)Downloading (45%)Downloading (50%)Downloading (55%)Downloading (60%)Downloading (65%)Downloading (70%)Downloading (75%)Downloading (80%)Downloading (85%)Downloading (90%)Downloading (95%)Downloading (100%)
18-Oct-2018 08:26:39   - Installing phpunit/dbunit (2.0.3): Downloading (connecting...)Downloading (100%)         
18-Oct-2018 08:26:41   - Installing squizlabs/php_codesniffer (2.9.1): Downloading (connecting...)Downloading (0%)           Downloading (5%)Downloading (10%)Downloading (15%)Downloading (20%)Downloading (25%)Downloading (30%)Downloading (35%)Downloading (40%)Downloading (45%)Downloading (50%)Downloading (55%)Downloading (60%)Downloading (65%)Downloading (70%)Downloading (75%)Downloading (80%)Downloading (85%)Downloading (90%)Downloading (95%)Downloading (100%)
18-Oct-2018 08:26:42 symfony/console suggests installing symfony/lock
18-Oct-2018 08:26:42 lusitanian/oauth suggests installing predis/predis (Allows using the Redis storage backend.)
18-Oct-2018 08:26:42 patchwork/utf8 suggests installing ext-intl (Use Intl for best performance)
18-Oct-2018 08:26:42 patchwork/utf8 suggests installing ext-wfio (Use WFIO for UTF-8 filesystem access on Windows)
18-Oct-2018 08:26:42 s9e/text-formatter suggests installing ext-intl (Allows international URLs to be accepted by the URL filter)
18-Oct-2018 08:26:42 s9e/text-formatter suggests installing ext-xsl (Enables the XSLT renderer)
18-Oct-2018 08:26:42 paragonie/random_compat suggests installing ext-libsodium (Provides a modern crypto API that can be used to generate random bytes.)
18-Oct-2018 08:26:42 symfony/http-kernel suggests installing symfony/var-dumper
18-Oct-2018 08:26:42 symfony/dependency-injection suggests installing symfony/expression-language (For using expressions in service container configuration)
18-Oct-2018 08:26:42 zendframework/zend-eventmanager suggests installing container-interop/container-interop (^1.1.0, to use the lazy listeners feature)
18-Oct-2018 08:26:42 zendframework/zend-eventmanager suggests installing zendframework/zend-stdlib (^2.7.3 || ^3.0, to use the FilterChain feature)
18-Oct-2018 08:26:42 zendframework/zend-code suggests installing doctrine/annotations (Doctrine\Common\Annotations >=1.0 for annotation features)
18-Oct-2018 08:26:42 zendframework/zend-code suggests installing zendframework/zend-stdlib (Zend\Stdlib component)
18-Oct-2018 08:26:42 ocramius/proxy-manager suggests installing ocramius/generated-hydrator (To have very fast object to array to object conversion for ghost objects)
18-Oct-2018 08:26:42 ocramius/proxy-manager suggests installing zendframework/zend-json (To have the JsonRpc adapter (Remote Object feature))
18-Oct-2018 08:26:42 ocramius/proxy-manager suggests installing zendframework/zend-soap (To have the Soap adapter (Remote Object feature))
18-Oct-2018 08:26:42 ocramius/proxy-manager suggests installing zendframework/zend-stdlib (To use the hydrator proxy)
18-Oct-2018 08:26:42 ocramius/proxy-manager suggests installing zendframework/zend-xmlrpc (To have the XmlRpc adapter (Remote Object feature))
18-Oct-2018 08:26:42 symfony/routing suggests installing doctrine/annotations (For using the annotation loader)
18-Oct-2018 08:26:42 symfony/routing suggests installing symfony/expression-language (For using expression matching)
18-Oct-2018 08:26:42 symfony/twig-bridge suggests installing symfony/asset (For using the AssetExtension)
18-Oct-2018 08:26:42 symfony/twig-bridge suggests installing symfony/expression-language (For using the ExpressionExtension)
18-Oct-2018 08:26:42 symfony/twig-bridge suggests installing symfony/form (For using the FormExtension)
18-Oct-2018 08:26:42 symfony/twig-bridge suggests installing symfony/security (For using the SecurityExtension)
18-Oct-2018 08:26:42 symfony/twig-bridge suggests installing symfony/stopwatch (For using the StopwatchExtension)
18-Oct-2018 08:26:42 symfony/twig-bridge suggests installing symfony/templating (For using the TwigEngine)
18-Oct-2018 08:26:42 symfony/twig-bridge suggests installing symfony/translation (For using the TranslationExtension)
18-Oct-2018 08:26:42 symfony/twig-bridge suggests installing symfony/var-dumper (For using the DumpExtension)
18-Oct-2018 08:26:42 symfony/twig-bridge suggests installing symfony/web-link (For using the WebLinkExtension)
18-Oct-2018 08:26:42 facebook/webdriver suggests installing ext-SimpleXML (For Firefox profile creation)
18-Oct-2018 08:26:42 sebastian/global-state suggests installing ext-uopz (*)
18-Oct-2018 08:26:42 phpunit/phpunit-mock-objects suggests installing ext-soap (*)
18-Oct-2018 08:26:42 phpunit/phpunit suggests installing phpunit/php-invoker (~1.1)
18-Oct-2018 08:26:42 Generating autoload files
18-Oct-2018 08:26:43 Buildfile: /data/build/build.xml
18-Oct-2018 08:26:43
18-Oct-2018 08:26:43 phpBB > clean:
18-Oct-2018 08:26:43
18-Oct-2018 08:26:43    [delete] Directory /data/build/logs does not exist or is not a directory.
18-Oct-2018 08:26:43    [delete] Directory /data/build/api does not exist or is not a directory.
18-Oct-2018 08:26:43    [delete] Directory /data/build/codebrowser does not exist or is not a directory.
18-Oct-2018 08:26:43    [delete] Directory /data/build/coverage does not exist or is not a directory.
18-Oct-2018 08:26:43    [delete] Directory /data/build/cpd does not exist or is not a directory.
18-Oct-2018 08:26:43    [delete] Directory /data/build/dependencies does not exist or is not a directory.
18-Oct-2018 08:26:43    [delete] Directory /data/build/new_version does not exist or is not a directory.
18-Oct-2018 08:26:43    [delete] Directory /data/build/old_versions does not exist or is not a directory.
18-Oct-2018 08:26:43    [delete] Directory /data/build/save does not exist or is not a directory.
18-Oct-2018 08:26:43
18-Oct-2018 08:26:43 phpBB > prepare:
18-Oct-2018 08:26:43
18-Oct-2018 08:26:43     [mkdir] Created dir: /data/build/logs
18-Oct-2018 08:26:43     [mkdir] Created dir: /data/build/api
18-Oct-2018 08:26:43     [mkdir] Created dir: /data/build/codebrowser
18-Oct-2018 08:26:43     [mkdir] Created dir: /data/build/coverage
18-Oct-2018 08:26:43     [mkdir] Created dir: /data/build/cpd
18-Oct-2018 08:26:43     [mkdir] Created dir: /data/build/dependencies
18-Oct-2018 08:26:43     [mkdir] Created dir: /data/build/new_version
18-Oct-2018 08:26:43     [mkdir] Created dir: /data/build/new_version/files
18-Oct-2018 08:26:43     [mkdir] Created dir: /data/build/new_version/patches
18-Oct-2018 08:26:43     [mkdir] Created dir: /data/build/new_version/release_files
18-Oct-2018 08:26:43     [mkdir] Created dir: /data/build/new_version/update
18-Oct-2018 08:26:43     [mkdir] Created dir: /data/build/old_versions
18-Oct-2018 08:26:43     [mkdir] Created dir: /data/build/save
18-Oct-2018 08:26:43
18-Oct-2018 08:26:43 BUILD FINISHED
18-Oct-2018 08:26:43
18-Oct-2018 08:26:43 Total time: 0.1033 seconds
18-Oct-2018 08:26:43
18-Oct-2018 08:26:43 Finished task 'Prepare directory' with result: Success
18-Oct-2018 08:26:43 Skipping execution of task 'Run sniffs' as it is disabled
18-Oct-2018 08:26:43
Substituting variable: ${bamboo.working.directory} with /home/bamboo/xml-data/build-dir/PHPBB3-PR-JOB1
18-Oct-2018 08:26:43 Starting task 'Run sniffs' of type 'com.atlassian.bamboo.plugins.bamboo-docker-plugin:task.docker.cli'
18-Oct-2018 08:26:43 Running image name (phpbb:php-5.6)
18-Oct-2018 08:26:43
Beginning to execute external process for build 'phpBB3 - Pull Requests - Build and Test Job #8918 (PHPBB3-PR-JOB1-8918)'
... running command line:
/usr/bin/docker run --volume /home/bamboo/xml-data/build-dir/PHPBB3-PR-JOB1:/data --workdir /data/build --rm -u=991 phpbb:php-5.6 ../phpBB/vendor/bin/phing sniff
... in: /home/bamboo/xml-data/build-dir/PHPBB3-PR-JOB1
... using extra environment variables:
bamboo_planRepository_1_branch=3.1.x
bamboo_planRepository_1_branchDisplayName=3.1.x
bamboo_repository_revision_number=dc8ff9da28b8ab4ad11c7ea94cca526f17c87fe5
bamboo_PRref=master
bamboo_resultsUrl=https://bamboo.phpbb.com/browse/PHPBB3-PR-JOB1-8918
bamboo_capability_system_builder_command_Git=/usr/bin/git
bamboo_repository_75956235_git_username=bantu
bamboo_build_working_directory=/home/bamboo/xml-data/build-dir/PHPBB3-PR-JOB1
bamboo_planRepository_1_name=phpBB Ascraeus
bamboo_buildKey=PHPBB3-PR-JOB1
bamboo_capability_phpbb_tests=true
bamboo_shortPlanName=Pull Requests
bamboo_capability_system_builder_command_fop=/usr/bin/fop
bamboo_capability_dbms_sqlite_2=true
bamboo_planRepository_name=phpBB Ascraeus
bamboo_PRnumber=5351
bamboo_buildNumber=8918
bamboo_repository_75956235_git_repositoryUrl=https://github.com/phpbb/phpbb.git
bamboo_capability_system_builder_phpunit_PHPUnit=/usr/bin/phpunit
bamboo_shortJobName=Build and Test Job
bamboo_buildResultsUrl=https://bamboo.phpbb.com/browse/PHPBB3-PR-JOB1-8918
bamboo_repository_75956235_branch_name=3.1.x
bamboo_planRepository_repositoryUrl=https://github.com/phpbb/phpbb.git
bamboo_agentId=131073
bamboo_planName=phpBB3 - Pull Requests
bamboo_build_commandline_com_atlassian_bamboo_plugins_scripttask_task_builder_script_7=/bin/sh /home/bamboo/temp/PHPBB3-PR-JOB1-8918-ScriptBuildTask-335586744424094268.sh
bamboo_shortPlanKey=PR
bamboo_shortJobKey=JOB1
bamboo_capability_dbms_mysql_55=true
bamboo_capability_system_jdk_JDK_1_7_0_65=/usr/lib/jvm/java-7-openjdk-amd64
bamboo_planRepository_revision=dc8ff9da28b8ab4ad11c7ea94cca526f17c87fe5
bamboo_buildTimeStamp=2018-10-18T08:25:18.664Z
bamboo_repository_previous_revision_number=dc8ff9da28b8ab4ad11c7ea94cca526f17c87fe5
bamboo_capability_system_jdk_JDK_1_6_0_16=/usr/lib/jvm/java-6-sun-1.6.0.16
bamboo_capability_system_builder_mvn2_Maven_2=/usr/share/maven2
bamboo_planRepository_previousRevision=dc8ff9da28b8ab4ad11c7ea94cca526f17c87fe5
bamboo_build_commandline_com_atlassian_bamboo_plugins_scripttask_task_builder_script_4=/bin/sh /home/bamboo/temp/PHPBB3-PR-JOB1-8918-ScriptBuildTask-2451018515074073577.sh
bamboo_repository_git_branch=3.1.x
bamboo_buildResultKey=PHPBB3-PR-JOB1-8918
bamboo_repository_branch_name=3.1.x
bamboo_buildPlanName=phpBB3 - Pull Requests - Build and Test Job
bamboo_planRepository_1_revision=dc8ff9da28b8ab4ad11c7ea94cca526f17c87fe5
bamboo_repository_name=phpBB Ascraeus
bamboo_buildFailed=false
bamboo_capability_system_docker_executable=/usr/bin/docker
bamboo_build_commandline_com_atlassian_bamboo_plugins_bamboo_docker_plugin_task_docker_cli_12=/usr/bin/docker run --volume /home/bamboo/xml-data/build-dir/PHPBB3-PR-JOB1:/data --workdir /data/phpBB --rm -e HOME=/home/bamboo -u=991 phpbb:php-5.6 /bin/bash -c php ../composer.phar install --dev; cd ../build; ../phpBB/vendor/bin/phing clean prepare
bamboo_planRepository_branch=3.1.x
bamboo_agentWorkingDirectory=/home/bamboo/xml-data/build-dir
bamboo_capability_system_git_executable=/usr/bin/git
bamboo_capability_system_builder_phpunit_PHPUnit_3_4=/usr/bin/phpunit
bamboo_repository_git_username=bantu
bamboo_planRepository_1_previousRevision=dc8ff9da28b8ab4ad11c7ea94cca526f17c87fe5
bamboo_repository_75956235_revision_number=dc8ff9da28b8ab4ad11c7ea94cca526f17c87fe5
bamboo_planRepository_branchDisplayName=3.1.x
bamboo_planRepository_1_type=gitv2
bamboo_planRepository_branchName=3.1.x
bamboo_repository_75956235_previous_revision_number=dc8ff9da28b8ab4ad11c7ea94cca526f17c87fe5
bamboo_capability_system_jdk_JDK=/usr/lib/jvm/java-6-sun
bamboo_plan_storageTag=PHPBB3-PR
bamboo_hg_cache_directory=/home/bamboo/xml-data/build-dir/_hg-repositories-cache
bamboo_planRepository_1_username=bantu
bamboo_planRepository_type=gitv2
bamboo_git_cache_directory=/home/bamboo/xml-data/build-dir/_git-repositories-cache
bamboo_ManualBuildTriggerReason_userName=Build Robot
bamboo_repository_git_repositoryUrl=https://github.com/phpbb/phpbb.git
bamboo_repository_75956235_git_branch=3.1.x
bamboo_capability_system_builder_ant_Ant=/usr/share/ant
bamboo_repository_75956235_name=phpBB Ascraeus
bamboo_tmp_directory=/home/bamboo/temp
bamboo_working_directory=/home/bamboo/xml-data/build-dir/PHPBB3-PR-JOB1
bamboo_planKey=PHPBB3-PR
bamboo_capability_local=true
bamboo_planRepository_1_repositoryUrl=https://github.com/phpbb/phpbb.git
bamboo_planRepository_username=bantu
bamboo_capability_system_jdk_JDK_1_6=/usr/lib/jvm/java-6-sun
bamboo_capability_system_jdk_JDK_1_7=/usr/lib/jvm/java-7-openjdk-amd64
bamboo_planRepository_1_branchName=3.1.x
18-Oct-2018 08:26:44 Buildfile: /data/build/build.xml
18-Oct-2018 08:26:44
18-Oct-2018 08:26:44 phpBB > sniff:
18-Oct-2018 08:26:44
18-Oct-2018 08:26:51 ............................................................  60 / 764 (8%)
18-Oct-2018 08:26:52 ............................................................ 120 / 764 (16%)
18-Oct-2018 08:26:53 ............................................................ 180 / 764 (24%)
18-Oct-2018 08:26:54 ............................................................ 240 / 764 (31%)
18-Oct-2018 08:26:56 ............................................................ 300 / 764 (39%)
18-Oct-2018 08:27:02 ............................................................ 360 / 764 (47%)
18-Oct-2018 08:27:08 ............................................................ 420 / 764 (55%)
18-Oct-2018 08:27:11 ............................................................ 480 / 764 (63%)
18-Oct-2018 08:27:15 ............................................................ 540 / 764 (71%)
18-Oct-2018 08:27:19 ............................................................ 600 / 764 (79%)
18-Oct-2018 08:27:24 ......................................................EEE... 660 / 764 (86%)
18-Oct-2018 08:27:28 ............................................................ 720 / 764 (94%)
18-Oct-2018 08:27:29 ............................................
18-Oct-2018 08:27:29
18-Oct-2018 08:27:29
18-Oct-2018 08:27:29 FILE: /data/phpBB/phpbb/privatemessage/compose.php
18-Oct-2018 08:27:29 ----------------------------------------------------------------------
18-Oct-2018 08:27:29 FOUND 41 ERRORS AFFECTING 41 LINES
18-Oct-2018 08:27:29 ----------------------------------------------------------------------
18-Oct-2018 08:27:29   121 | ERROR | [x] Functions must not contain multiple empty lines in a
18-Oct-2018 08:27:29       |       |     row; found 8 empty lines
18-Oct-2018 08:27:29       |       |     (Squiz.WhiteSpace.SuperfluousWhitespace.EmptyLines)
18-Oct-2018 08:27:29   212 | ERROR | [x] Whitespace found at end of line
18-Oct-2018 08:27:29       |       |     (Squiz.WhiteSpace.SuperfluousWhitespace.EndLine)
18-Oct-2018 08:27:29   736 | ERROR | [x] Whitespace found at end of line
18-Oct-2018 08:27:29       |       |     (Squiz.WhiteSpace.SuperfluousWhitespace.EndLine)
18-Oct-2018 08:27:29 1191 | ERROR | [x] Whitespace found at end of line
18-Oct-2018 08:27:29       |       |     (Squiz.WhiteSpace.SuperfluousWhitespace.EndLine)
18-Oct-2018 08:27:29 1301 | ERROR | [x] Whitespace found at end of line
18-Oct-2018 08:27:29       |       |     (Squiz.WhiteSpace.SuperfluousWhitespace.EndLine)
18-Oct-2018 08:27:29 1306 | ERROR | [x] Whitespace found at end of line
18-Oct-2018 08:27:29       |       |     (Squiz.WhiteSpace.SuperfluousWhitespace.EndLine)
18-Oct-2018 08:27:29 1312 | ERROR | [x] Whitespace found at end of line
18-Oct-2018 08:27:29       |       |     (Squiz.WhiteSpace.SuperfluousWhitespace.EndLine)
18-Oct-2018 08:27:29 1325 | ERROR | [x] Whitespace found at end of line
18-Oct-2018 08:27:29       |       |     (Squiz.WhiteSpace.SuperfluousWhitespace.EndLine)
18-Oct-2018 08:27:29 1354 | ERROR | [x] Whitespace found at end of line
18-Oct-2018 08:27:29       |       |     (Squiz.WhiteSpace.SuperfluousWhitespace.EndLine)
18-Oct-2018 08:27:29 1360 | ERROR | [x] Whitespace found at end of line
18-Oct-2018 08:27:29       |       |     (Squiz.WhiteSpace.SuperfluousWhitespace.EndLine)
18-Oct-2018 08:27:29 1365 | ERROR | [x] Whitespace found at end of line
18-Oct-2018 08:27:29       |       |     (Squiz.WhiteSpace.SuperfluousWhitespace.EndLine)
18-Oct-2018 08:27:29 1371 | ERROR | [x] Whitespace found at end of line
18-Oct-2018 08:27:29       |       |     (Squiz.WhiteSpace.SuperfluousWhitespace.EndLine)
18-Oct-2018 08:27:29 1374 | ERROR | [x] Whitespace found at end of line
18-Oct-2018 08:27:29       |       |     (Squiz.WhiteSpace.SuperfluousWhitespace.EndLine)
18-Oct-2018 08:27:29 1378 | ERROR | [x] Whitespace found at end of line
18-Oct-2018 08:27:29       |       |     (Squiz.WhiteSpace.SuperfluousWhitespace.EndLine)
18-Oct-2018 08:27:29 1384 | ERROR | [x] Whitespace found at end of line
18-Oct-2018 08:27:29       |       |     (Squiz.WhiteSpace.SuperfluousWhitespace.EndLine)
18-Oct-2018 08:27:29 1389 | ERROR | [x] Whitespace found at end of line
18-Oct-2018 08:27:29       |       |     (Squiz.WhiteSpace.SuperfluousWhitespace.EndLine)
18-Oct-2018 08:27:29 1392 | ERROR | [x] Whitespace found at end of line
18-Oct-2018 08:27:29       |       |     (Squiz.WhiteSpace.SuperfluousWhitespace.EndLine)
18-Oct-2018 08:27:29 1399 | ERROR | [x] Whitespace found at end of line
18-Oct-2018 08:27:29       |       |     (Squiz.WhiteSpace.SuperfluousWhitespace.EndLine)
18-Oct-2018 08:27:29 1404 | ERROR | [x] Whitespace found at end of line
18-Oct-2018 08:27:29       |       |     (Squiz.WhiteSpace.SuperfluousWhitespace.EndLine)
18-Oct-2018 08:27:29 1412 | ERROR | [x] Whitespace found at end of line
18-Oct-2018 08:27:29       |       |     (Squiz.WhiteSpace.SuperfluousWhitespace.EndLine)
18-Oct-2018 08:27:29 1415 | ERROR | [x] Whitespace found at end of line
18-Oct-2018 08:27:29       |       |     (Squiz.WhiteSpace.SuperfluousWhitespace.EndLine)
18-Oct-2018 08:27:29 1426 | ERROR | [x] Whitespace found at end of line
18-Oct-2018 08:27:29       |       |     (Squiz.WhiteSpace.SuperfluousWhitespace.EndLine)
18-Oct-2018 08:27:29 1433 | ERROR | [x] Whitespace found at end of line
18-Oct-2018 08:27:29       |       |     (Squiz.WhiteSpace.SuperfluousWhitespace.EndLine)
18-Oct-2018 08:27:29 1437 | ERROR | [x] Whitespace found at end of line
18-Oct-2018 08:27:29       |       |     (Squiz.WhiteSpace.SuperfluousWhitespace.EndLine)
18-Oct-2018 08:27:29 1444 | ERROR | [x] Whitespace found at end of line
18-Oct-2018 08:27:29       |       |     (Squiz.WhiteSpace.SuperfluousWhitespace.EndLine)
18-Oct-2018 08:27:29 1448 | ERROR | [x] Whitespace found at end of line
18-Oct-2018 08:27:29       |       |     (Squiz.WhiteSpace.SuperfluousWhitespace.EndLine)
18-Oct-2018 08:27:29 1453 | ERROR | [x] Whitespace found at end of line
18-Oct-2018 08:27:29       |       |     (Squiz.WhiteSpace.SuperfluousWhitespace.EndLine)
18-Oct-2018 08:27:29 1466 | ERROR | [x] Whitespace found at end of line
18-Oct-2018 08:27:29       |       |     (Squiz.WhiteSpace.SuperfluousWhitespace.EndLine)
18-Oct-2018 08:27:29 1468 | ERROR | [x] Whitespace found at end of line
18-Oct-2018 08:27:29       |       |     (Squiz.WhiteSpace.SuperfluousWhitespace.EndLine)
18-Oct-2018 08:27:29 1480 | ERROR | [x] Whitespace found at end of line
18-Oct-2018 08:27:29       |       |     (Squiz.WhiteSpace.SuperfluousWhitespace.EndLine)
18-Oct-2018 08:27:29 1484 | ERROR | [x] Whitespace found at end of line
18-Oct-2018 08:27:29       |       |     (Squiz.WhiteSpace.SuperfluousWhitespace.EndLine)
18-Oct-2018 08:27:29 1490 | ERROR | [x] Whitespace found at end of line
18-Oct-2018 08:27:29       |       |     (Squiz.WhiteSpace.SuperfluousWhitespace.EndLine)
18-Oct-2018 08:27:29 1496 | ERROR | [x] Whitespace found at end of line
18-Oct-2018 08:27:29       |       |     (Squiz.WhiteSpace.SuperfluousWhitespace.EndLine)
18-Oct-2018 08:27:29 1501 | ERROR | [x] Whitespace found at end of line
18-Oct-2018 08:27:29       |       |     (Squiz.WhiteSpace.SuperfluousWhitespace.EndLine)
18-Oct-2018 08:27:29 1512 | ERROR | [x] Whitespace found at end of line
18-Oct-2018 08:27:29       |       |     (Squiz.WhiteSpace.SuperfluousWhitespace.EndLine)
18-Oct-2018 08:27:29 1515 | ERROR | [x] Whitespace found at end of line
18-Oct-2018 08:27:29       |       |     (Squiz.WhiteSpace.SuperfluousWhitespace.EndLine)
18-Oct-2018 08:27:29 1529 | ERROR | [x] Whitespace found at end of line
18-Oct-2018 08:27:29       |       |     (Squiz.WhiteSpace.SuperfluousWhitespace.EndLine)
18-Oct-2018 08:27:29 1538 | ERROR | [x] Whitespace found at end of line
18-Oct-2018 08:27:29       |       |     (Squiz.WhiteSpace.SuperfluousWhitespace.EndLine)
18-Oct-2018 08:27:29 1543 | ERROR | [x] Whitespace found at end of line
18-Oct-2018 08:27:29       |       |     (Squiz.WhiteSpace.SuperfluousWhitespace.EndLine)
18-Oct-2018 08:27:29 1550 | ERROR | [x] Whitespace found at end of line
18-Oct-2018 08:27:29       |       |     (Squiz.WhiteSpace.SuperfluousWhitespace.EndLine)
18-Oct-2018 08:27:29 1564 | ERROR | [x] Whitespace found at end of line
18-Oct-2018 08:27:29       |       |     (Squiz.WhiteSpace.SuperfluousWhitespace.EndLine)
18-Oct-2018 08:27:29 ----------------------------------------------------------------------
18-Oct-2018 08:27:29 PHPCBF CAN FIX THE 41 MARKED SNIFF VIOLATIONS AUTOMATICALLY
18-Oct-2018 08:27:29 ----------------------------------------------------------------------
18-Oct-2018 08:27:29
18-Oct-2018 08:27:29
18-Oct-2018 08:27:29 FILE: /data/phpBB/phpbb/privatemessage/view.php
18-Oct-2018 08:27:29 ----------------------------------------------------------------------
18-Oct-2018 08:27:29 FOUND 3 ERRORS AFFECTING 3 LINES
18-Oct-2018 08:27:29 ----------------------------------------------------------------------
18-Oct-2018 08:27:29 103 | ERROR | [x] Expected 1 space between type hint and argument
18-Oct-2018 08:27:29      |       |     "$group_helper"; 2 found
18-Oct-2018 08:27:29      |       |     (Squiz.Functions.FunctionDeclarationArgumentSpacing.SpacingAfterHint)
18-Oct-2018 08:27:29 269 | ERROR | [x] Whitespace found at end of line
18-Oct-2018 08:27:29      |       |     (Squiz.WhiteSpace.SuperfluousWhitespace.EndLine)
18-Oct-2018 08:27:29 372 | ERROR | [x] Whitespace found at end of line
18-Oct-2018 08:27:29      |       |     (Squiz.WhiteSpace.SuperfluousWhitespace.EndLine)
18-Oct-2018 08:27:29 ----------------------------------------------------------------------
18-Oct-2018 08:27:29 PHPCBF CAN FIX THE 3 MARKED SNIFF VIOLATIONS AUTOMATICALLY
18-Oct-2018 08:27:29 ----------------------------------------------------------------------
18-Oct-2018 08:27:29
18-Oct-2018 08:27:29
18-Oct-2018 08:27:29 FILE: /data/phpBB/phpbb/privatemessage/helper.php
18-Oct-2018 08:27:29 ----------------------------------------------------------------------
18-Oct-2018 08:27:29 FOUND 4 ERRORS AFFECTING 4 LINES
18-Oct-2018 08:27:29 ----------------------------------------------------------------------
18-Oct-2018 08:27:29 21 | ERROR | [x] Whitespace found at end of line
18-Oct-2018 08:27:29     |       |     (Squiz.WhiteSpace.SuperfluousWhitespace.EndLine)
18-Oct-2018 08:27:29 26 | ERROR | [x] Whitespace found at end of line
18-Oct-2018 08:27:29     |       |     (Squiz.WhiteSpace.SuperfluousWhitespace.EndLine)
18-Oct-2018 08:27:29 32 | ERROR | [x] Whitespace found at end of line
18-Oct-2018 08:27:29     |       |     (Squiz.WhiteSpace.SuperfluousWhitespace.EndLine)
18-Oct-2018 08:27:29 45 | ERROR | [x] Whitespace found at end of line
18-Oct-2018 08:27:29     |       |     (Squiz.WhiteSpace.SuperfluousWhitespace.EndLine)
18-Oct-2018 08:27:29 ----------------------------------------------------------------------
18-Oct-2018 08:27:29 PHPCBF CAN FIX THE 4 MARKED SNIFF VIOLATIONS AUTOMATICALLY
18-Oct-2018 08:27:29 ----------------------------------------------------------------------
18-Oct-2018 08:27:29
18-Oct-2018 08:27:29 Time: 45.37 secs; Memory: 64.25Mb
18-Oct-2018 08:27:29
18-Oct-2018 08:27:37 ............................................................  60 / 208 (29%)
18-Oct-2018 08:27:55 ........E................................................... 120 / 208 (58%)
18-Oct-2018 08:28:08 ............................................................ 180 / 208 (87%)
18-Oct-2018 08:28:15 .................E..........
18-Oct-2018 08:28:15
18-Oct-2018 08:28:15
18-Oct-2018 08:28:15 FILE: /data/phpBB/includes/functions_privmsgs.php
18-Oct-2018 08:28:15 ----------------------------------------------------------------------
18-Oct-2018 08:28:15 FOUND 2 ERRORS AFFECTING 1 LINE
18-Oct-2018 08:28:15 ----------------------------------------------------------------------
18-Oct-2018 08:28:15 1625 | ERROR | [x] Expected 1 space between comma and argument
18-Oct-2018 08:28:15       |       |     "$sql_limit"; 0 found
18-Oct-2018 08:28:15       |       |     (Squiz.Functions.FunctionDeclarationArgumentSpacing.NoSpaceBeforeArg)
18-Oct-2018 08:28:15 1625 | ERROR | [x] Expected 1 space between comma and argument
18-Oct-2018 08:28:15       |       |     "$sql_start"; 0 found
18-Oct-2018 08:28:15       |       |     (Squiz.Functions.FunctionDeclarationArgumentSpacing.NoSpaceBeforeArg)
18-Oct-2018 08:28:15 ----------------------------------------------------------------------
18-Oct-2018 08:28:15 PHPCBF CAN FIX THE 2 MARKED SNIFF VIOLATIONS AUTOMATICALLY
18-Oct-2018 08:28:15 ----------------------------------------------------------------------
18-Oct-2018 08:28:15
18-Oct-2018 08:28:15
18-Oct-2018 08:28:15 FILE: /data/phpBB/includes/ucp/ucp_pm.php
18-Oct-2018 08:28:15 ----------------------------------------------------------------------
18-Oct-2018 08:28:15 FOUND 1 ERROR AFFECTING 1 LINE
18-Oct-2018 08:28:15 ----------------------------------------------------------------------
18-Oct-2018 08:28:15 52 | ERROR | [x] Functions must not contain multiple empty lines in a
18-Oct-2018 08:28:15     |       |     row; found 11 empty lines
18-Oct-2018 08:28:15     |       |     (Squiz.WhiteSpace.SuperfluousWhitespace.EmptyLines)
18-Oct-2018 08:28:15 ----------------------------------------------------------------------
18-Oct-2018 08:28:15 PHPCBF CAN FIX THE 1 MARKED SNIFF VIOLATIONS AUTOMATICALLY
18-Oct-2018 08:28:15 ----------------------------------------------------------------------
18-Oct-2018 08:28:15
18-Oct-2018 08:28:15 Time: 45.29 secs; Memory: 61Mb
18-Oct-2018 08:28:15
18-Oct-2018 08:28:15
18-Oct-2018 08:28:15
18-Oct-2018 08:28:15 Time: 19ms; Memory: 3.75Mb
18-Oct-2018 08:28:15
18-Oct-2018 08:28:15        [if] Error in IfTask
18-Oct-2018 08:28:15 Execution of target "sniff" failed for the following reason: /data/build/build.xml:109:6: /data/build/build.xml:115:9: PHP Code Sniffer failed.
18-Oct-2018 08:28:15
18-Oct-2018 08:28:15 BUILD FAILED
18-Oct-2018 08:28:15 /data/build/build.xml:109:6: /data/build/build.xml:115:9: PHP Code Sniffer failed.
18-Oct-2018 08:28:15 Total time: 2 minutes  31.04 seconds
18-Oct-2018 08:28:15
18-Oct-2018 08:28:15 Error occurred while running Task 'Run sniffs(11)' of type com.atlassian.bamboo.plugins.bamboo-docker-plugin:task.docker.cli.
18-Oct-2018 08:28:15 com.atlassian.bamboo.task.TaskException: Failed to execute task
18-Oct-2018 08:28:15         at com.atlassian.bamboo.plugins.docker.service.RunService.execute(RunService.java:75)
18-Oct-2018 08:28:15         at com.atlassian.bamboo.plugins.docker.tasks.cli.DockerCliTask.execute(DockerCliTask.java:70)
18-Oct-2018 08:28:15         at com.atlassian.bamboo.task.TaskExecutorImpl.lambda$executeTasks$3(TaskExecutorImpl.java:285)
18-Oct-2018 08:28:15         at com.atlassian.bamboo.task.TaskExecutorImpl.executeTaskWithPrePostActions(TaskExecutorImpl.java:224)
18-Oct-2018 08:28:15         at com.atlassian.bamboo.task.TaskExecutorImpl.executeTasks(TaskExecutorImpl.java:285)
18-Oct-2018 08:28:15         at com.atlassian.bamboo.task.TaskExecutorImpl.execute(TaskExecutorImpl.java:112)
18-Oct-2018 08:28:15         at com.atlassian.bamboo.build.pipeline.tasks.ExecuteBuildTask.call(ExecuteBuildTask.java:71)
18-Oct-2018 08:28:15         at com.atlassian.bamboo.v2.build.agent.DefaultBuildAgent.executeBuildPhase(DefaultBuildAgent.java:203)
18-Oct-2018 08:28:15         at com.atlassian.bamboo.v2.build.agent.DefaultBuildAgent.build(DefaultBuildAgent.java:175)
18-Oct-2018 08:28:15         at com.atlassian.bamboo.v2.build.agent.BuildAgentControllerImpl.lambda$waitAndPerformBuild$0(BuildAgentControllerImpl.java:122)
18-Oct-2018 08:28:15         at com.atlassian.bamboo.variable.CustomVariableContextImpl.withVariableSubstitutor(CustomVariableContextImpl.java:185)
18-Oct-2018 08:28:15         at com.atlassian.bamboo.v2.build.agent.BuildAgentControllerImpl.waitAndPerformBuild(BuildAgentControllerImpl.java:117)
18-Oct-2018 08:28:15         at com.atlassian.bamboo.v2.build.agent.DefaultBuildAgent$1.run(DefaultBuildAgent.java:126)
18-Oct-2018 08:28:15         at com.atlassian.bamboo.utils.BambooRunnables$1.run(BambooRunnables.java:48)
18-Oct-2018 08:28:15         at com.atlassian.bamboo.security.ImpersonationHelper.runWith(ImpersonationHelper.java:26)
18-Oct-2018 08:28:15         at com.atlassian.bamboo.security.ImpersonationHelper.runWithSystemAuthority(ImpersonationHelper.java:17)
18-Oct-2018 08:28:15         at com.atlassian.bamboo.security.ImpersonationHelper$1.run(ImpersonationHelper.java:41)
18-Oct-2018 08:28:15         at java.lang.Thread.run(Thread.java:748)
18-Oct-2018 08:28:15 Caused by: com.atlassian.bamboo.docker.DockerException: Error running Docker run command
18-Oct-2018 08:28:15         at com.atlassian.bamboo.docker.DockerContainerServiceImpl.run(DockerContainerServiceImpl.java:118)
18-Oct-2018 08:28:15         at sun.reflect.GeneratedMethodAccessor2070.invoke(Unknown Source)
18-Oct-2018 08:28:15         at sun.reflect.DelegatingMethodAccessorImpl.invoke(DelegatingMethodAccessorImpl.java:43)
18-Oct-2018 08:28:15         at java.lang.reflect.Method.invoke(Method.java:498)
18-Oct-2018 08:28:15         at com.atlassian.plugin.util.ContextClassLoaderSettingInvocationHandler.invoke(ContextClassLoaderSettingInvocationHandler.java:26)
18-Oct-2018 08:28:15         at com.sun.proxy.$Proxy401.run(Unknown Source)
18-Oct-2018 08:28:15         at sun.reflect.GeneratedMethodAccessor2070.invoke(Unknown Source)
18-Oct-2018 08:28:15         at sun.reflect.DelegatingMethodAccessorImpl.invoke(DelegatingMethodAccessorImpl.java:43)
18-Oct-2018 08:28:15         at java.lang.reflect.Method.invoke(Method.java:498)
18-Oct-2018 08:28:15         at org.springframework.aop.support.AopUtils.invokeJoinpointUsingReflection(AopUtils.java:302)
18-Oct-2018 08:28:15         at org.eclipse.gemini.blueprint.service.importer.support.internal.aop.ServiceInvoker.doInvoke(ServiceInvoker.java:56)
18-Oct-2018 08:28:15         at org.eclipse.gemini.blueprint.service.importer.support.internal.aop.ServiceInvoker.invoke(ServiceInvoker.java:60)
18-Oct-2018 08:28:15         at org.springframework.aop.framework.ReflectiveMethodInvocation.proceed(ReflectiveMethodInvocation.java:179)
18-Oct-2018 08:28:15         at org.springframework.aop.support.DelegatingIntroductionInterceptor.doProceed(DelegatingIntroductionInterceptor.java:133)
18-Oct-2018 08:28:15         at org.springframework.aop.support.DelegatingIntroductionInterceptor.invoke(DelegatingIntroductionInterceptor.java:121)
18-Oct-2018 08:28:15         at org.springframework.aop.framework.ReflectiveMethodInvocation.proceed(ReflectiveMethodInvocation.java:179)
18-Oct-2018 08:28:15         at org.eclipse.gemini.blueprint.service.util.internal.aop.ServiceTCCLInterceptor.invokeUnprivileged(ServiceTCCLInterceptor.java:70)
18-Oct-2018 08:28:15         at org.eclipse.gemini.blueprint.service.util.internal.aop.ServiceTCCLInterceptor.invoke(ServiceTCCLInterceptor.java:53)
18-Oct-2018 08:28:15         at org.springframework.aop.framework.ReflectiveMethodInvocation.proceed(ReflectiveMethodInvocation.java:179)
18-Oct-2018 08:28:15         at org.eclipse.gemini.blueprint.service.importer.support.LocalBundleContextAdvice.invoke(LocalBundleContextAdvice.java:57)
18-Oct-2018 08:28:15         at org.springframework.aop.framework.ReflectiveMethodInvocation.proceed(ReflectiveMethodInvocation.java:179)
18-Oct-2018 08:28:15         at org.springframework.aop.support.DelegatingIntroductionInterceptor.doProceed(DelegatingIntroductionInterceptor.java:133)
18-Oct-2018 08:28:15         at org.springframework.aop.support.DelegatingIntroductionInterceptor.invoke(DelegatingIntroductionInterceptor.java:121)
18-Oct-2018 08:28:15         at org.springframework.aop.framework.ReflectiveMethodInvocation.proceed(ReflectiveMethodInvocation.java:179)
18-Oct-2018 08:28:15         at org.springframework.aop.framework.JdkDynamicAopProxy.invoke(JdkDynamicAopProxy.java:207)
18-Oct-2018 08:28:15         at com.sun.proxy.$Proxy667.run(Unknown Source)
18-Oct-2018 08:28:15         at com.atlassian.bamboo.plugins.docker.client.DockerCmd.run(DockerCmd.java:51)
18-Oct-2018 08:28:15         at com.atlassian.bamboo.plugins.docker.service.RunService.execute(RunService.java:64)
18-Oct-2018 08:28:15         ... 17 more
18-Oct-2018 08:28:15 Caused by: com.atlassian.utils.process.ProcessException: Error executing /usr/bin/docker run --volume /home/bamboo/xml-data/build-dir/PHPBB3-PR-JOB1:/data --workdir /data/build --rm -u=991 phpbb:php-5.6 ../phpBB/vendor/bin/phing sniff
18-Oct-2018 08:28:15         at com.atlassian.bamboo.docker.DockerContainerServiceImpl.execute(DockerContainerServiceImpl.java:252)
18-Oct-2018 08:28:15         at com.atlassian.bamboo.docker.DockerContainerServiceImpl.run(DockerContainerServiceImpl.java:106)
18-Oct-2018 08:28:15         ... 44 more
18-Oct-2018 08:28:15 Starting task 'Parsing test results produced by script' of type 'com.atlassian.bamboo.plugins.testresultparser:task.testresultparser.junit'
18-Oct-2018 08:28:15 Parsing test results under /home/bamboo/xml-data/build-dir/PHPBB3-PR-JOB1...
18-Oct-2018 08:28:15 Failing task since test cases were expected but none were found.
18-Oct-2018 08:28:15 Finished task 'Parsing test results produced by script' with result: Failed
18-Oct-2018 08:28:15
Substituting variable: ${bamboo.PRnumber} with 5351
18-Oct-2018 08:28:15
Substituting variable: ${bamboo.buildResultsUrl} with https://bamboo.phpbb.com/browse/PHPBB3-PR-JOB1-8918
18-Oct-2018 08:28:15
Substituting variable: ${bamboo.buildResultsUrl} with https://bamboo.phpbb.com/browse/PHPBB3-PR-JOB1-8918
18-Oct-2018 08:28:15 Starting task 'Set result build status' of type 'com.atlassian.bamboo.plugins.scripttask:task.builder.script'
18-Oct-2018 08:28:15
Beginning to execute external process for build 'phpBB3 - Pull Requests - Build and Test Job #8918 (PHPBB3-PR-JOB1-8918)'
... running command line:
/bin/sh /home/bamboo/temp/PHPBB3-PR-JOB1-8918-ScriptBuildTask-2527074593301349714.sh
... in: /home/bamboo/xml-data/build-dir/PHPBB3-PR-JOB1
... using extra environment variables:
bamboo_planRepository_1_branch=3.1.x
bamboo_planRepository_1_branchDisplayName=3.1.x
bamboo_repository_revision_number=dc8ff9da28b8ab4ad11c7ea94cca526f17c87fe5
bamboo_PRref=master
bamboo_resultsUrl=https://bamboo.phpbb.com/browse/PHPBB3-PR-JOB1-8918
bamboo_capability_system_builder_command_Git=/usr/bin/git
bamboo_repository_75956235_git_username=bantu
bamboo_build_working_directory=/home/bamboo/xml-data/build-dir/PHPBB3-PR-JOB1
bamboo_planRepository_1_name=phpBB Ascraeus
bamboo_buildKey=PHPBB3-PR-JOB1
bamboo_capability_phpbb_tests=true
bamboo_shortPlanName=Pull Requests
bamboo_capability_system_builder_command_fop=/usr/bin/fop
bamboo_capability_dbms_sqlite_2=true
bamboo_planRepository_name=phpBB Ascraeus
bamboo_PRnumber=5351
bamboo_buildNumber=8918
bamboo_repository_75956235_git_repositoryUrl=https://github.com/phpbb/phpbb.git
bamboo_capability_system_builder_phpunit_PHPUnit=/usr/bin/phpunit
bamboo_shortJobName=Build and Test Job
bamboo_buildResultsUrl=https://bamboo.phpbb.com/browse/PHPBB3-PR-JOB1-8918
bamboo_repository_75956235_branch_name=3.1.x
bamboo_planRepository_repositoryUrl=https://github.com/phpbb/phpbb.git
bamboo_agentId=131073
bamboo_planName=phpBB3 - Pull Requests
bamboo_build_commandline_com_atlassian_bamboo_plugins_scripttask_task_builder_script_7=/bin/sh /home/bamboo/temp/PHPBB3-PR-JOB1-8918-ScriptBuildTask-335586744424094268.sh
bamboo_shortPlanKey=PR
bamboo_shortJobKey=JOB1
bamboo_capability_dbms_mysql_55=true
bamboo_capability_system_jdk_JDK_1_7_0_65=/usr/lib/jvm/java-7-openjdk-amd64
bamboo_planRepository_revision=dc8ff9da28b8ab4ad11c7ea94cca526f17c87fe5
bamboo_buildTimeStamp=2018-10-18T08:25:18.664Z
bamboo_repository_previous_revision_number=dc8ff9da28b8ab4ad11c7ea94cca526f17c87fe5
bamboo_capability_system_jdk_JDK_1_6_0_16=/usr/lib/jvm/java-6-sun-1.6.0.16
bamboo_capability_system_builder_mvn2_Maven_2=/usr/share/maven2
bamboo_planRepository_previousRevision=dc8ff9da28b8ab4ad11c7ea94cca526f17c87fe5
bamboo_build_commandline_com_atlassian_bamboo_plugins_scripttask_task_builder_script_4=/bin/sh /home/bamboo/temp/PHPBB3-PR-JOB1-8918-ScriptBuildTask-2451018515074073577.sh
bamboo_repository_git_branch=3.1.x
bamboo_buildResultKey=PHPBB3-PR-JOB1-8918
bamboo_repository_branch_name=3.1.x
bamboo_buildPlanName=phpBB3 - Pull Requests - Build and Test Job
bamboo_planRepository_1_revision=dc8ff9da28b8ab4ad11c7ea94cca526f17c87fe5
bamboo_repository_name=phpBB Ascraeus
bamboo_buildFailed=true
bamboo_capability_system_docker_executable=/usr/bin/docker
bamboo_build_commandline_com_atlassian_bamboo_plugins_bamboo_docker_plugin_task_docker_cli_11=/usr/bin/docker run --volume /home/bamboo/xml-data/build-dir/PHPBB3-PR-JOB1:/data --workdir /data/build --rm -u=991 phpbb:php-5.6 ../phpBB/vendor/bin/phing sniff
bamboo_build_commandline_com_atlassian_bamboo_plugins_bamboo_docker_plugin_task_docker_cli_12=/usr/bin/docker run --volume /home/bamboo/xml-data/build-dir/PHPBB3-PR-JOB1:/data --workdir /data/phpBB --rm -e HOME=/home/bamboo -u=991 phpbb:php-5.6 /bin/bash -c php ../composer.phar install --dev; cd ../build; ../phpBB/vendor/bin/phing clean prepare
bamboo_planRepository_branch=3.1.x
bamboo_agentWorkingDirectory=/home/bamboo/xml-data/build-dir
bamboo_jobFailed=true
bamboo_capability_system_git_executable=/usr/bin/git
bamboo_capability_system_builder_phpunit_PHPUnit_3_4=/usr/bin/phpunit
bamboo_repository_git_username=bantu
bamboo_planRepository_1_previousRevision=dc8ff9da28b8ab4ad11c7ea94cca526f17c87fe5
bamboo_repository_75956235_revision_number=dc8ff9da28b8ab4ad11c7ea94cca526f17c87fe5
bamboo_planRepository_branchDisplayName=3.1.x
bamboo_planRepository_1_type=gitv2
bamboo_planRepository_branchName=3.1.x
bamboo_repository_75956235_previous_revision_number=dc8ff9da28b8ab4ad11c7ea94cca526f17c87fe5
bamboo_capability_system_jdk_JDK=/usr/lib/jvm/java-6-sun
bamboo_plan_storageTag=PHPBB3-PR
bamboo_hg_cache_directory=/home/bamboo/xml-data/build-dir/_hg-repositories-cache
bamboo_planRepository_1_username=bantu
bamboo_planRepository_type=gitv2
bamboo_git_cache_directory=/home/bamboo/xml-data/build-dir/_git-repositories-cache
bamboo_ManualBuildTriggerReason_userName=Build Robot
bamboo_repository_git_repositoryUrl=https://github.com/phpbb/phpbb.git
bamboo_repository_75956235_git_branch=3.1.x
bamboo_capability_system_builder_ant_Ant=/usr/share/ant
bamboo_repository_75956235_name=phpBB Ascraeus
bamboo_tmp_directory=/home/bamboo/temp
bamboo_working_directory=/home/bamboo/xml-data/build-dir/PHPBB3-PR-JOB1
bamboo_planKey=PHPBB3-PR
bamboo_capability_local=true
bamboo_planRepository_1_repositoryUrl=https://github.com/phpbb/phpbb.git
bamboo_planRepository_username=bantu
bamboo_capability_system_jdk_JDK_1_6=/usr/lib/jvm/java-6-sun
bamboo_capability_system_jdk_JDK_1_7=/usr/lib/jvm/java-7-openjdk-amd64
bamboo_planRepository_1_branchName=3.1.x
18-Oct-2018 08:28:15 From https://github.com/phpbb/phpbb
18-Oct-2018 08:28:15 * branch            refs/pull/5351/head -> FETCH_HEAD
18-Oct-2018 08:28:15 grep: build/logs/phpunit.xml: No such file or directory
18-Oct-2018 08:28:15 grep: build/logs/phpunit.xml: No such file or directory
18-Oct-2018 08:28:15   % Total    % Received % Xferd  Average Speed   Time    Time     Time  Current
18-Oct-2018 08:28:15                                  Dload  Upload   Total   Spent    Left  Speed
18-Oct-2018 08:28:15
18-Oct-2018 08:28:16   0     0    0     0    0     0      0      0 --:--:-- --:--:-- --:--:--     0
18-Oct-2018 08:28:16 100   273  100    93  100   180    311    602 --:--:-- --:--:-- --:--:--   604
18-Oct-2018 08:28:16 Finished task 'Set result build status' with result: Success
18-Oct-2018 08:28:16 Running post build plugin 'NCover Results Collector'
18-Oct-2018 08:28:16 Running post build plugin 'Artifact Copier'
18-Oct-2018 08:28:16 Running post build plugin 'npm Cache Cleanup'
18-Oct-2018 08:28:16 Running post build plugin 'Clover Results Collector'
18-Oct-2018 08:28:16 Running post build plugin 'Docker Container Cleanup'
18-Oct-2018 08:28:16 Successfully removed working directory at '/home/bamboo/xml-data/build-dir/PHPBB3-PR-JOB1'
18-Oct-2018 08:28:16 Finalising the build...
18-Oct-2018 08:28:16 Stopping timer.
18-Oct-2018 08:28:16 Build PHPBB3-PR-JOB1-8918 completed.
18-Oct-2018 08:28:16 Running on server: post build plugin 'NCover Results Collector'
18-Oct-2018 08:28:16 Running on server: post build plugin 'Build Hanging Detection Configuration'
18-Oct-2018 08:28:16 Running on server: post build plugin 'Clover Delta Calculator'
18-Oct-2018 08:28:16 Running on server: post build plugin 'Maven Dependencies Postprocessor'
18-Oct-2018 08:28:16 All post build plugins have finished
18-Oct-2018 08:28:16 Generating build results summary...
18-Oct-2018 08:28:16 Saving build results to disk...
18-Oct-2018 08:28:16 Logging substituted variables...
18-Oct-2018 08:28:16 Indexing build results...
18-Oct-2018 08:28:16 Finished building PHPBB3-PR-JOB1-8918.
18-Oct-2018 08:28:17
Substituting variable: ${bamboo.PRnumber} with 5351