Tests pending pull requests

Build: #8920 failed

Job: Build and Test Job failed

Stages & jobs

  1. Build and Test

Build log

The build generated 358 lines of output. Download or view full build log

18-Oct-2018 09:16:39 Build phpBB3 - Pull Requests - Build and Test Job #8920 (PHPBB3-PR-JOB1-8920) started building on agent Default Agent
18-Oct-2018 09:16:39
18-Oct-2018 09:16:39 Build working directory is /home/bamboo/xml-data/build-dir/PHPBB3-PR-JOB1
18-Oct-2018 09:16:39 Executing build phpBB3 - Pull Requests - Build and Test Job #8920 (PHPBB3-PR-JOB1-8920)
18-Oct-2018 09:16:39 Starting task 'Checkout develop branch' of type 'com.atlassian.bamboo.plugins.vcs:task.vcs.checkout'
18-Oct-2018 09:16:39 Build always requires a clean checkout
18-Oct-2018 09:16:39 Cleaning build directory '/home/bamboo/xml-data/build-dir/PHPBB3-PR-JOB1'
18-Oct-2018 09:16:39 Checking out into /home/bamboo/xml-data/build-dir/PHPBB3-PR-JOB1
18-Oct-2018 09:16:39 Updating source code to revision: dc8ff9da28b8ab4ad11c7ea94cca526f17c87fe5
18-Oct-2018 09:16:39 Fetching 'refs/heads/3.1.x' from 'https://github.com/phpbb/phpbb.git'.
18-Oct-2018 09:16:40 Checking out revision dc8ff9da28b8ab4ad11c7ea94cca526f17c87fe5.
18-Oct-2018 09:16:40 Creating local git repository in '/home/bamboo/xml-data/build-dir/PHPBB3-PR-JOB1/.git'.
18-Oct-2018 09:16:40 Cloning into '/home/bamboo/xml-data/build-dir/PHPBB3-PR-JOB1'...
18-Oct-2018 09:16:40 done.
18-Oct-2018 09:16:42 Branch 3.1.x set up to track remote branch 3.1.x from origin.
18-Oct-2018 09:16:42 Switched to a new branch '3.1.x'
18-Oct-2018 09:16:42 Updated source code to revision: dc8ff9da28b8ab4ad11c7ea94cca526f17c87fe5
18-Oct-2018 09:16:42 Finished task 'Checkout develop branch' with result: Success
18-Oct-2018 09:16:42 Running pre-build action: VCS Version Collector
18-Oct-2018 09:16:42
Substituting variable: ${bamboo.PRnumber} with 5419
18-Oct-2018 09:16:42
Substituting variable: ${bamboo.buildResultsUrl} with https://bamboo.phpbb.com/browse/PHPBB3-PR-JOB1-8920
18-Oct-2018 09:16:42 Starting task 'Set pending build status' of type 'com.atlassian.bamboo.plugins.scripttask:task.builder.script'
18-Oct-2018 09:16:42
Beginning to execute external process for build 'phpBB3 - Pull Requests - Build and Test Job #8920 (PHPBB3-PR-JOB1-8920)'
... running command line:
/bin/sh /home/bamboo/temp/PHPBB3-PR-JOB1-8920-ScriptBuildTask-57528905551462669.sh
... in: /home/bamboo/xml-data/build-dir/PHPBB3-PR-JOB1
... using extra environment variables:
bamboo_planRepository_1_branch=3.1.x
bamboo_planRepository_1_branchDisplayName=3.1.x
bamboo_repository_revision_number=dc8ff9da28b8ab4ad11c7ea94cca526f17c87fe5
bamboo_PRref=master
bamboo_resultsUrl=https://bamboo.phpbb.com/browse/PHPBB3-PR-JOB1-8920
bamboo_capability_system_builder_command_Git=/usr/bin/git
bamboo_repository_75956235_git_username=bantu
bamboo_build_working_directory=/home/bamboo/xml-data/build-dir/PHPBB3-PR-JOB1
bamboo_planRepository_1_name=phpBB Ascraeus
bamboo_buildKey=PHPBB3-PR-JOB1
bamboo_capability_phpbb_tests=true
bamboo_shortPlanName=Pull Requests
bamboo_capability_system_builder_command_fop=/usr/bin/fop
bamboo_capability_dbms_sqlite_2=true
bamboo_planRepository_name=phpBB Ascraeus
bamboo_PRnumber=5419
bamboo_buildNumber=8920
bamboo_repository_75956235_git_repositoryUrl=https://github.com/phpbb/phpbb.git
bamboo_capability_system_builder_phpunit_PHPUnit=/usr/bin/phpunit
bamboo_shortJobName=Build and Test Job
bamboo_buildResultsUrl=https://bamboo.phpbb.com/browse/PHPBB3-PR-JOB1-8920
bamboo_repository_75956235_branch_name=3.1.x
bamboo_planRepository_repositoryUrl=https://github.com/phpbb/phpbb.git
bamboo_agentId=131073
bamboo_planName=phpBB3 - Pull Requests
bamboo_shortPlanKey=PR
bamboo_shortJobKey=JOB1
bamboo_capability_dbms_mysql_55=true
bamboo_capability_system_jdk_JDK_1_7_0_65=/usr/lib/jvm/java-7-openjdk-amd64
bamboo_planRepository_revision=dc8ff9da28b8ab4ad11c7ea94cca526f17c87fe5
bamboo_buildTimeStamp=2018-10-18T09:16:39.171Z
bamboo_repository_previous_revision_number=dc8ff9da28b8ab4ad11c7ea94cca526f17c87fe5
bamboo_capability_system_jdk_JDK_1_6_0_16=/usr/lib/jvm/java-6-sun-1.6.0.16
bamboo_capability_system_builder_mvn2_Maven_2=/usr/share/maven2
bamboo_planRepository_previousRevision=dc8ff9da28b8ab4ad11c7ea94cca526f17c87fe5
bamboo_repository_git_branch=3.1.x
bamboo_buildResultKey=PHPBB3-PR-JOB1-8920
bamboo_repository_branch_name=3.1.x
bamboo_buildPlanName=phpBB3 - Pull Requests - Build and Test Job
bamboo_planRepository_1_revision=dc8ff9da28b8ab4ad11c7ea94cca526f17c87fe5
bamboo_repository_name=phpBB Ascraeus
bamboo_buildFailed=false
bamboo_capability_system_docker_executable=/usr/bin/docker
bamboo_planRepository_branch=3.1.x
bamboo_agentWorkingDirectory=/home/bamboo/xml-data/build-dir
bamboo_capability_system_git_executable=/usr/bin/git
bamboo_capability_system_builder_phpunit_PHPUnit_3_4=/usr/bin/phpunit
bamboo_repository_git_username=bantu
bamboo_planRepository_1_previousRevision=dc8ff9da28b8ab4ad11c7ea94cca526f17c87fe5
bamboo_repository_75956235_revision_number=dc8ff9da28b8ab4ad11c7ea94cca526f17c87fe5
bamboo_planRepository_branchDisplayName=3.1.x
bamboo_planRepository_1_type=gitv2
bamboo_planRepository_branchName=3.1.x
bamboo_repository_75956235_previous_revision_number=dc8ff9da28b8ab4ad11c7ea94cca526f17c87fe5
bamboo_capability_system_jdk_JDK=/usr/lib/jvm/java-6-sun
bamboo_plan_storageTag=PHPBB3-PR
bamboo_hg_cache_directory=/home/bamboo/xml-data/build-dir/_hg-repositories-cache
bamboo_planRepository_1_username=bantu
bamboo_planRepository_type=gitv2
bamboo_git_cache_directory=/home/bamboo/xml-data/build-dir/_git-repositories-cache
bamboo_ManualBuildTriggerReason_userName=Build Robot
bamboo_repository_git_repositoryUrl=https://github.com/phpbb/phpbb.git
bamboo_repository_75956235_git_branch=3.1.x
bamboo_capability_system_builder_ant_Ant=/usr/share/ant
bamboo_repository_75956235_name=phpBB Ascraeus
bamboo_tmp_directory=/home/bamboo/temp
bamboo_working_directory=/home/bamboo/xml-data/build-dir/PHPBB3-PR-JOB1
bamboo_planKey=PHPBB3-PR
bamboo_capability_local=true
bamboo_planRepository_1_repositoryUrl=https://github.com/phpbb/phpbb.git
bamboo_planRepository_username=bantu
bamboo_capability_system_jdk_JDK_1_6=/usr/lib/jvm/java-6-sun
bamboo_capability_system_jdk_JDK_1_7=/usr/lib/jvm/java-7-openjdk-amd64
bamboo_planRepository_1_branchName=3.1.x
18-Oct-2018 09:16:44 From https://github.com/phpbb/phpbb
18-Oct-2018 09:16:44 * branch            refs/pull/5419/head -> FETCH_HEAD
18-Oct-2018 09:16:44   % Total    % Received % Xferd  Average Speed   Time    Time     Time  Current
18-Oct-2018 09:16:44                                  Dload  Upload   Total   Spent    Left  Speed
18-Oct-2018 09:16:44
18-Oct-2018 09:16:45   0     0    0     0    0     0      0      0 --:--:-- --:--:-- --:--:--     0
18-Oct-2018 09:16:45 100   275  100    93  100   182    179    351 --:--:-- --:--:-- --:--:--   351
18-Oct-2018 09:16:45 Finished task 'Set pending build status' with result: Success
18-Oct-2018 09:16:45
Substituting variable: ${bamboo.PRnumber} with 5419
18-Oct-2018 09:16:45 Starting task 'Fetch PR' of type 'com.atlassian.bamboo.plugins.scripttask:task.builder.script'
18-Oct-2018 09:16:45
Beginning to execute external process for build 'phpBB3 - Pull Requests - Build and Test Job #8920 (PHPBB3-PR-JOB1-8920)'
... running command line:
/bin/sh /home/bamboo/temp/PHPBB3-PR-JOB1-8920-ScriptBuildTask-8830595403193408793.sh
... in: /home/bamboo/xml-data/build-dir/PHPBB3-PR-JOB1
... using extra environment variables:
bamboo_planRepository_1_branch=3.1.x
bamboo_planRepository_1_branchDisplayName=3.1.x
bamboo_repository_revision_number=dc8ff9da28b8ab4ad11c7ea94cca526f17c87fe5
bamboo_PRref=master
bamboo_resultsUrl=https://bamboo.phpbb.com/browse/PHPBB3-PR-JOB1-8920
bamboo_capability_system_builder_command_Git=/usr/bin/git
bamboo_repository_75956235_git_username=bantu
bamboo_build_working_directory=/home/bamboo/xml-data/build-dir/PHPBB3-PR-JOB1
bamboo_planRepository_1_name=phpBB Ascraeus
bamboo_buildKey=PHPBB3-PR-JOB1
bamboo_capability_phpbb_tests=true
bamboo_shortPlanName=Pull Requests
bamboo_capability_system_builder_command_fop=/usr/bin/fop
bamboo_capability_dbms_sqlite_2=true
bamboo_planRepository_name=phpBB Ascraeus
bamboo_PRnumber=5419
bamboo_buildNumber=8920
bamboo_repository_75956235_git_repositoryUrl=https://github.com/phpbb/phpbb.git
bamboo_capability_system_builder_phpunit_PHPUnit=/usr/bin/phpunit
bamboo_shortJobName=Build and Test Job
bamboo_buildResultsUrl=https://bamboo.phpbb.com/browse/PHPBB3-PR-JOB1-8920
bamboo_repository_75956235_branch_name=3.1.x
bamboo_planRepository_repositoryUrl=https://github.com/phpbb/phpbb.git
bamboo_agentId=131073
bamboo_planName=phpBB3 - Pull Requests
bamboo_build_commandline_com_atlassian_bamboo_plugins_scripttask_task_builder_script_7=/bin/sh /home/bamboo/temp/PHPBB3-PR-JOB1-8920-ScriptBuildTask-57528905551462669.sh
bamboo_shortPlanKey=PR
bamboo_shortJobKey=JOB1
bamboo_capability_dbms_mysql_55=true
bamboo_capability_system_jdk_JDK_1_7_0_65=/usr/lib/jvm/java-7-openjdk-amd64
bamboo_planRepository_revision=dc8ff9da28b8ab4ad11c7ea94cca526f17c87fe5
bamboo_buildTimeStamp=2018-10-18T09:16:39.171Z
bamboo_repository_previous_revision_number=dc8ff9da28b8ab4ad11c7ea94cca526f17c87fe5
bamboo_capability_system_jdk_JDK_1_6_0_16=/usr/lib/jvm/java-6-sun-1.6.0.16
bamboo_capability_system_builder_mvn2_Maven_2=/usr/share/maven2
bamboo_planRepository_previousRevision=dc8ff9da28b8ab4ad11c7ea94cca526f17c87fe5
bamboo_repository_git_branch=3.1.x
bamboo_buildResultKey=PHPBB3-PR-JOB1-8920
bamboo_repository_branch_name=3.1.x
bamboo_buildPlanName=phpBB3 - Pull Requests - Build and Test Job
bamboo_planRepository_1_revision=dc8ff9da28b8ab4ad11c7ea94cca526f17c87fe5
bamboo_repository_name=phpBB Ascraeus
bamboo_buildFailed=false
bamboo_capability_system_docker_executable=/usr/bin/docker
bamboo_planRepository_branch=3.1.x
bamboo_agentWorkingDirectory=/home/bamboo/xml-data/build-dir
bamboo_capability_system_git_executable=/usr/bin/git
bamboo_capability_system_builder_phpunit_PHPUnit_3_4=/usr/bin/phpunit
bamboo_repository_git_username=bantu
bamboo_planRepository_1_previousRevision=dc8ff9da28b8ab4ad11c7ea94cca526f17c87fe5
bamboo_repository_75956235_revision_number=dc8ff9da28b8ab4ad11c7ea94cca526f17c87fe5
bamboo_planRepository_branchDisplayName=3.1.x
bamboo_planRepository_1_type=gitv2
bamboo_planRepository_branchName=3.1.x
bamboo_repository_75956235_previous_revision_number=dc8ff9da28b8ab4ad11c7ea94cca526f17c87fe5
bamboo_capability_system_jdk_JDK=/usr/lib/jvm/java-6-sun
bamboo_plan_storageTag=PHPBB3-PR
bamboo_hg_cache_directory=/home/bamboo/xml-data/build-dir/_hg-repositories-cache
bamboo_planRepository_1_username=bantu
bamboo_planRepository_type=gitv2
bamboo_git_cache_directory=/home/bamboo/xml-data/build-dir/_git-repositories-cache
bamboo_ManualBuildTriggerReason_userName=Build Robot
bamboo_repository_git_repositoryUrl=https://github.com/phpbb/phpbb.git
bamboo_repository_75956235_git_branch=3.1.x
bamboo_capability_system_builder_ant_Ant=/usr/share/ant
bamboo_repository_75956235_name=phpBB Ascraeus
bamboo_tmp_directory=/home/bamboo/temp
bamboo_working_directory=/home/bamboo/xml-data/build-dir/PHPBB3-PR-JOB1
bamboo_planKey=PHPBB3-PR
bamboo_capability_local=true
bamboo_planRepository_1_repositoryUrl=https://github.com/phpbb/phpbb.git
bamboo_planRepository_username=bantu
bamboo_capability_system_jdk_JDK_1_6=/usr/lib/jvm/java-6-sun
bamboo_capability_system_jdk_JDK_1_7=/usr/lib/jvm/java-7-openjdk-amd64
bamboo_planRepository_1_branchName=3.1.x
18-Oct-2018 09:16:47 From https://github.com/phpbb/phpbb
18-Oct-2018 09:16:47 * branch            refs/pull/5419/merge -> FETCH_HEAD
18-Oct-2018 09:16:47 Note: checking out 'FETCH_HEAD'.
18-Oct-2018 09:16:47
18-Oct-2018 09:16:47 You are in 'detached HEAD' state. You can look around, make experimental
18-Oct-2018 09:16:47 changes and commit them, and you can discard any commits you make in this
18-Oct-2018 09:16:47 state without impacting any branches by performing another checkout.
18-Oct-2018 09:16:47
18-Oct-2018 09:16:47 If you want to create a new branch to retain commits you create, you may
18-Oct-2018 09:16:47 do so (now or later) by using -b with the checkout command again. Example:
18-Oct-2018 09:16:47
18-Oct-2018 09:16:47   git checkout -b new_branch_name
18-Oct-2018 09:16:47
18-Oct-2018 09:16:47 HEAD is now at 63a2079... Merge 55386ce68433c127c1f30f9ee128823bf33cbc95 into c45a9173baba4f70f79b602897c9677dc071e2c9
18-Oct-2018 09:16:47 Finished task 'Fetch PR' with result: Success
18-Oct-2018 09:16:47 Skipping execution of task 'Prepare directory' as it is disabled
18-Oct-2018 09:16:47
Substituting variable: ${bamboo.working.directory} with /home/bamboo/xml-data/build-dir/PHPBB3-PR-JOB1
18-Oct-2018 09:16:47 Starting task 'Prepare directory' of type 'com.atlassian.bamboo.plugins.bamboo-docker-plugin:task.docker.cli'
18-Oct-2018 09:16:47 Running image name (phpbb:php-5.6)
18-Oct-2018 09:16:47
Beginning to execute external process for build 'phpBB3 - Pull Requests - Build and Test Job #8920 (PHPBB3-PR-JOB1-8920)'
... running command line:
/usr/bin/docker run --volume /home/bamboo/xml-data/build-dir/PHPBB3-PR-JOB1:/data --workdir /data/phpBB --rm -e HOME=/home/bamboo -u=991 phpbb:php-5.6 /bin/bash -c php ../composer.phar install --dev; cd ../build; ../phpBB/vendor/bin/phing clean prepare
... in: /home/bamboo/xml-data/build-dir/PHPBB3-PR-JOB1
... using extra environment variables:
bamboo_planRepository_1_branch=3.1.x
bamboo_planRepository_1_branchDisplayName=3.1.x
bamboo_repository_revision_number=dc8ff9da28b8ab4ad11c7ea94cca526f17c87fe5
bamboo_PRref=master
bamboo_resultsUrl=https://bamboo.phpbb.com/browse/PHPBB3-PR-JOB1-8920
bamboo_capability_system_builder_command_Git=/usr/bin/git
bamboo_repository_75956235_git_username=bantu
bamboo_build_working_directory=/home/bamboo/xml-data/build-dir/PHPBB3-PR-JOB1
bamboo_planRepository_1_name=phpBB Ascraeus
bamboo_buildKey=PHPBB3-PR-JOB1
bamboo_capability_phpbb_tests=true
bamboo_shortPlanName=Pull Requests
bamboo_capability_system_builder_command_fop=/usr/bin/fop
bamboo_capability_dbms_sqlite_2=true
bamboo_planRepository_name=phpBB Ascraeus
bamboo_PRnumber=5419
bamboo_buildNumber=8920
bamboo_repository_75956235_git_repositoryUrl=https://github.com/phpbb/phpbb.git
bamboo_capability_system_builder_phpunit_PHPUnit=/usr/bin/phpunit
bamboo_shortJobName=Build and Test Job
bamboo_buildResultsUrl=https://bamboo.phpbb.com/browse/PHPBB3-PR-JOB1-8920
bamboo_repository_75956235_branch_name=3.1.x
bamboo_planRepository_repositoryUrl=https://github.com/phpbb/phpbb.git
bamboo_agentId=131073
bamboo_planName=phpBB3 - Pull Requests
bamboo_build_commandline_com_atlassian_bamboo_plugins_scripttask_task_builder_script_7=/bin/sh /home/bamboo/temp/PHPBB3-PR-JOB1-8920-ScriptBuildTask-57528905551462669.sh
bamboo_shortPlanKey=PR
bamboo_shortJobKey=JOB1
bamboo_capability_dbms_mysql_55=true
bamboo_capability_system_jdk_JDK_1_7_0_65=/usr/lib/jvm/java-7-openjdk-amd64
bamboo_planRepository_revision=dc8ff9da28b8ab4ad11c7ea94cca526f17c87fe5
bamboo_buildTimeStamp=2018-10-18T09:16:39.171Z
bamboo_repository_previous_revision_number=dc8ff9da28b8ab4ad11c7ea94cca526f17c87fe5
bamboo_capability_system_jdk_JDK_1_6_0_16=/usr/lib/jvm/java-6-sun-1.6.0.16
bamboo_capability_system_builder_mvn2_Maven_2=/usr/share/maven2
bamboo_planRepository_previousRevision=dc8ff9da28b8ab4ad11c7ea94cca526f17c87fe5
bamboo_build_commandline_com_atlassian_bamboo_plugins_scripttask_task_builder_script_4=/bin/sh /home/bamboo/temp/PHPBB3-PR-JOB1-8920-ScriptBuildTask-8830595403193408793.sh
bamboo_repository_git_branch=3.1.x
bamboo_buildResultKey=PHPBB3-PR-JOB1-8920
bamboo_repository_branch_name=3.1.x
bamboo_buildPlanName=phpBB3 - Pull Requests - Build and Test Job
bamboo_planRepository_1_revision=dc8ff9da28b8ab4ad11c7ea94cca526f17c87fe5
bamboo_repository_name=phpBB Ascraeus
bamboo_buildFailed=false
bamboo_capability_system_docker_executable=/usr/bin/docker
bamboo_planRepository_branch=3.1.x
bamboo_agentWorkingDirectory=/home/bamboo/xml-data/build-dir
bamboo_capability_system_git_executable=/usr/bin/git
bamboo_capability_system_builder_phpunit_PHPUnit_3_4=/usr/bin/phpunit
bamboo_repository_git_username=bantu
bamboo_planRepository_1_previousRevision=dc8ff9da28b8ab4ad11c7ea94cca526f17c87fe5
bamboo_repository_75956235_revision_number=dc8ff9da28b8ab4ad11c7ea94cca526f17c87fe5
bamboo_planRepository_branchDisplayName=3.1.x
bamboo_planRepository_1_type=gitv2
bamboo_planRepository_branchName=3.1.x
bamboo_repository_75956235_previous_revision_number=dc8ff9da28b8ab4ad11c7ea94cca526f17c87fe5
bamboo_capability_system_jdk_JDK=/usr/lib/jvm/java-6-sun
bamboo_plan_storageTag=PHPBB3-PR
bamboo_hg_cache_directory=/home/bamboo/xml-data/build-dir/_hg-repositories-cache
bamboo_planRepository_1_username=bantu
bamboo_planRepository_type=gitv2
bamboo_git_cache_directory=/home/bamboo/xml-data/build-dir/_git-repositories-cache
bamboo_ManualBuildTriggerReason_userName=Build Robot
bamboo_repository_git_repositoryUrl=https://github.com/phpbb/phpbb.git
bamboo_repository_75956235_git_branch=3.1.x
bamboo_capability_system_builder_ant_Ant=/usr/share/ant
bamboo_repository_75956235_name=phpBB Ascraeus
bamboo_tmp_directory=/home/bamboo/temp
bamboo_working_directory=/home/bamboo/xml-data/build-dir/PHPBB3-PR-JOB1
bamboo_planKey=PHPBB3-PR
bamboo_capability_local=true
bamboo_planRepository_1_repositoryUrl=https://github.com/phpbb/phpbb.git
bamboo_planRepository_username=bantu
bamboo_capability_system_jdk_JDK_1_6=/usr/lib/jvm/java-6-sun
bamboo_capability_system_jdk_JDK_1_7=/usr/lib/jvm/java-7-openjdk-amd64
bamboo_planRepository_1_branchName=3.1.x
18-Oct-2018 09:16:48 Cannot create cache directory /home/bamboo/.composer/cache/repo/https---repo.packagist.org/, or directory is not writable. Proceeding without cache
18-Oct-2018 09:16:48 Cannot create cache directory /home/bamboo/.composer/cache/files/, or directory is not writable. Proceeding without cache
18-Oct-2018 09:16:48 You are using the deprecated option "dev". Dev packages are installed by default now.
18-Oct-2018 09:16:48 Loading composer repositories with package information
18-Oct-2018 09:16:48 Installing dependencies (including require-dev) from lock file
18-Oct-2018 09:16:48 Package operations: 77 installs, 0 updates, 0 removals
18-Oct-2018 09:16:49   - Installing composer/installers (v1.5.0): Downloading (connecting...)Downloading (0%)           Downloading (5%)Downloading (20%)Downloading (40%)Downloading (45%)Downloading (50%)Downloading (65%)Downloading (70%)Downloading (75%)Downloading (90%)Downloading (95%)Downloading (100%)
18-Oct-2018 09:16:49   - Installing bantu/ini-get-wrapper (v1.0.1): Downloading (connecting...)Downloading (100%)         
18-Oct-2018 09:16:50   - Installing symfony/process (v3.4.15): Downloading (connecting...)Downloading (0%)           Downloading (5%)Downloading (30%)Downloading (35%)Downloading (40%)Downloading (80%)Downloading (85%)Downloading (100%)
18-Oct-2018 09:16:51   - Installing symfony/finder (v3.4.15): Downloading (connecting...)Downloading (0%)           Downloading (5%)Downloading (50%)Downloading (80%)Downloading (85%)Downloading (90%)Downloading (95%)Downloading (100%)
18-Oct-2018 09:16:51   - Installing symfony/polyfill-ctype (v1.9.0): Downloading (connecting...)Downloading (0%)           Downloading (100%)
18-Oct-2018 09:16:52   - Installing symfony/filesystem (v3.4.15): Downloading (connecting...)Downloading (100%)         
18-Oct-2018 09:16:53   - Installing symfony/polyfill-mbstring (v1.9.0): Downloading (connecting...)Downloading (0%)           Downloading (30%)Downloading (55%)Downloading (90%)Downloading (100%)
18-Oct-2018 09:16:53   - Installing psr/log (1.0.2): Downloading (connecting...)Downloading (0%)           Downloading (15%)Downloading (100%)
18-Oct-2018 09:16:54   - Installing symfony/debug (v3.4.15): Downloading (connecting...)Downloading (0%)           Downloading (5%)Downloading (20%)Downloading (25%)Downloading (30%)Downloading (35%)Downloading (40%)Downloading (55%)Downloading (60%)Downloading (65%)Downloading (70%)Downloading (75%)Downloading (90%)Downloading (95%)Downloading (100%)
18-Oct-2018 09:16:55   - Installing symfony/console (v3.4.15): Downloading (connecting...)Downloading (0%)           Downloading (5%)Downloading (10%)Downloading (15%)Downloading (20%)Downloading (25%)Downloading (30%)Downloading (35%)Downloading (40%)Downloading (45%)Downloading (50%)Downloading (55%)Downloading (60%)Downloading (65%)Downloading (70%)Downloading (75%)Downloading (80%)Downloading (85%)Downloading (90%)Downloading (95%)Downloading (100%)
18-Oct-2018 09:16:56   - Installing seld/phar-utils (1.0.1): Downloading (connecting...)Downloading (0%)           Downloading (30%)Downloading (60%)Downloading (90%)Downloading (100%)
18-Oct-2018 09:16:56   - Installing seld/jsonlint (1.7.1): Downloading (connecting...)Downloading (0%)           Downloading (15%)Downloading (50%)Downloading (100%)
18-Oct-2018 09:16:57   - Installing justinrainbow/json-schema (5.2.7): Downloading (connecting...)Downloading (0%)           Downloading (15%)Downloading (20%)Downloading (30%)Downloading (35%)Downloading (50%)Downloading (55%)Downloading (60%)Downloading (65%)Downloading (80%)Downloading (85%)Downloading (90%)Downloading (95%)Downloading (100%)
18-Oct-2018 09:16:57   - Installing composer/xdebug-handler (1.3.0): Downloading (connecting...)Downloading (0%)           Downloading (25%)Downloading (65%)Downloading (90%)Downloading (100%)
18-Oct-2018 09:16:58   - Installing composer/spdx-licenses (1.4.0): Downloading (connecting...)Downloading (0%)           Downloading (10%)Downloading (100%)
18-Oct-2018 09:16:59   - Installing composer/semver (1.4.2): Downloading (connecting...)Downloading (0%)           Downloading (35%)Downloading (90%)Downloading (95%)Downloading (100%)
18-Oct-2018 09:16:59   - Installing composer/ca-bundle (1.1.2): Downloading (connecting...)Downloading (0%)           Downloading (5%)Downloading (10%)Downloading (15%)Downloading (20%)Downloading (25%)Downloading (30%)Downloading (35%)Downloading (40%)Downloading (45%)Downloading (50%)Downloading (55%)Downloading (60%)Downloading (65%)Downloading (70%)Downloading (75%)Downloading (80%)Downloading (85%)Downloading (90%)Downloading (95%)Downloading (100%)
18-Oct-2018 09:17:00   - Installing composer/composer (1.7.2): Downloading (connecting...)Downloading (0%)           Downloading (5%)Downloading (10%)Downloading (15%)Downloading (20%)Downloading (25%)Downloading (30%)Downloading (35%)Downloading (40%)Downloading (45%)Downloading (50%)Downloading (55%)Downloading (60%)Downloading (65%)Downloading (70%)Downloading (75%)Downloading (80%)Downloading (85%)Downloading (90%)Downloading (95%)Downloading (100%)
18-Oct-2018 09:17:01   - Installing google/recaptcha (1.2.1): Downloading (connecting...)Downloading (0%)           Downloading (5%)Downloading (10%)Downloading (15%)Downloading (20%)Downloading (35%)Downloading (40%)Downloading (100%)
18-Oct-2018 09:17:02   - Installing guzzlehttp/promises (v1.3.1): Downloading (connecting...)Downloading (0%)           Downloading (30%)Downloading (60%)Downloading (80%)Downloading (100%)
18-Oct-2018 09:17:03   - Installing psr/http-message (1.0.1): Downloading (connecting...)Downloading (0%)           Downloading (100%)
18-Oct-2018 09:17:03   - Installing guzzlehttp/psr7 (1.4.2): Downloading (connecting...)Downloading (0%)           Downloading (5%)Downloading (10%)Downloading (15%)Downloading (20%)Downloading (85%)Downloading (90%)Downloading (100%)
18-Oct-2018 09:17:04   - Installing lusitanian/oauth (v0.8.11): Downloading (connecting...)Downloading (0%)           Downloading (5%)Downloading (10%)Downloading (15%)Downloading (20%)Downloading (25%)Downloading (35%)Downloading (40%)Downloading (50%)Downloading (55%)Downloading (60%)Downloading (65%)Downloading (70%)Downloading (80%)Downloading (85%)Downloading (95%)Downloading (100%)
18-Oct-2018 09:17:05   - Installing marc1706/fast-image-size (v1.1.4): Downloading (connecting...)Downloading (100%)         
18-Oct-2018 09:17:07   - Installing patchwork/utf8 (v1.3.1): Downloading (connecting...)Downloading (0%)           Downloading (5%)Downloading (10%)Downloading (15%)Downloading (20%)Downloading (25%)Downloading (30%)Downloading (35%)Downloading (40%)Downloading (45%)Downloading (50%)Downloading (55%)Downloading (60%)Downloading (65%)Downloading (70%)Downloading (75%)Downloading (80%)Downloading (85%)Downloading (90%)Downloading (95%)Downloading (100%)
18-Oct-2018 09:17:08   - Installing phpseclib/phpseclib (2.0.11): Downloading (connecting...)Downloading (0%)           Downloading (5%)Downloading (10%)Downloading (15%)Downloading (20%)Downloading (25%)Downloading (30%)Downloading (35%)Downloading (40%)Downloading (45%)Downloading (50%)Downloading (55%)Downloading (60%)Downloading (65%)Downloading (70%)Downloading (75%)Downloading (80%)Downloading (85%)Downloading (90%)Downloading (95%)Downloading (100%)
18-Oct-2018 09:17:09   - Installing psr/container (1.0.0): Downloading (connecting...)Downloading (0%)           Downloading (75%)Downloading (100%)
18-Oct-2018 09:17:10   - Installing s9e/text-formatter (0.13.1): Downloading (connecting...)Downloading (100%)         
18-Oct-2018 09:17:11   - Installing symfony/config (v3.4.15): Downloading (connecting...)Downloading (0%)           Downloading (5%)Downloading (10%)Downloading (15%)Downloading (20%)Downloading (25%)Downloading (30%)Downloading (35%)Downloading (40%)Downloading (45%)Downloading (50%)Downloading (55%)Downloading (60%)Downloading (65%)Downloading (70%)Downloading (75%)Downloading (80%)Downloading (85%)Downloading (90%)Downloading (95%)Downloading (100%)
18-Oct-2018 09:17:11   - Installing paragonie/random_compat (v1.4.3): Downloading (connecting...)Downloading (0%)           Downloading (10%)Downloading (35%)Downloading (45%)Downloading (55%)Downloading (75%)Downloading (85%)Downloading (100%)
18-Oct-2018 09:17:12   - Installing symfony/polyfill-php70 (v1.9.0): Downloading (connecting...)Downloading (0%)           Downloading (85%)Downloading (100%)
18-Oct-2018 09:17:13   - Installing symfony/http-foundation (v3.4.15): Downloading (connecting...)Downloading (0%)           Downloading (5%)Downloading (10%)Downloading (15%)Downloading (20%)Downloading (25%)Downloading (30%)Downloading (35%)Downloading (40%)Downloading (45%)Downloading (50%)Downloading (55%)Downloading (60%)Downloading (65%)Downloading (70%)Downloading (75%)Downloading (80%)Downloading (85%)Downloading (90%)Downloading (95%)Downloading (100%)
18-Oct-2018 09:17:14   - Installing symfony/event-dispatcher (v3.4.15): Downloading (connecting...)Downloading (0%)           Downloading (5%)Downloading (35%)Downloading (40%)Downloading (45%)Downloading (100%)
18-Oct-2018 09:17:15   - Installing symfony/http-kernel (v3.4.15): Downloading (connecting...)Downloading (0%)           Downloading (5%)Downloading (10%)Downloading (15%)Downloading (20%)Downloading (25%)Downloading (30%)Downloading (35%)Downloading (40%)Downloading (45%)Downloading (50%)Downloading (55%)Downloading (60%)Downloading (65%)Downloading (70%)Downloading (75%)Downloading (80%)Downloading (85%)Downloading (90%)Downloading (95%)Downloading (100%)
18-Oct-2018 09:17:17   - Installing symfony/dependency-injection (v3.4.15): Downloading (connecting...)Downloading (0%)           Downloading (5%)Downloading (10%)Downloading (15%)Downloading (20%)Downloading (25%)Downloading (30%)Downloading (35%)Downloading (40%)Downloading (45%)Downloading (50%)Downloading (55%)Downloading (60%)Downloading (65%)Downloading (70%)Downloading (75%)Downloading (80%)Downloading (85%)Downloading (90%)Downloading (95%)Downloading (100%)
18-Oct-2018 09:17:18   - Installing zendframework/zend-eventmanager (3.2.1): Downloading (connecting...)Downloading (0%)           Downloading (15%)Downloading (20%)Downloading (35%)Downloading (55%)Downloading (60%)Downloading (80%)Downloading (95%)Downloading (100%)
18-Oct-2018 09:17:19   - Installing zendframework/zend-code (2.6.3): Downloading (connecting...)Downloading (0%)           Downloading (5%)Downloading (10%)Downloading (15%)Downloading (20%)Downloading (25%)Downloading (30%)Downloading (35%)Downloading (40%)Downloading (45%)Downloading (50%)Downloading (55%)Downloading (60%)Downloading (65%)Downloading (70%)Downloading (75%)Downloading (80%)Downloading (85%)Downloading (90%)Downloading (95%)Downloading (100%)
18-Oct-2018 09:17:20   - Installing ocramius/proxy-manager (1.0.2): Downloading (connecting...)Downloading (0%)           Downloading (5%)Downloading (10%)Downloading (15%)Downloading (20%)Downloading (25%)Downloading (30%)Downloading (35%)Downloading (40%)Downloading (45%)Downloading (50%)Downloading (55%)Downloading (60%)Downloading (65%)Downloading (70%)Downloading (75%)Downloading (80%)Downloading (85%)Downloading (90%)Downloading (95%)Downloading (100%)
18-Oct-2018 09:17:21   - Installing symfony/proxy-manager-bridge (v3.4.15): Downloading (connecting...)Downloading (100%)         
18-Oct-2018 09:17:22   - Installing symfony/routing (v3.4.15): Downloading (connecting...)Downloading (0%)           Downloading (5%)Downloading (10%)Downloading (15%)Downloading (20%)Downloading (25%)Downloading (30%)Downloading (35%)Downloading (40%)Downloading (45%)Downloading (50%)Downloading (55%)Downloading (60%)Downloading (65%)Downloading (70%)Downloading (75%)Downloading (80%)Downloading (85%)Downloading (90%)Downloading (95%)Downloading (100%)
18-Oct-2018 09:17:24   - Installing twig/twig (v1.35.4): Downloading (connecting...)Downloading (0%)           Downloading (5%)Downloading (10%)Downloading (15%)Downloading (20%)Downloading (25%)Downloading (30%)Downloading (35%)Downloading (40%)Downloading (45%)Downloading (50%)Downloading (55%)Downloading (60%)Downloading (65%)Downloading (70%)Downloading (75%)Downloading (80%)Downloading (85%)Downloading (90%)Downloading (95%)Downloading (100%)
18-Oct-2018 09:17:26   - Installing symfony/twig-bridge (v3.4.15): Downloading (connecting...)Downloading (100%)         
18-Oct-2018 09:17:26   - Installing symfony/dom-crawler (v3.4.15): Downloading (connecting...)Downloading (0%)           Downloading (5%)Downloading (25%)Downloading (30%)Downloading (35%)Downloading (60%)Downloading (65%)Downloading (85%)Downloading (90%)Downloading (100%)
18-Oct-2018 09:17:27   - Installing symfony/css-selector (v3.4.15): Downloading (connecting...)Downloading (0%)           Downloading (5%)Downloading (10%)Downloading (15%)Downloading (20%)Downloading (25%)Downloading (30%)Downloading (35%)Downloading (40%)Downloading (45%)Downloading (50%)Downloading (55%)Downloading (100%)
18-Oct-2018 09:17:28   - Installing symfony/browser-kit (v3.4.15): Downloading (connecting...)Downloading (100%)         
18-Oct-2018 09:17:29   - Installing guzzlehttp/guzzle (6.3.3): Downloading (connecting...)Downloading (0%)           Downloading (5%)Downloading (15%)Downloading (25%)Downloading (30%)Downloading (35%)Downloading (40%)Downloading (50%)Downloading (55%)Downloading (60%)Downloading (70%)Downloading (75%)Downloading (80%)Downloading (90%)Downloading (95%)Downloading (100%)
18-Oct-2018 09:17:29   - Installing fabpot/goutte (v3.2.3): Downloading (connecting...)Downloading (0%)           Downloading (40%)Downloading (100%)
18-Oct-2018 09:17:30   - Installing facebook/webdriver (1.6.0): Downloading (connecting...)Downloading (0%)           Downloading (5%)Downloading (10%)Downloading (15%)Downloading (20%)Downloading (25%)Downloading (30%)Downloading (35%)Downloading (40%)Downloading (45%)Downloading (50%)Downloading (55%)Downloading (60%)Downloading (65%)Downloading (70%)Downloading (75%)Downloading (80%)Downloading (85%)Downloading (90%)Downloading (95%)Downloading (100%)
18-Oct-2018 09:17:31   - Installing symfony/yaml (v3.4.15): Downloading (connecting...)Downloading (0%)           Downloading (5%)Downloading (10%)Downloading (15%)Downloading (20%)Downloading (25%)Downloading (30%)Downloading (35%)Downloading (40%)Downloading (45%)Downloading (80%)Downloading (85%)Downloading (90%)Downloading (95%)Downloading (100%)
18-Oct-2018 09:17:32   - Installing laravel/homestead (v7.17.0): Downloading (connecting...)Downloading (100%)         
18-Oct-2018 09:17:33   - Installing phing/phing (2.4.14): Downloading (connecting...)Downloading (100%)         
18-Oct-2018 09:17:33   - Installing webmozart/assert (1.3.0): Downloading (connecting...)Downloading (0%)           Downloading (65%)Downloading (80%)Downloading (100%)
18-Oct-2018 09:17:34   - Installing phpdocumentor/reflection-common (1.0.1): Downloading (connecting...)Downloading (0%)           Downloading (100%)
18-Oct-2018 09:17:34   - Installing phpdocumentor/type-resolver (0.4.0): Downloading (connecting...)Downloading (0%)           Downloading (5%)Downloading (35%)Downloading (40%)Downloading (45%)Downloading (50%)Downloading (80%)Downloading (85%)Downloading (90%)Downloading (100%)
18-Oct-2018 09:17:35   - Installing phpdocumentor/reflection-docblock (3.3.2): Downloading (connecting...)Downloading (0%)           Downloading (5%)Downloading (10%)Downloading (15%)Downloading (45%)Downloading (50%)Downloading (55%)Downloading (60%)Downloading (65%)Downloading (70%)Downloading (75%)Downloading (100%)
18-Oct-2018 09:17:36   - Installing sebastian/version (2.0.1): Downloading (connecting...)Downloading (0%)           Downloading (100%)
18-Oct-2018 09:17:36   - Installing sebastian/resource-operations (1.0.0): Downloading (connecting...)Downloading (0%)           Downloading (65%)Downloading (100%)
18-Oct-2018 09:17:37   - Installing sebastian/recursion-context (2.0.0): Downloading (connecting...)Downloading (0%)           Downloading (100%)
18-Oct-2018 09:17:37   - Installing sebastian/object-enumerator (2.0.1): Downloading (connecting...)Downloading (0%)           Downloading (100%)
18-Oct-2018 09:17:38   - Installing sebastian/global-state (1.1.1): Downloading (connecting...)Downloading (0%)           Downloading (40%)Downloading (85%)Downloading (100%)
18-Oct-2018 09:17:38   - Installing sebastian/exporter (2.0.0): Downloading (connecting...)Downloading (0%)           Downloading (95%)Downloading (100%)
18-Oct-2018 09:17:39   - Installing sebastian/environment (2.0.0): Downloading (connecting...)Downloading (0%)           Downloading (15%)Downloading (30%)Downloading (45%)Downloading (60%)Downloading (75%)Downloading (90%)Downloading (100%)
18-Oct-2018 09:17:40   - Installing sebastian/diff (1.4.3): Downloading (connecting...)Downloading (0%)           Downloading (35%)Downloading (55%)Downloading (75%)Downloading (100%)
18-Oct-2018 09:17:40   - Installing sebastian/comparator (1.2.4): Downloading (connecting...)Downloading (0%)           Downloading (10%)Downloading (70%)Downloading (80%)Downloading (90%)Downloading (100%)
18-Oct-2018 09:17:41   - Installing phpunit/php-text-template (1.2.1): Downloading (connecting...)Downloading (0%)           Downloading (35%)Downloading (100%)
18-Oct-2018 09:17:41   - Installing doctrine/instantiator (1.0.5): Downloading (connecting...)Downloading (0%)           Downloading (15%)Downloading (85%)Downloading (100%)
18-Oct-2018 09:17:42   - Installing phpunit/phpunit-mock-objects (3.4.4): Downloading (connecting...)Downloading (0%)           Downloading (5%)Downloading (10%)Downloading (20%)Downloading (25%)Downloading (30%)Downloading (35%)Downloading (40%)Downloading (45%)Downloading (50%)Downloading (60%)Downloading (65%)Downloading (70%)Downloading (75%)Downloading (80%)Downloading (85%)Downloading (95%)Downloading (100%)
18-Oct-2018 09:17:43   - Installing phpunit/php-timer (1.0.9): Downloading (connecting...)Downloading (0%)           Downloading (45%)Downloading (90%)Downloading (100%)
18-Oct-2018 09:17:43   - Installing phpunit/php-file-iterator (1.4.5): Downloading (connecting...)Downloading (0%)           Downloading (100%)
18-Oct-2018 09:17:44   - Installing sebastian/code-unit-reverse-lookup (1.0.1): Downloading (connecting...)Downloading (0%)           Downloading (55%)Downloading (100%)
18-Oct-2018 09:17:45   - Installing phpunit/php-token-stream (1.4.12): Downloading (connecting...)Downloading (0%)           Downloading (5%)Downloading (10%)Downloading (15%)Downloading (20%)Downloading (65%)Downloading (70%)Downloading (75%)Downloading (80%)Downloading (85%)Downloading (90%)Downloading (100%)
18-Oct-2018 09:17:45   - Installing phpunit/php-code-coverage (4.0.8): Downloading (connecting...)Downloading (0%)           Downloading (5%)Downloading (10%)Downloading (15%)Downloading (20%)Downloading (25%)Downloading (30%)Downloading (35%)Downloading (40%)Downloading (45%)Downloading (50%)Downloading (55%)Downloading (60%)Downloading (65%)Downloading (70%)Downloading (75%)Downloading (80%)Downloading (85%)Downloading (90%)Downloading (95%)Downloading (100%)
18-Oct-2018 09:17:46   - Installing phpspec/prophecy (1.8.0): Downloading (connecting...)Downloading (0%)           Downloading (10%)Downloading (20%)Downloading (25%)Downloading (30%)Downloading (35%)Downloading (40%)Downloading (45%)Downloading (50%)Downloading (60%)Downloading (70%)Downloading (80%)Downloading (90%)Downloading (95%)Downloading (100%)
18-Oct-2018 09:17:47   - Installing myclabs/deep-copy (1.7.0): Downloading (connecting...)Downloading (0%)           Downloading (15%)Downloading (20%)Downloading (30%)Downloading (55%)Downloading (70%)Downloading (90%)Downloading (100%)
18-Oct-2018 09:17:48   - Installing phpunit/phpunit (5.7.27): Downloading (connecting...)Downloading (0%)           Downloading (5%)Downloading (10%)Downloading (15%)Downloading (20%)Downloading (25%)Downloading (30%)Downloading (35%)Downloading (40%)Downloading (45%)Downloading (50%)Downloading (55%)Downloading (60%)Downloading (65%)Downloading (70%)Downloading (75%)Downloading (80%)Downloading (85%)Downloading (90%)Downloading (95%)Downloading (100%)
18-Oct-2018 09:17:49   - Installing phpunit/dbunit (2.0.3): Downloading (connecting...)Downloading (0%)           Downloading (5%)Downloading (10%)Downloading (15%)Downloading (20%)Downloading (25%)Downloading (30%)Downloading (35%)Downloading (40%)Downloading (45%)Downloading (50%)Downloading (55%)Downloading (60%)Downloading (65%)Downloading (70%)Downloading (75%)Downloading (80%)Downloading (85%)Downloading (90%)Downloading (95%)Downloading (100%)
18-Oct-2018 09:17:51   - Installing squizlabs/php_codesniffer (2.9.1): Downloading (connecting...)Downloading (0%)           Downloading (5%)Downloading (10%)Downloading (15%)Downloading (20%)Downloading (25%)Downloading (30%)Downloading (35%)Downloading (40%)Downloading (45%)Downloading (50%)Downloading (55%)Downloading (60%)Downloading (65%)Downloading (70%)Downloading (75%)Downloading (80%)Downloading (85%)Downloading (90%)Downloading (95%)Downloading (100%)
18-Oct-2018 09:17:52 symfony/console suggests installing symfony/lock
18-Oct-2018 09:17:52 lusitanian/oauth suggests installing predis/predis (Allows using the Redis storage backend.)
18-Oct-2018 09:17:52 patchwork/utf8 suggests installing ext-intl (Use Intl for best performance)
18-Oct-2018 09:17:52 patchwork/utf8 suggests installing ext-wfio (Use WFIO for UTF-8 filesystem access on Windows)
18-Oct-2018 09:17:52 phpseclib/phpseclib suggests installing ext-gmp (Install the GMP (GNU Multiple Precision) extension in order to speed up arbitrary precision integer arithmetic operations.)
18-Oct-2018 09:17:52 phpseclib/phpseclib suggests installing ext-libsodium (SSH2/SFTP can make use of some algorithms provided by the libsodium-php extension.)
18-Oct-2018 09:17:52 phpseclib/phpseclib suggests installing ext-mcrypt (Install the Mcrypt extension in order to speed up a few other cryptographic operations.)
18-Oct-2018 09:17:52 s9e/text-formatter suggests installing ext-intl (Allows international URLs to be accepted by the URL filter)
18-Oct-2018 09:17:52 s9e/text-formatter suggests installing ext-xsl (Enables the XSLT renderer)
18-Oct-2018 09:17:52 paragonie/random_compat suggests installing ext-libsodium (Provides a modern crypto API that can be used to generate random bytes.)
18-Oct-2018 09:17:52 symfony/http-kernel suggests installing symfony/var-dumper
18-Oct-2018 09:17:52 symfony/dependency-injection suggests installing symfony/expression-language (For using expressions in service container configuration)
18-Oct-2018 09:17:52 zendframework/zend-eventmanager suggests installing container-interop/container-interop (^1.1.0, to use the lazy listeners feature)
18-Oct-2018 09:17:52 zendframework/zend-eventmanager suggests installing zendframework/zend-stdlib (^2.7.3 || ^3.0, to use the FilterChain feature)
18-Oct-2018 09:17:52 zendframework/zend-code suggests installing doctrine/annotations (Doctrine\Common\Annotations >=1.0 for annotation features)
18-Oct-2018 09:17:52 zendframework/zend-code suggests installing zendframework/zend-stdlib (Zend\Stdlib component)
18-Oct-2018 09:17:52 ocramius/proxy-manager suggests installing ocramius/generated-hydrator (To have very fast object to array to object conversion for ghost objects)
18-Oct-2018 09:17:52 ocramius/proxy-manager suggests installing zendframework/zend-json (To have the JsonRpc adapter (Remote Object feature))
18-Oct-2018 09:17:52 ocramius/proxy-manager suggests installing zendframework/zend-soap (To have the Soap adapter (Remote Object feature))
18-Oct-2018 09:17:52 ocramius/proxy-manager suggests installing zendframework/zend-stdlib (To use the hydrator proxy)
18-Oct-2018 09:17:52 ocramius/proxy-manager suggests installing zendframework/zend-xmlrpc (To have the XmlRpc adapter (Remote Object feature))
18-Oct-2018 09:17:52 symfony/routing suggests installing doctrine/annotations (For using the annotation loader)
18-Oct-2018 09:17:52 symfony/routing suggests installing symfony/expression-language (For using expression matching)
18-Oct-2018 09:17:52 symfony/twig-bridge suggests installing symfony/asset (For using the AssetExtension)
18-Oct-2018 09:17:52 symfony/twig-bridge suggests installing symfony/expression-language (For using the ExpressionExtension)
18-Oct-2018 09:17:52 symfony/twig-bridge suggests installing symfony/form (For using the FormExtension)
18-Oct-2018 09:17:52 symfony/twig-bridge suggests installing symfony/security (For using the SecurityExtension)
18-Oct-2018 09:17:52 symfony/twig-bridge suggests installing symfony/stopwatch (For using the StopwatchExtension)
18-Oct-2018 09:17:52 symfony/twig-bridge suggests installing symfony/templating (For using the TwigEngine)
18-Oct-2018 09:17:52 symfony/twig-bridge suggests installing symfony/translation (For using the TranslationExtension)
18-Oct-2018 09:17:52 symfony/twig-bridge suggests installing symfony/var-dumper (For using the DumpExtension)
18-Oct-2018 09:17:52 symfony/twig-bridge suggests installing symfony/web-link (For using the WebLinkExtension)
18-Oct-2018 09:17:52 facebook/webdriver suggests installing ext-SimpleXML (For Firefox profile creation)
18-Oct-2018 09:17:52 sebastian/global-state suggests installing ext-uopz (*)
18-Oct-2018 09:17:52 phpunit/phpunit-mock-objects suggests installing ext-soap (*)
18-Oct-2018 09:17:52 phpunit/phpunit suggests installing phpunit/php-invoker (~1.1)
18-Oct-2018 09:17:52 Generating autoload files
18-Oct-2018 09:17:53 Buildfile: /data/build/build.xml
18-Oct-2018 09:17:53
18-Oct-2018 09:17:53 phpBB > clean:
18-Oct-2018 09:17:53
18-Oct-2018 09:17:53    [delete] Directory /data/build/logs does not exist or is not a directory.
18-Oct-2018 09:17:53    [delete] Directory /data/build/api does not exist or is not a directory.
18-Oct-2018 09:17:53    [delete] Directory /data/build/codebrowser does not exist or is not a directory.
18-Oct-2018 09:17:53    [delete] Directory /data/build/coverage does not exist or is not a directory.
18-Oct-2018 09:17:53    [delete] Directory /data/build/cpd does not exist or is not a directory.
18-Oct-2018 09:17:53    [delete] Directory /data/build/dependencies does not exist or is not a directory.
18-Oct-2018 09:17:53    [delete] Directory /data/build/new_version does not exist or is not a directory.
18-Oct-2018 09:17:53    [delete] Directory /data/build/old_versions does not exist or is not a directory.
18-Oct-2018 09:17:53    [delete] Directory /data/build/save does not exist or is not a directory.
18-Oct-2018 09:17:53
18-Oct-2018 09:17:53 phpBB > prepare:
18-Oct-2018 09:17:53
18-Oct-2018 09:17:53     [mkdir] Created dir: /data/build/logs
18-Oct-2018 09:17:53     [mkdir] Created dir: /data/build/api
18-Oct-2018 09:17:53     [mkdir] Created dir: /data/build/codebrowser
18-Oct-2018 09:17:53     [mkdir] Created dir: /data/build/coverage
18-Oct-2018 09:17:53     [mkdir] Created dir: /data/build/cpd
18-Oct-2018 09:17:53     [mkdir] Created dir: /data/build/dependencies
18-Oct-2018 09:17:53     [mkdir] Created dir: /data/build/new_version
18-Oct-2018 09:17:53     [mkdir] Created dir: /data/build/new_version/files
18-Oct-2018 09:17:53     [mkdir] Created dir: /data/build/new_version/patches
18-Oct-2018 09:17:53     [mkdir] Created dir: /data/build/new_version/release_files
18-Oct-2018 09:17:53     [mkdir] Created dir: /data/build/new_version/update
18-Oct-2018 09:17:53     [mkdir] Created dir: /data/build/old_versions
18-Oct-2018 09:17:53     [mkdir] Created dir: /data/build/save
18-Oct-2018 09:17:53
18-Oct-2018 09:17:53 BUILD FINISHED
18-Oct-2018 09:17:53
18-Oct-2018 09:17:53 Total time: 0.1036 seconds
18-Oct-2018 09:17:53
18-Oct-2018 09:17:53 Finished task 'Prepare directory' with result: Success
18-Oct-2018 09:17:53 Skipping execution of task 'Run sniffs' as it is disabled
18-Oct-2018 09:17:53
Substituting variable: ${bamboo.working.directory} with /home/bamboo/xml-data/build-dir/PHPBB3-PR-JOB1
18-Oct-2018 09:17:53 Starting task 'Run sniffs' of type 'com.atlassian.bamboo.plugins.bamboo-docker-plugin:task.docker.cli'
18-Oct-2018 09:17:53 Running image name (phpbb:php-5.6)
18-Oct-2018 09:17:53
Beginning to execute external process for build 'phpBB3 - Pull Requests - Build and Test Job #8920 (PHPBB3-PR-JOB1-8920)'
... running command line:
/usr/bin/docker run --volume /home/bamboo/xml-data/build-dir/PHPBB3-PR-JOB1:/data --workdir /data/build --rm -u=991 phpbb:php-5.6 ../phpBB/vendor/bin/phing sniff
... in: /home/bamboo/xml-data/build-dir/PHPBB3-PR-JOB1
... using extra environment variables:
bamboo_planRepository_1_branch=3.1.x
bamboo_planRepository_1_branchDisplayName=3.1.x
bamboo_repository_revision_number=dc8ff9da28b8ab4ad11c7ea94cca526f17c87fe5
bamboo_PRref=master
bamboo_resultsUrl=https://bamboo.phpbb.com/browse/PHPBB3-PR-JOB1-8920
bamboo_capability_system_builder_command_Git=/usr/bin/git
bamboo_repository_75956235_git_username=bantu
bamboo_build_working_directory=/home/bamboo/xml-data/build-dir/PHPBB3-PR-JOB1
bamboo_planRepository_1_name=phpBB Ascraeus
bamboo_buildKey=PHPBB3-PR-JOB1
bamboo_capability_phpbb_tests=true
bamboo_shortPlanName=Pull Requests
bamboo_capability_system_builder_command_fop=/usr/bin/fop
bamboo_capability_dbms_sqlite_2=true
bamboo_planRepository_name=phpBB Ascraeus
bamboo_PRnumber=5419
bamboo_buildNumber=8920
bamboo_repository_75956235_git_repositoryUrl=https://github.com/phpbb/phpbb.git
bamboo_capability_system_builder_phpunit_PHPUnit=/usr/bin/phpunit
bamboo_shortJobName=Build and Test Job
bamboo_buildResultsUrl=https://bamboo.phpbb.com/browse/PHPBB3-PR-JOB1-8920
bamboo_repository_75956235_branch_name=3.1.x
bamboo_planRepository_repositoryUrl=https://github.com/phpbb/phpbb.git
bamboo_agentId=131073
bamboo_planName=phpBB3 - Pull Requests
bamboo_build_commandline_com_atlassian_bamboo_plugins_scripttask_task_builder_script_7=/bin/sh /home/bamboo/temp/PHPBB3-PR-JOB1-8920-ScriptBuildTask-57528905551462669.sh
bamboo_shortPlanKey=PR
bamboo_shortJobKey=JOB1
bamboo_capability_dbms_mysql_55=true
bamboo_capability_system_jdk_JDK_1_7_0_65=/usr/lib/jvm/java-7-openjdk-amd64
bamboo_planRepository_revision=dc8ff9da28b8ab4ad11c7ea94cca526f17c87fe5
bamboo_buildTimeStamp=2018-10-18T09:16:39.171Z
bamboo_repository_previous_revision_number=dc8ff9da28b8ab4ad11c7ea94cca526f17c87fe5
bamboo_capability_system_jdk_JDK_1_6_0_16=/usr/lib/jvm/java-6-sun-1.6.0.16
bamboo_capability_system_builder_mvn2_Maven_2=/usr/share/maven2
bamboo_planRepository_previousRevision=dc8ff9da28b8ab4ad11c7ea94cca526f17c87fe5
bamboo_build_commandline_com_atlassian_bamboo_plugins_scripttask_task_builder_script_4=/bin/sh /home/bamboo/temp/PHPBB3-PR-JOB1-8920-ScriptBuildTask-8830595403193408793.sh
bamboo_repository_git_branch=3.1.x
bamboo_buildResultKey=PHPBB3-PR-JOB1-8920
bamboo_repository_branch_name=3.1.x
bamboo_buildPlanName=phpBB3 - Pull Requests - Build and Test Job
bamboo_planRepository_1_revision=dc8ff9da28b8ab4ad11c7ea94cca526f17c87fe5
bamboo_repository_name=phpBB Ascraeus
bamboo_buildFailed=false
bamboo_capability_system_docker_executable=/usr/bin/docker
bamboo_build_commandline_com_atlassian_bamboo_plugins_bamboo_docker_plugin_task_docker_cli_12=/usr/bin/docker run --volume /home/bamboo/xml-data/build-dir/PHPBB3-PR-JOB1:/data --workdir /data/phpBB --rm -e HOME=/home/bamboo -u=991 phpbb:php-5.6 /bin/bash -c php ../composer.phar install --dev; cd ../build; ../phpBB/vendor/bin/phing clean prepare
bamboo_planRepository_branch=3.1.x
bamboo_agentWorkingDirectory=/home/bamboo/xml-data/build-dir
bamboo_capability_system_git_executable=/usr/bin/git
bamboo_capability_system_builder_phpunit_PHPUnit_3_4=/usr/bin/phpunit
bamboo_repository_git_username=bantu
bamboo_planRepository_1_previousRevision=dc8ff9da28b8ab4ad11c7ea94cca526f17c87fe5
bamboo_repository_75956235_revision_number=dc8ff9da28b8ab4ad11c7ea94cca526f17c87fe5
bamboo_planRepository_branchDisplayName=3.1.x
bamboo_planRepository_1_type=gitv2
bamboo_planRepository_branchName=3.1.x
bamboo_repository_75956235_previous_revision_number=dc8ff9da28b8ab4ad11c7ea94cca526f17c87fe5
bamboo_capability_system_jdk_JDK=/usr/lib/jvm/java-6-sun
bamboo_plan_storageTag=PHPBB3-PR
bamboo_hg_cache_directory=/home/bamboo/xml-data/build-dir/_hg-repositories-cache
bamboo_planRepository_1_username=bantu
bamboo_planRepository_type=gitv2
bamboo_git_cache_directory=/home/bamboo/xml-data/build-dir/_git-repositories-cache
bamboo_ManualBuildTriggerReason_userName=Build Robot
bamboo_repository_git_repositoryUrl=https://github.com/phpbb/phpbb.git
bamboo_repository_75956235_git_branch=3.1.x
bamboo_capability_system_builder_ant_Ant=/usr/share/ant
bamboo_repository_75956235_name=phpBB Ascraeus
bamboo_tmp_directory=/home/bamboo/temp
bamboo_working_directory=/home/bamboo/xml-data/build-dir/PHPBB3-PR-JOB1
bamboo_planKey=PHPBB3-PR
bamboo_capability_local=true
bamboo_planRepository_1_repositoryUrl=https://github.com/phpbb/phpbb.git
bamboo_planRepository_username=bantu
bamboo_capability_system_jdk_JDK_1_6=/usr/lib/jvm/java-6-sun
bamboo_capability_system_jdk_JDK_1_7=/usr/lib/jvm/java-7-openjdk-amd64
bamboo_planRepository_1_branchName=3.1.x
18-Oct-2018 09:17:54 Buildfile: /data/build/build.xml
18-Oct-2018 09:17:54
18-Oct-2018 09:17:54 phpBB > sniff:
18-Oct-2018 09:17:54
18-Oct-2018 09:18:01 ............................................................  60 / 759 (8%)
18-Oct-2018 09:18:02 ............................................................ 120 / 759 (16%)
18-Oct-2018 09:18:03 ............................................................ 180 / 759 (24%)
18-Oct-2018 09:18:04 ............................................................ 240 / 759 (32%)
18-Oct-2018 09:18:06 ............................................................ 300 / 759 (40%)
18-Oct-2018 09:18:12 ............................................................ 360 / 759 (47%)
18-Oct-2018 09:18:17 ............................................................ 420 / 759 (55%)
18-Oct-2018 09:18:20 ............................................................ 480 / 759 (63%)
18-Oct-2018 09:18:24 ............................................................ 540 / 759 (71%)
18-Oct-2018 09:18:28 ............................................................ 600 / 759 (79%)
18-Oct-2018 09:18:32 ............................................................ 660 / 759 (87%)
18-Oct-2018 09:18:35 ............................................................ 720 / 759 (95%)
18-Oct-2018 09:18:36 .......................................
18-Oct-2018 09:18:36
18-Oct-2018 09:18:36 Time: 42.5 secs; Memory: 64.25Mb
18-Oct-2018 09:18:36
18-Oct-2018 09:18:44 ............................................................  60 / 209 (29%)
18-Oct-2018 09:19:02 ............................................................ 120 / 209 (57%)
18-Oct-2018 09:19:15 .....................................E...................... 180 / 209 (86%)
18-Oct-2018 09:19:22 .............................
18-Oct-2018 09:19:22
18-Oct-2018 09:19:22
18-Oct-2018 09:19:22 FILE: /data/phpBB/includes/acp/acp_update.php
18-Oct-2018 09:19:22 ----------------------------------------------------------------------
18-Oct-2018 09:19:22 FOUND 2 ERRORS AFFECTING 2 LINES
18-Oct-2018 09:19:22 ----------------------------------------------------------------------
18-Oct-2018 09:19:22   86 | ERROR | [x] Whitespace found at end of line
18-Oct-2018 09:19:22      |       |     (Squiz.WhiteSpace.SuperfluousWhitespace.EndLine)
18-Oct-2018 09:19:22 116 | ERROR | [x] Whitespace found at end of line
18-Oct-2018 09:19:22      |       |     (Squiz.WhiteSpace.SuperfluousWhitespace.EndLine)
18-Oct-2018 09:19:22 ----------------------------------------------------------------------
18-Oct-2018 09:19:22 PHPCBF CAN FIX THE 2 MARKED SNIFF VIOLATIONS AUTOMATICALLY
18-Oct-2018 09:19:22 ----------------------------------------------------------------------
18-Oct-2018 09:19:22
18-Oct-2018 09:19:22 Time: 45.92 secs; Memory: 61Mb
18-Oct-2018 09:19:22
18-Oct-2018 09:19:22
18-Oct-2018 09:19:22
18-Oct-2018 09:19:22 Time: 19ms; Memory: 3.75Mb
18-Oct-2018 09:19:22
18-Oct-2018 09:19:22        [if] Error in IfTask
18-Oct-2018 09:19:22 Execution of target "sniff" failed for the following reason: /data/build/build.xml:109:6: /data/build/build.xml:115:9: PHP Code Sniffer failed.
18-Oct-2018 09:19:22
18-Oct-2018 09:19:22 BUILD FAILED
18-Oct-2018 09:19:22 /data/build/build.xml:109:6: /data/build/build.xml:115:9: PHP Code Sniffer failed.
18-Oct-2018 09:19:22 Total time: 1 minutes  28.75 seconds
18-Oct-2018 09:19:22
18-Oct-2018 09:19:23 Error occurred while running Task 'Run sniffs(11)' of type com.atlassian.bamboo.plugins.bamboo-docker-plugin:task.docker.cli.
18-Oct-2018 09:19:23 com.atlassian.bamboo.task.TaskException: Failed to execute task
18-Oct-2018 09:19:23         at com.atlassian.bamboo.plugins.docker.service.RunService.execute(RunService.java:75)
18-Oct-2018 09:19:23         at com.atlassian.bamboo.plugins.docker.tasks.cli.DockerCliTask.execute(DockerCliTask.java:70)
18-Oct-2018 09:19:23         at com.atlassian.bamboo.task.TaskExecutorImpl.lambda$executeTasks$3(TaskExecutorImpl.java:285)
18-Oct-2018 09:19:23         at com.atlassian.bamboo.task.TaskExecutorImpl.executeTaskWithPrePostActions(TaskExecutorImpl.java:224)
18-Oct-2018 09:19:23         at com.atlassian.bamboo.task.TaskExecutorImpl.executeTasks(TaskExecutorImpl.java:285)
18-Oct-2018 09:19:23         at com.atlassian.bamboo.task.TaskExecutorImpl.execute(TaskExecutorImpl.java:112)
18-Oct-2018 09:19:23         at com.atlassian.bamboo.build.pipeline.tasks.ExecuteBuildTask.call(ExecuteBuildTask.java:71)
18-Oct-2018 09:19:23         at com.atlassian.bamboo.v2.build.agent.DefaultBuildAgent.executeBuildPhase(DefaultBuildAgent.java:203)
18-Oct-2018 09:19:23         at com.atlassian.bamboo.v2.build.agent.DefaultBuildAgent.build(DefaultBuildAgent.java:175)
18-Oct-2018 09:19:23         at com.atlassian.bamboo.v2.build.agent.BuildAgentControllerImpl.lambda$waitAndPerformBuild$0(BuildAgentControllerImpl.java:122)
18-Oct-2018 09:19:23         at com.atlassian.bamboo.variable.CustomVariableContextImpl.withVariableSubstitutor(CustomVariableContextImpl.java:185)
18-Oct-2018 09:19:23         at com.atlassian.bamboo.v2.build.agent.BuildAgentControllerImpl.waitAndPerformBuild(BuildAgentControllerImpl.java:117)
18-Oct-2018 09:19:23         at com.atlassian.bamboo.v2.build.agent.DefaultBuildAgent$1.run(DefaultBuildAgent.java:126)
18-Oct-2018 09:19:23         at com.atlassian.bamboo.utils.BambooRunnables$1.run(BambooRunnables.java:48)
18-Oct-2018 09:19:23         at com.atlassian.bamboo.security.ImpersonationHelper.runWith(ImpersonationHelper.java:26)
18-Oct-2018 09:19:23         at com.atlassian.bamboo.security.ImpersonationHelper.runWithSystemAuthority(ImpersonationHelper.java:17)
18-Oct-2018 09:19:23         at com.atlassian.bamboo.security.ImpersonationHelper$1.run(ImpersonationHelper.java:41)
18-Oct-2018 09:19:23         at java.lang.Thread.run(Thread.java:748)
18-Oct-2018 09:19:23 Caused by: com.atlassian.bamboo.docker.DockerException: Error running Docker run command
18-Oct-2018 09:19:23         at com.atlassian.bamboo.docker.DockerContainerServiceImpl.run(DockerContainerServiceImpl.java:118)
18-Oct-2018 09:19:23         at sun.reflect.GeneratedMethodAccessor2070.invoke(Unknown Source)
18-Oct-2018 09:19:23         at sun.reflect.DelegatingMethodAccessorImpl.invoke(DelegatingMethodAccessorImpl.java:43)
18-Oct-2018 09:19:23         at java.lang.reflect.Method.invoke(Method.java:498)
18-Oct-2018 09:19:23         at com.atlassian.plugin.util.ContextClassLoaderSettingInvocationHandler.invoke(ContextClassLoaderSettingInvocationHandler.java:26)
18-Oct-2018 09:19:23         at com.sun.proxy.$Proxy401.run(Unknown Source)
18-Oct-2018 09:19:23         at sun.reflect.GeneratedMethodAccessor2070.invoke(Unknown Source)
18-Oct-2018 09:19:23         at sun.reflect.DelegatingMethodAccessorImpl.invoke(DelegatingMethodAccessorImpl.java:43)
18-Oct-2018 09:19:23         at java.lang.reflect.Method.invoke(Method.java:498)
18-Oct-2018 09:19:23         at org.springframework.aop.support.AopUtils.invokeJoinpointUsingReflection(AopUtils.java:302)
18-Oct-2018 09:19:23         at org.eclipse.gemini.blueprint.service.importer.support.internal.aop.ServiceInvoker.doInvoke(ServiceInvoker.java:56)
18-Oct-2018 09:19:23         at org.eclipse.gemini.blueprint.service.importer.support.internal.aop.ServiceInvoker.invoke(ServiceInvoker.java:60)
18-Oct-2018 09:19:23         at org.springframework.aop.framework.ReflectiveMethodInvocation.proceed(ReflectiveMethodInvocation.java:179)
18-Oct-2018 09:19:23         at org.springframework.aop.support.DelegatingIntroductionInterceptor.doProceed(DelegatingIntroductionInterceptor.java:133)
18-Oct-2018 09:19:23         at org.springframework.aop.support.DelegatingIntroductionInterceptor.invoke(DelegatingIntroductionInterceptor.java:121)
18-Oct-2018 09:19:23         at org.springframework.aop.framework.ReflectiveMethodInvocation.proceed(ReflectiveMethodInvocation.java:179)
18-Oct-2018 09:19:23         at org.eclipse.gemini.blueprint.service.util.internal.aop.ServiceTCCLInterceptor.invokeUnprivileged(ServiceTCCLInterceptor.java:70)
18-Oct-2018 09:19:23         at org.eclipse.gemini.blueprint.service.util.internal.aop.ServiceTCCLInterceptor.invoke(ServiceTCCLInterceptor.java:53)
18-Oct-2018 09:19:23         at org.springframework.aop.framework.ReflectiveMethodInvocation.proceed(ReflectiveMethodInvocation.java:179)
18-Oct-2018 09:19:23         at org.eclipse.gemini.blueprint.service.importer.support.LocalBundleContextAdvice.invoke(LocalBundleContextAdvice.java:57)
18-Oct-2018 09:19:23         at org.springframework.aop.framework.ReflectiveMethodInvocation.proceed(ReflectiveMethodInvocation.java:179)
18-Oct-2018 09:19:23         at org.springframework.aop.support.DelegatingIntroductionInterceptor.doProceed(DelegatingIntroductionInterceptor.java:133)
18-Oct-2018 09:19:23         at org.springframework.aop.support.DelegatingIntroductionInterceptor.invoke(DelegatingIntroductionInterceptor.java:121)
18-Oct-2018 09:19:23         at org.springframework.aop.framework.ReflectiveMethodInvocation.proceed(ReflectiveMethodInvocation.java:179)
18-Oct-2018 09:19:23         at org.springframework.aop.framework.JdkDynamicAopProxy.invoke(JdkDynamicAopProxy.java:207)
18-Oct-2018 09:19:23         at com.sun.proxy.$Proxy667.run(Unknown Source)
18-Oct-2018 09:19:23         at com.atlassian.bamboo.plugins.docker.client.DockerCmd.run(DockerCmd.java:51)
18-Oct-2018 09:19:23         at com.atlassian.bamboo.plugins.docker.service.RunService.execute(RunService.java:64)
18-Oct-2018 09:19:23         ... 17 more
18-Oct-2018 09:19:23 Caused by: com.atlassian.utils.process.ProcessException: Error executing /usr/bin/docker run --volume /home/bamboo/xml-data/build-dir/PHPBB3-PR-JOB1:/data --workdir /data/build --rm -u=991 phpbb:php-5.6 ../phpBB/vendor/bin/phing sniff
18-Oct-2018 09:19:23         at com.atlassian.bamboo.docker.DockerContainerServiceImpl.execute(DockerContainerServiceImpl.java:252)
18-Oct-2018 09:19:23         at com.atlassian.bamboo.docker.DockerContainerServiceImpl.run(DockerContainerServiceImpl.java:106)
18-Oct-2018 09:19:23         ... 44 more
18-Oct-2018 09:19:23 Starting task 'Parsing test results produced by script' of type 'com.atlassian.bamboo.plugins.testresultparser:task.testresultparser.junit'
18-Oct-2018 09:19:23 Parsing test results under /home/bamboo/xml-data/build-dir/PHPBB3-PR-JOB1...
18-Oct-2018 09:19:23 Failing task since test cases were expected but none were found.
18-Oct-2018 09:19:23 Finished task 'Parsing test results produced by script' with result: Failed
18-Oct-2018 09:19:23
Substituting variable: ${bamboo.PRnumber} with 5419
18-Oct-2018 09:19:23
Substituting variable: ${bamboo.buildResultsUrl} with https://bamboo.phpbb.com/browse/PHPBB3-PR-JOB1-8920
18-Oct-2018 09:19:23
Substituting variable: ${bamboo.buildResultsUrl} with https://bamboo.phpbb.com/browse/PHPBB3-PR-JOB1-8920
18-Oct-2018 09:19:23 Starting task 'Set result build status' of type 'com.atlassian.bamboo.plugins.scripttask:task.builder.script'
18-Oct-2018 09:19:23
Beginning to execute external process for build 'phpBB3 - Pull Requests - Build and Test Job #8920 (PHPBB3-PR-JOB1-8920)'
... running command line:
/bin/sh /home/bamboo/temp/PHPBB3-PR-JOB1-8920-ScriptBuildTask-3855142182265439942.sh
... in: /home/bamboo/xml-data/build-dir/PHPBB3-PR-JOB1
... using extra environment variables:
bamboo_planRepository_1_branch=3.1.x
bamboo_planRepository_1_branchDisplayName=3.1.x
bamboo_repository_revision_number=dc8ff9da28b8ab4ad11c7ea94cca526f17c87fe5
bamboo_PRref=master
bamboo_resultsUrl=https://bamboo.phpbb.com/browse/PHPBB3-PR-JOB1-8920
bamboo_capability_system_builder_command_Git=/usr/bin/git
bamboo_repository_75956235_git_username=bantu
bamboo_build_working_directory=/home/bamboo/xml-data/build-dir/PHPBB3-PR-JOB1
bamboo_planRepository_1_name=phpBB Ascraeus
bamboo_buildKey=PHPBB3-PR-JOB1
bamboo_capability_phpbb_tests=true
bamboo_shortPlanName=Pull Requests
bamboo_capability_system_builder_command_fop=/usr/bin/fop
bamboo_capability_dbms_sqlite_2=true
bamboo_planRepository_name=phpBB Ascraeus
bamboo_PRnumber=5419
bamboo_buildNumber=8920
bamboo_repository_75956235_git_repositoryUrl=https://github.com/phpbb/phpbb.git
bamboo_capability_system_builder_phpunit_PHPUnit=/usr/bin/phpunit
bamboo_shortJobName=Build and Test Job
bamboo_buildResultsUrl=https://bamboo.phpbb.com/browse/PHPBB3-PR-JOB1-8920
bamboo_repository_75956235_branch_name=3.1.x
bamboo_planRepository_repositoryUrl=https://github.com/phpbb/phpbb.git
bamboo_agentId=131073
bamboo_planName=phpBB3 - Pull Requests
bamboo_build_commandline_com_atlassian_bamboo_plugins_scripttask_task_builder_script_7=/bin/sh /home/bamboo/temp/PHPBB3-PR-JOB1-8920-ScriptBuildTask-57528905551462669.sh
bamboo_shortPlanKey=PR
bamboo_shortJobKey=JOB1
bamboo_capability_dbms_mysql_55=true
bamboo_capability_system_jdk_JDK_1_7_0_65=/usr/lib/jvm/java-7-openjdk-amd64
bamboo_planRepository_revision=dc8ff9da28b8ab4ad11c7ea94cca526f17c87fe5
bamboo_buildTimeStamp=2018-10-18T09:16:39.171Z
bamboo_repository_previous_revision_number=dc8ff9da28b8ab4ad11c7ea94cca526f17c87fe5
bamboo_capability_system_jdk_JDK_1_6_0_16=/usr/lib/jvm/java-6-sun-1.6.0.16
bamboo_capability_system_builder_mvn2_Maven_2=/usr/share/maven2
bamboo_planRepository_previousRevision=dc8ff9da28b8ab4ad11c7ea94cca526f17c87fe5
bamboo_build_commandline_com_atlassian_bamboo_plugins_scripttask_task_builder_script_4=/bin/sh /home/bamboo/temp/PHPBB3-PR-JOB1-8920-ScriptBuildTask-8830595403193408793.sh
bamboo_repository_git_branch=3.1.x
bamboo_buildResultKey=PHPBB3-PR-JOB1-8920
bamboo_repository_branch_name=3.1.x
bamboo_buildPlanName=phpBB3 - Pull Requests - Build and Test Job
bamboo_planRepository_1_revision=dc8ff9da28b8ab4ad11c7ea94cca526f17c87fe5
bamboo_repository_name=phpBB Ascraeus
bamboo_buildFailed=true
bamboo_capability_system_docker_executable=/usr/bin/docker
bamboo_build_commandline_com_atlassian_bamboo_plugins_bamboo_docker_plugin_task_docker_cli_11=/usr/bin/docker run --volume /home/bamboo/xml-data/build-dir/PHPBB3-PR-JOB1:/data --workdir /data/build --rm -u=991 phpbb:php-5.6 ../phpBB/vendor/bin/phing sniff
bamboo_build_commandline_com_atlassian_bamboo_plugins_bamboo_docker_plugin_task_docker_cli_12=/usr/bin/docker run --volume /home/bamboo/xml-data/build-dir/PHPBB3-PR-JOB1:/data --workdir /data/phpBB --rm -e HOME=/home/bamboo -u=991 phpbb:php-5.6 /bin/bash -c php ../composer.phar install --dev; cd ../build; ../phpBB/vendor/bin/phing clean prepare
bamboo_planRepository_branch=3.1.x
bamboo_agentWorkingDirectory=/home/bamboo/xml-data/build-dir
bamboo_jobFailed=true
bamboo_capability_system_git_executable=/usr/bin/git
bamboo_capability_system_builder_phpunit_PHPUnit_3_4=/usr/bin/phpunit
bamboo_repository_git_username=bantu
bamboo_planRepository_1_previousRevision=dc8ff9da28b8ab4ad11c7ea94cca526f17c87fe5
bamboo_repository_75956235_revision_number=dc8ff9da28b8ab4ad11c7ea94cca526f17c87fe5
bamboo_planRepository_branchDisplayName=3.1.x
bamboo_planRepository_1_type=gitv2
bamboo_planRepository_branchName=3.1.x
bamboo_repository_75956235_previous_revision_number=dc8ff9da28b8ab4ad11c7ea94cca526f17c87fe5
bamboo_capability_system_jdk_JDK=/usr/lib/jvm/java-6-sun
bamboo_plan_storageTag=PHPBB3-PR
bamboo_hg_cache_directory=/home/bamboo/xml-data/build-dir/_hg-repositories-cache
bamboo_planRepository_1_username=bantu
bamboo_planRepository_type=gitv2
bamboo_git_cache_directory=/home/bamboo/xml-data/build-dir/_git-repositories-cache
bamboo_ManualBuildTriggerReason_userName=Build Robot
bamboo_repository_git_repositoryUrl=https://github.com/phpbb/phpbb.git
bamboo_repository_75956235_git_branch=3.1.x
bamboo_capability_system_builder_ant_Ant=/usr/share/ant
bamboo_repository_75956235_name=phpBB Ascraeus
bamboo_tmp_directory=/home/bamboo/temp
bamboo_working_directory=/home/bamboo/xml-data/build-dir/PHPBB3-PR-JOB1
bamboo_planKey=PHPBB3-PR
bamboo_capability_local=true
bamboo_planRepository_1_repositoryUrl=https://github.com/phpbb/phpbb.git
bamboo_planRepository_username=bantu
bamboo_capability_system_jdk_JDK_1_6=/usr/lib/jvm/java-6-sun
bamboo_capability_system_jdk_JDK_1_7=/usr/lib/jvm/java-7-openjdk-amd64
bamboo_planRepository_1_branchName=3.1.x
18-Oct-2018 09:19:25 From https://github.com/phpbb/phpbb
18-Oct-2018 09:19:25 * branch            refs/pull/5419/head -> FETCH_HEAD
18-Oct-2018 09:19:25 grep: build/logs/phpunit.xml: No such file or directory
18-Oct-2018 09:19:25 grep: build/logs/phpunit.xml: No such file or directory
18-Oct-2018 09:19:25   % Total    % Received % Xferd  Average Speed   Time    Time     Time  Current
18-Oct-2018 09:19:25                                  Dload  Upload   Total   Spent    Left  Speed
18-Oct-2018 09:19:25
18-Oct-2018 09:19:25   0     0    0     0    0     0      0      0 --:--:-- --:--:-- --:--:--     0
18-Oct-2018 09:19:25 100   273  100    93  100   180    198    384 --:--:-- --:--:-- --:--:--   385
18-Oct-2018 09:19:25 Finished task 'Set result build status' with result: Success
18-Oct-2018 09:19:25 Running post build plugin 'NCover Results Collector'
18-Oct-2018 09:19:25 Running post build plugin 'Artifact Copier'
18-Oct-2018 09:19:25 Running post build plugin 'npm Cache Cleanup'
18-Oct-2018 09:19:25 Running post build plugin 'Clover Results Collector'
18-Oct-2018 09:19:25 Running post build plugin 'Docker Container Cleanup'
18-Oct-2018 09:19:26 Successfully removed working directory at '/home/bamboo/xml-data/build-dir/PHPBB3-PR-JOB1'
18-Oct-2018 09:19:26 Finalising the build...
18-Oct-2018 09:19:26 Stopping timer.
18-Oct-2018 09:19:26 Build PHPBB3-PR-JOB1-8920 completed.
18-Oct-2018 09:19:26 Running on server: post build plugin 'NCover Results Collector'
18-Oct-2018 09:19:26 Running on server: post build plugin 'Build Hanging Detection Configuration'
18-Oct-2018 09:19:26 Running on server: post build plugin 'Clover Delta Calculator'
18-Oct-2018 09:19:26 Running on server: post build plugin 'Maven Dependencies Postprocessor'
18-Oct-2018 09:19:26 All post build plugins have finished
18-Oct-2018 09:19:26 Generating build results summary...
18-Oct-2018 09:19:26 Saving build results to disk...
18-Oct-2018 09:19:26 Logging substituted variables...
18-Oct-2018 09:19:26 Indexing build results...
18-Oct-2018 09:19:26 Finished building PHPBB3-PR-JOB1-8920.
18-Oct-2018 09:19:26
Substituting variable: ${bamboo.PRnumber} with 5419