Tests pending pull requests

Build: #9079 failed

Job: Build and Test Job failed

Stages & jobs

  1. Build and Test

Build log

The build generated 494 lines of output. Download or view full build log

27-Dec-2018 16:17:37 Build phpBB3 - Pull Requests - Build and Test Job #9079 (PHPBB3-PR-JOB1-9079) started building on agent Default Agent
27-Dec-2018 16:17:37
27-Dec-2018 16:17:37 Build working directory is /home/bamboo/xml-data/build-dir/PHPBB3-PR-JOB1
27-Dec-2018 16:17:37 Executing build phpBB3 - Pull Requests - Build and Test Job #9079 (PHPBB3-PR-JOB1-9079)
27-Dec-2018 16:17:37 Starting task 'Checkout develop branch' of type 'com.atlassian.bamboo.plugins.vcs:task.vcs.checkout'
27-Dec-2018 16:17:37 Build always requires a clean checkout
27-Dec-2018 16:17:37 Cleaning build directory '/home/bamboo/xml-data/build-dir/PHPBB3-PR-JOB1'
27-Dec-2018 16:17:37 Checking out into /home/bamboo/xml-data/build-dir/PHPBB3-PR-JOB1
27-Dec-2018 16:17:37 Updating source code to revision: dc8ff9da28b8ab4ad11c7ea94cca526f17c87fe5
27-Dec-2018 16:17:37 Fetching 'refs/heads/3.1.x' from 'https://github.com/phpbb/phpbb.git'.
27-Dec-2018 16:17:38 Checking out revision dc8ff9da28b8ab4ad11c7ea94cca526f17c87fe5.
27-Dec-2018 16:17:38 Creating local git repository in '/home/bamboo/xml-data/build-dir/PHPBB3-PR-JOB1/.git'.
27-Dec-2018 16:17:38 Cloning into '/home/bamboo/xml-data/build-dir/PHPBB3-PR-JOB1'...
27-Dec-2018 16:17:38 done.
27-Dec-2018 16:17:39 Switched to a new branch '3.1.x'
27-Dec-2018 16:17:39 Branch 3.1.x set up to track remote branch 3.1.x from origin.
27-Dec-2018 16:17:39 Updated source code to revision: dc8ff9da28b8ab4ad11c7ea94cca526f17c87fe5
27-Dec-2018 16:17:39 Finished task 'Checkout develop branch' with result: Success
27-Dec-2018 16:17:39 Running pre-build action: VCS Version Collector
27-Dec-2018 16:17:40
Substituting variable: ${bamboo.PRnumber} with 5351
27-Dec-2018 16:17:40
Substituting variable: ${bamboo.buildResultsUrl} with https://bamboo.phpbb.com/browse/PHPBB3-PR-JOB1-9079
27-Dec-2018 16:17:40 Starting task 'Set pending build status' of type 'com.atlassian.bamboo.plugins.scripttask:task.builder.script'
27-Dec-2018 16:17:40
Beginning to execute external process for build 'phpBB3 - Pull Requests - Build and Test Job #9079 (PHPBB3-PR-JOB1-9079)'
... running command line:
/bin/sh /home/bamboo/temp/PHPBB3-PR-JOB1-9079-ScriptBuildTask-2625833215922279257.sh
... in: /home/bamboo/xml-data/build-dir/PHPBB3-PR-JOB1
... using extra environment variables:
bamboo_planRepository_1_branch=3.1.x
bamboo_planRepository_1_branchDisplayName=3.1.x
bamboo_repository_revision_number=dc8ff9da28b8ab4ad11c7ea94cca526f17c87fe5
bamboo_PRref=master
bamboo_resultsUrl=https://bamboo.phpbb.com/browse/PHPBB3-PR-JOB1-9079
bamboo_capability_system_builder_command_Git=/usr/bin/git
bamboo_repository_75956235_git_username=bantu
bamboo_build_working_directory=/home/bamboo/xml-data/build-dir/PHPBB3-PR-JOB1
bamboo_planRepository_1_name=phpBB Ascraeus
bamboo_buildKey=PHPBB3-PR-JOB1
bamboo_capability_phpbb_tests=true
bamboo_shortPlanName=Pull Requests
bamboo_capability_system_builder_command_fop=/usr/bin/fop
bamboo_capability_dbms_sqlite_2=true
bamboo_planRepository_name=phpBB Ascraeus
bamboo_PRnumber=5351
bamboo_buildNumber=9079
bamboo_repository_75956235_git_repositoryUrl=https://github.com/phpbb/phpbb.git
bamboo_capability_system_builder_phpunit_PHPUnit=/usr/bin/phpunit
bamboo_shortJobName=Build and Test Job
bamboo_buildResultsUrl=https://bamboo.phpbb.com/browse/PHPBB3-PR-JOB1-9079
bamboo_repository_75956235_branch_name=3.1.x
bamboo_planRepository_repositoryUrl=https://github.com/phpbb/phpbb.git
bamboo_agentId=131073
bamboo_planName=phpBB3 - Pull Requests
bamboo_shortPlanKey=PR
bamboo_shortJobKey=JOB1
bamboo_capability_dbms_mysql_55=true
bamboo_capability_system_jdk_JDK_1_7_0_65=/usr/lib/jvm/java-7-openjdk-amd64
bamboo_planRepository_revision=dc8ff9da28b8ab4ad11c7ea94cca526f17c87fe5
bamboo_buildTimeStamp=2018-12-27T16:17:37.706Z
bamboo_repository_previous_revision_number=dc8ff9da28b8ab4ad11c7ea94cca526f17c87fe5
bamboo_capability_system_jdk_JDK_1_6_0_16=/usr/lib/jvm/java-6-sun-1.6.0.16
bamboo_capability_system_builder_mvn2_Maven_2=/usr/share/maven2
bamboo_planRepository_previousRevision=dc8ff9da28b8ab4ad11c7ea94cca526f17c87fe5
bamboo_repository_git_branch=3.1.x
bamboo_buildResultKey=PHPBB3-PR-JOB1-9079
bamboo_repository_branch_name=3.1.x
bamboo_buildPlanName=phpBB3 - Pull Requests - Build and Test Job
bamboo_planRepository_1_revision=dc8ff9da28b8ab4ad11c7ea94cca526f17c87fe5
bamboo_repository_name=phpBB Ascraeus
bamboo_buildFailed=false
bamboo_capability_system_docker_executable=/usr/bin/docker
bamboo_planRepository_branch=3.1.x
bamboo_agentWorkingDirectory=/home/bamboo/xml-data/build-dir
bamboo_capability_system_git_executable=/usr/bin/git
bamboo_capability_system_builder_phpunit_PHPUnit_3_4=/usr/bin/phpunit
bamboo_repository_git_username=bantu
bamboo_planRepository_1_previousRevision=dc8ff9da28b8ab4ad11c7ea94cca526f17c87fe5
bamboo_repository_75956235_revision_number=dc8ff9da28b8ab4ad11c7ea94cca526f17c87fe5
bamboo_planRepository_branchDisplayName=3.1.x
bamboo_planRepository_1_type=gitv2
bamboo_planRepository_branchName=3.1.x
bamboo_repository_75956235_previous_revision_number=dc8ff9da28b8ab4ad11c7ea94cca526f17c87fe5
bamboo_capability_system_jdk_JDK=/usr/lib/jvm/java-6-sun
bamboo_plan_storageTag=PHPBB3-PR
bamboo_hg_cache_directory=/home/bamboo/xml-data/build-dir/_hg-repositories-cache
bamboo_planRepository_1_username=bantu
bamboo_planRepository_type=gitv2
bamboo_git_cache_directory=/home/bamboo/xml-data/build-dir/_git-repositories-cache
bamboo_ManualBuildTriggerReason_userName=Build Robot
bamboo_repository_git_repositoryUrl=https://github.com/phpbb/phpbb.git
bamboo_repository_75956235_git_branch=3.1.x
bamboo_capability_system_builder_ant_Ant=/usr/share/ant
bamboo_repository_75956235_name=phpBB Ascraeus
bamboo_tmp_directory=/home/bamboo/temp
bamboo_working_directory=/home/bamboo/xml-data/build-dir/PHPBB3-PR-JOB1
bamboo_planKey=PHPBB3-PR
bamboo_capability_local=true
bamboo_planRepository_1_repositoryUrl=https://github.com/phpbb/phpbb.git
bamboo_planRepository_username=bantu
bamboo_capability_system_jdk_JDK_1_6=/usr/lib/jvm/java-6-sun
bamboo_capability_system_jdk_JDK_1_7=/usr/lib/jvm/java-7-openjdk-amd64
bamboo_planRepository_1_branchName=3.1.x
27-Dec-2018 16:17:43 From https://github.com/phpbb/phpbb
27-Dec-2018 16:17:43 * branch            refs/pull/5351/head -> FETCH_HEAD
27-Dec-2018 16:17:43   % Total    % Received % Xferd  Average Speed   Time    Time     Time  Current
27-Dec-2018 16:17:43                                  Dload  Upload   Total   Spent    Left  Speed
27-Dec-2018 16:17:43
27-Dec-2018 16:17:43   0     0    0     0    0     0      0      0 --:--:-- --:--:-- --:--:--     0
27-Dec-2018 16:17:43 100   275  100    93  100   182    278    544 --:--:-- --:--:-- --:--:--   546
27-Dec-2018 16:17:43 Finished task 'Set pending build status' with result: Success
27-Dec-2018 16:17:43
Substituting variable: ${bamboo.PRnumber} with 5351
27-Dec-2018 16:17:43 Starting task 'Fetch PR' of type 'com.atlassian.bamboo.plugins.scripttask:task.builder.script'
27-Dec-2018 16:17:43
Beginning to execute external process for build 'phpBB3 - Pull Requests - Build and Test Job #9079 (PHPBB3-PR-JOB1-9079)'
... running command line:
/bin/sh /home/bamboo/temp/PHPBB3-PR-JOB1-9079-ScriptBuildTask-4780594757988344146.sh
... in: /home/bamboo/xml-data/build-dir/PHPBB3-PR-JOB1
... using extra environment variables:
bamboo_planRepository_1_branch=3.1.x
bamboo_planRepository_1_branchDisplayName=3.1.x
bamboo_repository_revision_number=dc8ff9da28b8ab4ad11c7ea94cca526f17c87fe5
bamboo_PRref=master
bamboo_resultsUrl=https://bamboo.phpbb.com/browse/PHPBB3-PR-JOB1-9079
bamboo_capability_system_builder_command_Git=/usr/bin/git
bamboo_repository_75956235_git_username=bantu
bamboo_build_working_directory=/home/bamboo/xml-data/build-dir/PHPBB3-PR-JOB1
bamboo_planRepository_1_name=phpBB Ascraeus
bamboo_buildKey=PHPBB3-PR-JOB1
bamboo_capability_phpbb_tests=true
bamboo_shortPlanName=Pull Requests
bamboo_capability_system_builder_command_fop=/usr/bin/fop
bamboo_capability_dbms_sqlite_2=true
bamboo_planRepository_name=phpBB Ascraeus
bamboo_PRnumber=5351
bamboo_buildNumber=9079
bamboo_repository_75956235_git_repositoryUrl=https://github.com/phpbb/phpbb.git
bamboo_capability_system_builder_phpunit_PHPUnit=/usr/bin/phpunit
bamboo_shortJobName=Build and Test Job
bamboo_buildResultsUrl=https://bamboo.phpbb.com/browse/PHPBB3-PR-JOB1-9079
bamboo_repository_75956235_branch_name=3.1.x
bamboo_planRepository_repositoryUrl=https://github.com/phpbb/phpbb.git
bamboo_agentId=131073
bamboo_planName=phpBB3 - Pull Requests
bamboo_build_commandline_com_atlassian_bamboo_plugins_scripttask_task_builder_script_7=/bin/sh /home/bamboo/temp/PHPBB3-PR-JOB1-9079-ScriptBuildTask-2625833215922279257.sh
bamboo_shortPlanKey=PR
bamboo_shortJobKey=JOB1
bamboo_capability_dbms_mysql_55=true
bamboo_capability_system_jdk_JDK_1_7_0_65=/usr/lib/jvm/java-7-openjdk-amd64
bamboo_planRepository_revision=dc8ff9da28b8ab4ad11c7ea94cca526f17c87fe5
bamboo_buildTimeStamp=2018-12-27T16:17:37.706Z
bamboo_repository_previous_revision_number=dc8ff9da28b8ab4ad11c7ea94cca526f17c87fe5
bamboo_capability_system_jdk_JDK_1_6_0_16=/usr/lib/jvm/java-6-sun-1.6.0.16
bamboo_capability_system_builder_mvn2_Maven_2=/usr/share/maven2
bamboo_planRepository_previousRevision=dc8ff9da28b8ab4ad11c7ea94cca526f17c87fe5
bamboo_repository_git_branch=3.1.x
bamboo_buildResultKey=PHPBB3-PR-JOB1-9079
bamboo_repository_branch_name=3.1.x
bamboo_buildPlanName=phpBB3 - Pull Requests - Build and Test Job
bamboo_planRepository_1_revision=dc8ff9da28b8ab4ad11c7ea94cca526f17c87fe5
bamboo_repository_name=phpBB Ascraeus
bamboo_buildFailed=false
bamboo_capability_system_docker_executable=/usr/bin/docker
bamboo_planRepository_branch=3.1.x
bamboo_agentWorkingDirectory=/home/bamboo/xml-data/build-dir
bamboo_capability_system_git_executable=/usr/bin/git
bamboo_capability_system_builder_phpunit_PHPUnit_3_4=/usr/bin/phpunit
bamboo_repository_git_username=bantu
bamboo_planRepository_1_previousRevision=dc8ff9da28b8ab4ad11c7ea94cca526f17c87fe5
bamboo_repository_75956235_revision_number=dc8ff9da28b8ab4ad11c7ea94cca526f17c87fe5
bamboo_planRepository_branchDisplayName=3.1.x
bamboo_planRepository_1_type=gitv2
bamboo_planRepository_branchName=3.1.x
bamboo_repository_75956235_previous_revision_number=dc8ff9da28b8ab4ad11c7ea94cca526f17c87fe5
bamboo_capability_system_jdk_JDK=/usr/lib/jvm/java-6-sun
bamboo_plan_storageTag=PHPBB3-PR
bamboo_hg_cache_directory=/home/bamboo/xml-data/build-dir/_hg-repositories-cache
bamboo_planRepository_1_username=bantu
bamboo_planRepository_type=gitv2
bamboo_git_cache_directory=/home/bamboo/xml-data/build-dir/_git-repositories-cache
bamboo_ManualBuildTriggerReason_userName=Build Robot
bamboo_repository_git_repositoryUrl=https://github.com/phpbb/phpbb.git
bamboo_repository_75956235_git_branch=3.1.x
bamboo_capability_system_builder_ant_Ant=/usr/share/ant
bamboo_repository_75956235_name=phpBB Ascraeus
bamboo_tmp_directory=/home/bamboo/temp
bamboo_working_directory=/home/bamboo/xml-data/build-dir/PHPBB3-PR-JOB1
bamboo_planKey=PHPBB3-PR
bamboo_capability_local=true
bamboo_planRepository_1_repositoryUrl=https://github.com/phpbb/phpbb.git
bamboo_planRepository_username=bantu
bamboo_capability_system_jdk_JDK_1_6=/usr/lib/jvm/java-6-sun
bamboo_capability_system_jdk_JDK_1_7=/usr/lib/jvm/java-7-openjdk-amd64
bamboo_planRepository_1_branchName=3.1.x
27-Dec-2018 16:17:46 From https://github.com/phpbb/phpbb
27-Dec-2018 16:17:46 * branch            refs/pull/5351/merge -> FETCH_HEAD
27-Dec-2018 16:17:46 Note: checking out 'FETCH_HEAD'.
27-Dec-2018 16:17:46
27-Dec-2018 16:17:46 You are in 'detached HEAD' state. You can look around, make experimental
27-Dec-2018 16:17:46 changes and commit them, and you can discard any commits you make in this
27-Dec-2018 16:17:46 state without impacting any branches by performing another checkout.
27-Dec-2018 16:17:46
27-Dec-2018 16:17:46 If you want to create a new branch to retain commits you create, you may
27-Dec-2018 16:17:46 do so (now or later) by using -b with the checkout command again. Example:
27-Dec-2018 16:17:46
27-Dec-2018 16:17:46   git checkout -b new_branch_name
27-Dec-2018 16:17:46
27-Dec-2018 16:17:46 HEAD is now at e697496... Merge ed0c469d4e30d279d6e5c700da685e8fe2ab0b2e into 3084ea4d75ed1843d407961c9461a88070ffd8ca
27-Dec-2018 16:17:46 Finished task 'Fetch PR' with result: Success
27-Dec-2018 16:17:46 Skipping execution of task 'Prepare directory' as it is disabled
27-Dec-2018 16:17:46
Substituting variable: ${bamboo.working.directory} with /home/bamboo/xml-data/build-dir/PHPBB3-PR-JOB1
27-Dec-2018 16:17:46 Starting task 'Prepare directory' of type 'com.atlassian.bamboo.plugins.bamboo-docker-plugin:task.docker.cli'
27-Dec-2018 16:17:46 Running image name (phpbb:php-5.6)
27-Dec-2018 16:17:46
Beginning to execute external process for build 'phpBB3 - Pull Requests - Build and Test Job #9079 (PHPBB3-PR-JOB1-9079)'
... running command line:
/usr/bin/docker run --volume /home/bamboo/xml-data/build-dir/PHPBB3-PR-JOB1:/data --workdir /data/phpBB --rm -e HOME=/home/bamboo -u=991 phpbb:php-5.6 /bin/bash -c php ../composer.phar install --dev; cd ../build; ../phpBB/vendor/bin/phing clean prepare
... in: /home/bamboo/xml-data/build-dir/PHPBB3-PR-JOB1
... using extra environment variables:
bamboo_planRepository_1_branch=3.1.x
bamboo_planRepository_1_branchDisplayName=3.1.x
bamboo_repository_revision_number=dc8ff9da28b8ab4ad11c7ea94cca526f17c87fe5
bamboo_PRref=master
bamboo_resultsUrl=https://bamboo.phpbb.com/browse/PHPBB3-PR-JOB1-9079
bamboo_capability_system_builder_command_Git=/usr/bin/git
bamboo_repository_75956235_git_username=bantu
bamboo_build_working_directory=/home/bamboo/xml-data/build-dir/PHPBB3-PR-JOB1
bamboo_planRepository_1_name=phpBB Ascraeus
bamboo_buildKey=PHPBB3-PR-JOB1
bamboo_capability_phpbb_tests=true
bamboo_shortPlanName=Pull Requests
bamboo_capability_system_builder_command_fop=/usr/bin/fop
bamboo_capability_dbms_sqlite_2=true
bamboo_planRepository_name=phpBB Ascraeus
bamboo_PRnumber=5351
bamboo_buildNumber=9079
bamboo_repository_75956235_git_repositoryUrl=https://github.com/phpbb/phpbb.git
bamboo_capability_system_builder_phpunit_PHPUnit=/usr/bin/phpunit
bamboo_shortJobName=Build and Test Job
bamboo_buildResultsUrl=https://bamboo.phpbb.com/browse/PHPBB3-PR-JOB1-9079
bamboo_repository_75956235_branch_name=3.1.x
bamboo_planRepository_repositoryUrl=https://github.com/phpbb/phpbb.git
bamboo_agentId=131073
bamboo_planName=phpBB3 - Pull Requests
bamboo_build_commandline_com_atlassian_bamboo_plugins_scripttask_task_builder_script_7=/bin/sh /home/bamboo/temp/PHPBB3-PR-JOB1-9079-ScriptBuildTask-2625833215922279257.sh
bamboo_shortPlanKey=PR
bamboo_shortJobKey=JOB1
bamboo_capability_dbms_mysql_55=true
bamboo_capability_system_jdk_JDK_1_7_0_65=/usr/lib/jvm/java-7-openjdk-amd64
bamboo_planRepository_revision=dc8ff9da28b8ab4ad11c7ea94cca526f17c87fe5
bamboo_buildTimeStamp=2018-12-27T16:17:37.706Z
bamboo_repository_previous_revision_number=dc8ff9da28b8ab4ad11c7ea94cca526f17c87fe5
bamboo_capability_system_jdk_JDK_1_6_0_16=/usr/lib/jvm/java-6-sun-1.6.0.16
bamboo_capability_system_builder_mvn2_Maven_2=/usr/share/maven2
bamboo_planRepository_previousRevision=dc8ff9da28b8ab4ad11c7ea94cca526f17c87fe5
bamboo_build_commandline_com_atlassian_bamboo_plugins_scripttask_task_builder_script_4=/bin/sh /home/bamboo/temp/PHPBB3-PR-JOB1-9079-ScriptBuildTask-4780594757988344146.sh
bamboo_repository_git_branch=3.1.x
bamboo_buildResultKey=PHPBB3-PR-JOB1-9079
bamboo_repository_branch_name=3.1.x
bamboo_buildPlanName=phpBB3 - Pull Requests - Build and Test Job
bamboo_planRepository_1_revision=dc8ff9da28b8ab4ad11c7ea94cca526f17c87fe5
bamboo_repository_name=phpBB Ascraeus
bamboo_buildFailed=false
bamboo_capability_system_docker_executable=/usr/bin/docker
bamboo_planRepository_branch=3.1.x
bamboo_agentWorkingDirectory=/home/bamboo/xml-data/build-dir
bamboo_capability_system_git_executable=/usr/bin/git
bamboo_capability_system_builder_phpunit_PHPUnit_3_4=/usr/bin/phpunit
bamboo_repository_git_username=bantu
bamboo_planRepository_1_previousRevision=dc8ff9da28b8ab4ad11c7ea94cca526f17c87fe5
bamboo_repository_75956235_revision_number=dc8ff9da28b8ab4ad11c7ea94cca526f17c87fe5
bamboo_planRepository_branchDisplayName=3.1.x
bamboo_planRepository_1_type=gitv2
bamboo_planRepository_branchName=3.1.x
bamboo_repository_75956235_previous_revision_number=dc8ff9da28b8ab4ad11c7ea94cca526f17c87fe5
bamboo_capability_system_jdk_JDK=/usr/lib/jvm/java-6-sun
bamboo_plan_storageTag=PHPBB3-PR
bamboo_hg_cache_directory=/home/bamboo/xml-data/build-dir/_hg-repositories-cache
bamboo_planRepository_1_username=bantu
bamboo_planRepository_type=gitv2
bamboo_git_cache_directory=/home/bamboo/xml-data/build-dir/_git-repositories-cache
bamboo_ManualBuildTriggerReason_userName=Build Robot
bamboo_repository_git_repositoryUrl=https://github.com/phpbb/phpbb.git
bamboo_repository_75956235_git_branch=3.1.x
bamboo_capability_system_builder_ant_Ant=/usr/share/ant
bamboo_repository_75956235_name=phpBB Ascraeus
bamboo_tmp_directory=/home/bamboo/temp
bamboo_working_directory=/home/bamboo/xml-data/build-dir/PHPBB3-PR-JOB1
bamboo_planKey=PHPBB3-PR
bamboo_capability_local=true
bamboo_planRepository_1_repositoryUrl=https://github.com/phpbb/phpbb.git
bamboo_planRepository_username=bantu
bamboo_capability_system_jdk_JDK_1_6=/usr/lib/jvm/java-6-sun
bamboo_capability_system_jdk_JDK_1_7=/usr/lib/jvm/java-7-openjdk-amd64
bamboo_planRepository_1_branchName=3.1.x
27-Dec-2018 16:17:47 Cannot create cache directory /home/bamboo/.composer/cache/repo/https---repo.packagist.org/, or directory is not writable. Proceeding without cache
27-Dec-2018 16:17:47 Cannot create cache directory /home/bamboo/.composer/cache/files/, or directory is not writable. Proceeding without cache
27-Dec-2018 16:17:47 You are using the deprecated option "dev". Dev packages are installed by default now.
27-Dec-2018 16:17:47 Loading composer repositories with package information
27-Dec-2018 16:17:47 Installing dependencies (including require-dev) from lock file
27-Dec-2018 16:17:47 Warning: The lock file is not up to date with the latest changes in composer.json. You may be getting outdated dependencies. Run update to update them.
27-Dec-2018 16:17:47 Package operations: 76 installs, 0 updates, 0 removals
27-Dec-2018 16:17:48   - Installing composer/installers (v1.5.0): Downloading (connecting...)Downloading (0%)           Downloading (5%)Downloading (20%)Downloading (25%)Downloading (30%)Downloading (35%)Downloading (50%)Downloading (55%)Downloading (60%)Downloading (80%)Downloading (85%)Downloading (90%)Downloading (100%)
27-Dec-2018 16:17:48   - Installing bantu/ini-get-wrapper (v1.0.1): Downloading (connecting...)Downloading (0%)           Downloading (100%)
27-Dec-2018 16:17:49   - Installing symfony/process (v3.4.15): Downloading (connecting...)Downloading (100%)         
27-Dec-2018 16:17:50   - Installing symfony/finder (v3.4.15): Downloading (connecting...)Downloading (0%)           Downloading (5%)Downloading (35%)Downloading (40%)Downloading (45%)Downloading (50%)Downloading (80%)Downloading (85%)Downloading (90%)Downloading (100%)
27-Dec-2018 16:17:50   - Installing symfony/polyfill-ctype (v1.9.0): Downloading (connecting...)Downloading (0%)           Downloading (100%)
27-Dec-2018 16:17:51   - Installing symfony/filesystem (v3.4.15): Downloading (connecting...)Downloading (100%)         
27-Dec-2018 16:17:51   - Installing symfony/polyfill-mbstring (v1.9.0): Downloading (connecting...)Downloading (0%)           Downloading (30%)Downloading (55%)Downloading (100%)
27-Dec-2018 16:17:52   - Installing psr/log (1.0.2): Downloading (connecting...)Downloading (0%)           Downloading (15%)Downloading (100%)
27-Dec-2018 16:17:53   - Installing symfony/debug (v3.4.15): Downloading (connecting...)Downloading (100%)         
27-Dec-2018 16:17:54   - Installing symfony/console (v3.4.15): Downloading (connecting...)Downloading (0%)           Downloading (5%)Downloading (10%)Downloading (15%)Downloading (20%)Downloading (25%)Downloading (30%)Downloading (35%)Downloading (40%)Downloading (45%)Downloading (50%)Downloading (55%)Downloading (60%)Downloading (65%)Downloading (70%)Downloading (75%)Downloading (80%)Downloading (85%)Downloading (90%)Downloading (95%)Downloading (100%)
27-Dec-2018 16:17:54   - Installing seld/phar-utils (1.0.1): Downloading (connecting...)Downloading (0%)           Downloading (30%)Downloading (60%)Downloading (90%)Downloading (100%)
27-Dec-2018 16:17:55   - Installing seld/jsonlint (1.7.1): Downloading (connecting...)Downloading (100%)         
27-Dec-2018 16:17:55   - Installing justinrainbow/json-schema (5.2.7): Downloading (connecting...)Downloading (0%)           Downloading (20%)Downloading (25%)Downloading (30%)Downloading (35%)Downloading (50%)Downloading (55%)Downloading (70%)Downloading (75%)Downloading (95%)Downloading (100%)
27-Dec-2018 16:17:56   - Installing composer/xdebug-handler (1.3.0): Downloading (connecting...)Downloading (0%)           Downloading (25%)Downloading (65%)Downloading (90%)Downloading (100%)
27-Dec-2018 16:17:57   - Installing composer/spdx-licenses (1.4.0): Downloading (connecting...)Downloading (100%)         
27-Dec-2018 16:17:57   - Installing composer/semver (1.4.2): Downloading (connecting...)Downloading (0%)           Downloading (35%)Downloading (85%)Downloading (100%)
27-Dec-2018 16:17:58   - Installing composer/ca-bundle (1.1.2): Downloading (connecting...)Downloading (0%)           Downloading (5%)Downloading (10%)Downloading (15%)Downloading (20%)Downloading (25%)Downloading (30%)Downloading (35%)Downloading (40%)Downloading (45%)Downloading (50%)Downloading (55%)Downloading (60%)Downloading (65%)Downloading (75%)Downloading (80%)Downloading (85%)Downloading (90%)Downloading (95%)Downloading (100%)
27-Dec-2018 16:17:59   - Installing composer/composer (1.7.2): Downloading (connecting...)Downloading (0%)           Downloading (5%)Downloading (10%)Downloading (15%)Downloading (20%)Downloading (25%)Downloading (30%)Downloading (35%)Downloading (40%)Downloading (45%)Downloading (50%)Downloading (55%)Downloading (60%)Downloading (65%)Downloading (70%)Downloading (75%)Downloading (80%)Downloading (85%)Downloading (90%)Downloading (95%)Downloading (100%)
27-Dec-2018 16:18:00   - Installing google/recaptcha (1.2.1): Downloading (connecting...)Downloading (0%)           Downloading (5%)Downloading (10%)Downloading (15%)Downloading (20%)Downloading (95%)Downloading (100%)
27-Dec-2018 16:18:00   - Installing guzzlehttp/promises (v1.3.1): Downloading (connecting...)Downloading (0%)           Downloading (30%)Downloading (60%)Downloading (80%)Downloading (100%)
27-Dec-2018 16:18:01   - Installing psr/http-message (1.0.1): Downloading (connecting...)Downloading (0%)           Downloading (100%)
27-Dec-2018 16:18:02   - Installing guzzlehttp/psr7 (1.4.2): Downloading (connecting...)Downloading (0%)           Downloading (5%)Downloading (10%)Downloading (15%)Downloading (20%)Downloading (50%)Downloading (55%)Downloading (60%)Downloading (65%)Downloading (70%)Downloading (75%)Downloading (100%)
27-Dec-2018 16:18:02   - Installing lusitanian/oauth (v0.8.11): Downloading (connecting...)Downloading (0%)           Downloading (5%)Downloading (10%)Downloading (15%)Downloading (20%)Downloading (30%)Downloading (35%)Downloading (40%)Downloading (45%)Downloading (50%)Downloading (55%)Downloading (60%)Downloading (65%)Downloading (70%)Downloading (75%)Downloading (85%)Downloading (90%)Downloading (100%)
27-Dec-2018 16:18:03   - Installing marc1706/fast-image-size (v1.1.4): Downloading (connecting...)Downloading (100%)         
27-Dec-2018 16:18:04   - Installing patchwork/utf8 (v1.3.1): Downloading (connecting...)Downloading (0%)           Downloading (5%)Downloading (10%)Downloading (15%)Downloading (20%)Downloading (25%)Downloading (30%)Downloading (35%)Downloading (40%)Downloading (45%)Downloading (50%)Downloading (55%)Downloading (60%)Downloading (65%)Downloading (70%)Downloading (75%)Downloading (80%)Downloading (85%)Downloading (90%)Downloading (95%)Downloading (100%)
27-Dec-2018 16:18:05   - Installing psr/container (1.0.0): Downloading (connecting...)Downloading (0%)           Downloading (75%)Downloading (80%)Downloading (100%)
27-Dec-2018 16:18:06   - Installing s9e/text-formatter (0.13.1): Downloading (connecting...)Downloading (100%)         
27-Dec-2018 16:18:07   - Installing symfony/config (v3.4.15): Downloading (connecting...)Downloading (0%)           Downloading (5%)Downloading (10%)Downloading (15%)Downloading (20%)Downloading (25%)Downloading (30%)Downloading (35%)Downloading (40%)Downloading (45%)Downloading (50%)Downloading (55%)Downloading (60%)Downloading (65%)Downloading (70%)Downloading (75%)Downloading (80%)Downloading (85%)Downloading (90%)Downloading (95%)Downloading (100%)
27-Dec-2018 16:18:07   - Installing paragonie/random_compat (v1.4.3): Downloading (connecting...)Downloading (0%)           Downloading (10%)Downloading (35%)Downloading (45%)Downloading (50%)Downloading (60%)Downloading (85%)Downloading (95%)Downloading (100%)
27-Dec-2018 16:18:08   - Installing symfony/polyfill-php70 (v1.9.0): Downloading (connecting...)Downloading (100%)         
27-Dec-2018 16:18:09   - Installing symfony/http-foundation (v3.4.15): Downloading (connecting...)Downloading (0%)           Downloading (5%)Downloading (10%)Downloading (15%)Downloading (20%)Downloading (25%)Downloading (30%)Downloading (35%)Downloading (40%)Downloading (45%)Downloading (50%)Downloading (55%)Downloading (60%)Downloading (65%)Downloading (70%)Downloading (75%)Downloading (80%)Downloading (85%)Downloading (90%)Downloading (95%)Downloading (100%)
27-Dec-2018 16:18:10   - Installing symfony/event-dispatcher (v3.4.15): Downloading (connecting...)Downloading (0%)           Downloading (5%)Downloading (45%)Downloading (50%)Downloading (55%)Downloading (60%)Downloading (100%)
27-Dec-2018 16:18:10   - Installing symfony/http-kernel (v3.4.15): Downloading (connecting...)Downloading (100%)         
27-Dec-2018 16:18:12   - Installing symfony/dependency-injection (v3.4.15): Downloading (connecting...)Downloading (0%)           Downloading (5%)Downloading (10%)Downloading (15%)Downloading (20%)Downloading (25%)Downloading (30%)Downloading (35%)Downloading (40%)Downloading (45%)Downloading (50%)Downloading (55%)Downloading (60%)Downloading (65%)Downloading (70%)Downloading (75%)Downloading (80%)Downloading (85%)Downloading (90%)Downloading (95%)Downloading (100%)
27-Dec-2018 16:18:13   - Installing zendframework/zend-eventmanager (3.2.1): Downloading (connecting...)Downloading (0%)           Downloading (15%)Downloading (25%)Downloading (45%)Downloading (65%)Downloading (95%)Downloading (100%)
27-Dec-2018 16:18:13   - Installing zendframework/zend-code (2.6.3): Downloading (connecting...)Downloading (100%)         
27-Dec-2018 16:18:15   - Installing ocramius/proxy-manager (1.0.2): Downloading (connecting...)Downloading (0%)           Downloading (5%)Downloading (10%)Downloading (15%)Downloading (20%)Downloading (25%)Downloading (30%)Downloading (35%)Downloading (40%)Downloading (45%)Downloading (50%)Downloading (55%)Downloading (60%)Downloading (65%)Downloading (70%)Downloading (75%)Downloading (80%)Downloading (85%)Downloading (90%)Downloading (95%)Downloading (100%)
27-Dec-2018 16:18:16   - Installing symfony/proxy-manager-bridge (v3.4.15): Downloading (connecting...)Downloading (100%)         
27-Dec-2018 16:18:17   - Installing symfony/routing (v3.4.15): Downloading (connecting...)Downloading (100%)         
27-Dec-2018 16:18:19   - Installing twig/twig (v1.35.4): Downloading (connecting...)Downloading (0%)           Downloading (5%)Downloading (10%)Downloading (15%)Downloading (20%)Downloading (25%)Downloading (30%)Downloading (35%)Downloading (40%)Downloading (45%)Downloading (50%)Downloading (55%)Downloading (60%)Downloading (65%)Downloading (70%)Downloading (75%)Downloading (80%)Downloading (85%)Downloading (90%)Downloading (100%)
27-Dec-2018 16:18:20   - Installing symfony/twig-bridge (v3.4.15): Downloading (connecting...)Downloading (100%)         
27-Dec-2018 16:18:21   - Installing symfony/dom-crawler (v3.4.15): Downloading (connecting...)Downloading (100%)         
27-Dec-2018 16:18:22   - Installing symfony/css-selector (v3.4.15): Downloading (connecting...)Downloading (0%)           Downloading (5%)Downloading (10%)Downloading (15%)Downloading (20%)Downloading (25%)Downloading (30%)Downloading (35%)Downloading (40%)Downloading (45%)Downloading (50%)Downloading (55%)Downloading (60%)Downloading (65%)Downloading (70%)Downloading (75%)Downloading (80%)Downloading (85%)Downloading (90%)Downloading (95%)Downloading (100%)
27-Dec-2018 16:18:22   - Installing symfony/browser-kit (v3.4.15): Downloading (connecting...)Downloading (0%)           Downloading (5%)Downloading (65%)Downloading (75%)Downloading (80%)Downloading (85%)Downloading (100%)
27-Dec-2018 16:18:23   - Installing guzzlehttp/guzzle (6.3.3): Downloading (connecting...)Downloading (0%)           Downloading (5%)Downloading (15%)Downloading (20%)Downloading (30%)Downloading (35%)Downloading (45%)Downloading (50%)Downloading (55%)Downloading (60%)Downloading (70%)Downloading (75%)Downloading (85%)Downloading (90%)Downloading (95%)Downloading (100%)
27-Dec-2018 16:18:24   - Installing fabpot/goutte (v3.2.3): Downloading (connecting...)Downloading (0%)           Downloading (40%)Downloading (100%)
27-Dec-2018 16:18:24   - Installing facebook/webdriver (1.6.0): Downloading (connecting...)Downloading (0%)           Downloading (5%)Downloading (10%)Downloading (15%)Downloading (20%)Downloading (25%)Downloading (30%)Downloading (35%)Downloading (40%)Downloading (45%)Downloading (50%)Downloading (55%)Downloading (60%)Downloading (65%)Downloading (70%)Downloading (75%)Downloading (80%)Downloading (85%)Downloading (90%)Downloading (95%)Downloading (100%)
27-Dec-2018 16:18:25   - Installing symfony/yaml (v3.4.15): Downloading (connecting...)Downloading (100%)         
27-Dec-2018 16:18:26   - Installing laravel/homestead (v7.17.0): Downloading (connecting...)Downloading (100%)         
27-Dec-2018 16:18:34   - Installing phing/phing (2.4.14): Downloading (connecting...)Downloading (0%)           Downloading (5%)Downloading (10%)Downloading (15%)Downloading (20%)Downloading (25%)Downloading (30%)Downloading (35%)Downloading (40%)Downloading (45%)Downloading (50%)Downloading (55%)Downloading (60%)Downloading (65%)Downloading (70%)Downloading (75%)Downloading (80%)Downloading (85%)Downloading (90%)Downloading (95%)Downloading (100%)
27-Dec-2018 16:18:35   - Installing webmozart/assert (1.3.0): Downloading (connecting...)Downloading (0%)           Downloading (65%)Downloading (85%)Downloading (100%)
27-Dec-2018 16:18:35   - Installing phpdocumentor/reflection-common (1.0.1): Downloading (connecting...)Downloading (0%)           Downloading (100%)
27-Dec-2018 16:18:36   - Installing phpdocumentor/type-resolver (0.4.0): Downloading (connecting...)Downloading (0%)           Downloading (5%)Downloading (35%)Downloading (100%)
27-Dec-2018 16:18:37   - Installing phpdocumentor/reflection-docblock (3.3.2): Downloading (connecting...)Downloading (100%)         
27-Dec-2018 16:18:37   - Installing sebastian/version (2.0.1): Downloading (connecting...)Downloading (0%)           Downloading (100%)
27-Dec-2018 16:18:38   - Installing sebastian/resource-operations (1.0.0): Downloading (connecting...)Downloading (0%)           Downloading (65%)Downloading (100%)
27-Dec-2018 16:18:39   - Installing sebastian/recursion-context (2.0.0): Downloading (connecting...)Downloading (0%)           Downloading (100%)
27-Dec-2018 16:18:39   - Installing sebastian/object-enumerator (2.0.1): Downloading (connecting...)Downloading (0%)           Downloading (100%)
27-Dec-2018 16:18:40   - Installing sebastian/global-state (1.1.1): Downloading (connecting...)Downloading (0%)           Downloading (40%)Downloading (70%)Downloading (100%)
27-Dec-2018 16:18:41   - Installing sebastian/exporter (2.0.0): Downloading (connecting...)Downloading (0%)           Downloading (100%)
27-Dec-2018 16:18:41   - Installing sebastian/environment (2.0.0): Downloading (connecting...)Downloading (0%)           Downloading (15%)Downloading (30%)Downloading (45%)Downloading (60%)Downloading (75%)Downloading (90%)Downloading (100%)
27-Dec-2018 16:18:42   - Installing sebastian/diff (1.4.3): Downloading (connecting...)Downloading (0%)           Downloading (35%)Downloading (50%)Downloading (100%)
27-Dec-2018 16:18:42   - Installing sebastian/comparator (1.2.4): Downloading (connecting...)Downloading (0%)           Downloading (10%)Downloading (55%)Downloading (65%)Downloading (70%)Downloading (100%)
27-Dec-2018 16:18:43   - Installing phpunit/php-text-template (1.2.1): Downloading (connecting...)Downloading (0%)           Downloading (35%)Downloading (100%)
27-Dec-2018 16:18:44   - Installing doctrine/instantiator (1.0.5): Downloading (connecting...)Downloading (0%)           Downloading (15%)Downloading (30%)Downloading (45%)Downloading (50%)Downloading (65%)Downloading (80%)Downloading (95%)Downloading (100%)
27-Dec-2018 16:18:44   - Installing phpunit/phpunit-mock-objects (3.4.4): Downloading (connecting...)Downloading (0%)           Downloading (5%)Downloading (10%)Downloading (15%)Downloading (20%)Downloading (30%)Downloading (35%)Downloading (40%)Downloading (50%)Downloading (55%)Downloading (60%)Downloading (65%)Downloading (75%)Downloading (80%)Downloading (85%)Downloading (90%)Downloading (95%)Downloading (100%)
27-Dec-2018 16:18:45   - Installing phpunit/php-timer (1.0.9): Downloading (connecting...)Downloading (0%)           Downloading (45%)Downloading (90%)Downloading (100%)
27-Dec-2018 16:18:46   - Installing phpunit/php-file-iterator (1.4.5): Downloading (connecting...)Downloading (0%)           Downloading (100%)
27-Dec-2018 16:18:46   - Installing sebastian/code-unit-reverse-lookup (1.0.1): Downloading (connecting...)Downloading (0%)           Downloading (55%)Downloading (100%)
27-Dec-2018 16:18:48   - Installing phpunit/php-token-stream (1.4.12): Downloading (connecting...)Downloading (0%)           Downloading (5%)Downloading (10%)Downloading (15%)Downloading (20%)Downloading (65%)Downloading (70%)Downloading (75%)Downloading (80%)Downloading (85%)Downloading (90%)Downloading (100%)
27-Dec-2018 16:18:50   - Installing phpunit/php-code-coverage (4.0.8): Downloading (connecting...)Downloading (0%)           Downloading (5%)Downloading (10%)Downloading (15%)Downloading (20%)Downloading (25%)Downloading (30%)Downloading (35%)Downloading (40%)Downloading (45%)Downloading (50%)Downloading (55%)Downloading (60%)Downloading (65%)Downloading (70%)Downloading (75%)Downloading (80%)Downloading (85%)Downloading (90%)Downloading (95%)Downloading (100%)
27-Dec-2018 16:18:51   - Installing phpspec/prophecy (1.8.0): Downloading (connecting...)Downloading (0%)           Downloading (10%)Downloading (20%)Downloading (35%)Downloading (45%)Downloading (55%)Downloading (60%)Downloading (65%)Downloading (70%)Downloading (75%)Downloading (80%)Downloading (85%)Downloading (90%)Downloading (95%)Downloading (100%)
27-Dec-2018 16:18:52   - Installing myclabs/deep-copy (1.7.0): Downloading (connecting...)Downloading (0%)           Downloading (15%)Downloading (30%)Downloading (45%)Downloading (60%)Downloading (65%)Downloading (80%)Downloading (85%)Downloading (100%)
27-Dec-2018 16:18:55   - Installing phpunit/phpunit (5.7.27): Downloading (connecting...)Downloading (0%)           Downloading (5%)Downloading (10%)Downloading (15%)Downloading (20%)Downloading (25%)Downloading (30%)Downloading (35%)Downloading (40%)Downloading (45%)Downloading (50%)Downloading (55%)Downloading (60%)Downloading (65%)Downloading (70%)Downloading (75%)Downloading (80%)Downloading (85%)Downloading (90%)Downloading (95%)Downloading (100%)
27-Dec-2018 16:18:55   - Installing phpunit/dbunit (2.0.3): Downloading (connecting...)Downloading (100%)         
27-Dec-2018 16:18:59   - Installing squizlabs/php_codesniffer (2.9.1): Downloading (connecting...)Downloading (0%)           Downloading (5%)Downloading (10%)Downloading (15%)Downloading (20%)Downloading (25%)Downloading (30%)Downloading (35%)Downloading (40%)Downloading (45%)Downloading (50%)Downloading (55%)Downloading (60%)Downloading (65%)Downloading (70%)Downloading (75%)Downloading (80%)Downloading (85%)Downloading (90%)Downloading (95%)Downloading (100%)
27-Dec-2018 16:19:00 symfony/console suggests installing symfony/lock
27-Dec-2018 16:19:00 lusitanian/oauth suggests installing predis/predis (Allows using the Redis storage backend.)
27-Dec-2018 16:19:00 patchwork/utf8 suggests installing ext-intl (Use Intl for best performance)
27-Dec-2018 16:19:00 patchwork/utf8 suggests installing ext-wfio (Use WFIO for UTF-8 filesystem access on Windows)
27-Dec-2018 16:19:00 s9e/text-formatter suggests installing ext-intl (Allows international URLs to be accepted by the URL filter)
27-Dec-2018 16:19:00 s9e/text-formatter suggests installing ext-xsl (Enables the XSLT renderer)
27-Dec-2018 16:19:00 paragonie/random_compat suggests installing ext-libsodium (Provides a modern crypto API that can be used to generate random bytes.)
27-Dec-2018 16:19:00 symfony/http-kernel suggests installing symfony/var-dumper
27-Dec-2018 16:19:00 symfony/dependency-injection suggests installing symfony/expression-language (For using expressions in service container configuration)
27-Dec-2018 16:19:00 zendframework/zend-eventmanager suggests installing container-interop/container-interop (^1.1.0, to use the lazy listeners feature)
27-Dec-2018 16:19:00 zendframework/zend-eventmanager suggests installing zendframework/zend-stdlib (^2.7.3 || ^3.0, to use the FilterChain feature)
27-Dec-2018 16:19:00 zendframework/zend-code suggests installing doctrine/annotations (Doctrine\Common\Annotations >=1.0 for annotation features)
27-Dec-2018 16:19:00 zendframework/zend-code suggests installing zendframework/zend-stdlib (Zend\Stdlib component)
27-Dec-2018 16:19:00 ocramius/proxy-manager suggests installing ocramius/generated-hydrator (To have very fast object to array to object conversion for ghost objects)
27-Dec-2018 16:19:00 ocramius/proxy-manager suggests installing zendframework/zend-json (To have the JsonRpc adapter (Remote Object feature))
27-Dec-2018 16:19:00 ocramius/proxy-manager suggests installing zendframework/zend-soap (To have the Soap adapter (Remote Object feature))
27-Dec-2018 16:19:00 ocramius/proxy-manager suggests installing zendframework/zend-stdlib (To use the hydrator proxy)
27-Dec-2018 16:19:00 ocramius/proxy-manager suggests installing zendframework/zend-xmlrpc (To have the XmlRpc adapter (Remote Object feature))
27-Dec-2018 16:19:00 symfony/routing suggests installing doctrine/annotations (For using the annotation loader)
27-Dec-2018 16:19:00 symfony/routing suggests installing symfony/expression-language (For using expression matching)
27-Dec-2018 16:19:00 symfony/twig-bridge suggests installing symfony/asset (For using the AssetExtension)
27-Dec-2018 16:19:00 symfony/twig-bridge suggests installing symfony/expression-language (For using the ExpressionExtension)
27-Dec-2018 16:19:00 symfony/twig-bridge suggests installing symfony/form (For using the FormExtension)
27-Dec-2018 16:19:00 symfony/twig-bridge suggests installing symfony/security (For using the SecurityExtension)
27-Dec-2018 16:19:00 symfony/twig-bridge suggests installing symfony/stopwatch (For using the StopwatchExtension)
27-Dec-2018 16:19:00 symfony/twig-bridge suggests installing symfony/templating (For using the TwigEngine)
27-Dec-2018 16:19:00 symfony/twig-bridge suggests installing symfony/translation (For using the TranslationExtension)
27-Dec-2018 16:19:00 symfony/twig-bridge suggests installing symfony/var-dumper (For using the DumpExtension)
27-Dec-2018 16:19:00 symfony/twig-bridge suggests installing symfony/web-link (For using the WebLinkExtension)
27-Dec-2018 16:19:00 facebook/webdriver suggests installing ext-SimpleXML (For Firefox profile creation)
27-Dec-2018 16:19:00 sebastian/global-state suggests installing ext-uopz (*)
27-Dec-2018 16:19:00 phpunit/phpunit-mock-objects suggests installing ext-soap (*)
27-Dec-2018 16:19:00 phpunit/phpunit suggests installing phpunit/php-invoker (~1.1)
27-Dec-2018 16:19:00 Generating autoload files
27-Dec-2018 16:19:01 Buildfile: /data/build/build.xml
27-Dec-2018 16:19:01
27-Dec-2018 16:19:01 phpBB > clean:
27-Dec-2018 16:19:01
27-Dec-2018 16:19:01    [delete] Directory /data/build/logs does not exist or is not a directory.
27-Dec-2018 16:19:01    [delete] Directory /data/build/api does not exist or is not a directory.
27-Dec-2018 16:19:01    [delete] Directory /data/build/codebrowser does not exist or is not a directory.
27-Dec-2018 16:19:01    [delete] Directory /data/build/coverage does not exist or is not a directory.
27-Dec-2018 16:19:01    [delete] Directory /data/build/cpd does not exist or is not a directory.
27-Dec-2018 16:19:01    [delete] Directory /data/build/dependencies does not exist or is not a directory.
27-Dec-2018 16:19:01    [delete] Directory /data/build/new_version does not exist or is not a directory.
27-Dec-2018 16:19:01    [delete] Directory /data/build/old_versions does not exist or is not a directory.
27-Dec-2018 16:19:01    [delete] Directory /data/build/save does not exist or is not a directory.
27-Dec-2018 16:19:01
27-Dec-2018 16:19:01 phpBB > prepare:
27-Dec-2018 16:19:01
27-Dec-2018 16:19:01     [mkdir] Created dir: /data/build/logs
27-Dec-2018 16:19:01     [mkdir] Created dir: /data/build/api
27-Dec-2018 16:19:01     [mkdir] Created dir: /data/build/codebrowser
27-Dec-2018 16:19:01     [mkdir] Created dir: /data/build/coverage
27-Dec-2018 16:19:01     [mkdir] Created dir: /data/build/cpd
27-Dec-2018 16:19:01     [mkdir] Created dir: /data/build/dependencies
27-Dec-2018 16:19:01     [mkdir] Created dir: /data/build/new_version
27-Dec-2018 16:19:01     [mkdir] Created dir: /data/build/new_version/files
27-Dec-2018 16:19:01     [mkdir] Created dir: /data/build/new_version/patches
27-Dec-2018 16:19:01     [mkdir] Created dir: /data/build/new_version/release_files
27-Dec-2018 16:19:01     [mkdir] Created dir: /data/build/new_version/update
27-Dec-2018 16:19:01     [mkdir] Created dir: /data/build/old_versions
27-Dec-2018 16:19:01     [mkdir] Created dir: /data/build/save
27-Dec-2018 16:19:01
27-Dec-2018 16:19:01 BUILD FINISHED
27-Dec-2018 16:19:01
27-Dec-2018 16:19:01 Total time: 0.1162 seconds
27-Dec-2018 16:19:01
27-Dec-2018 16:19:01 Finished task 'Prepare directory' with result: Success
27-Dec-2018 16:19:01 Skipping execution of task 'Run sniffs' as it is disabled
27-Dec-2018 16:19:01
Substituting variable: ${bamboo.working.directory} with /home/bamboo/xml-data/build-dir/PHPBB3-PR-JOB1
27-Dec-2018 16:19:01 Starting task 'Run sniffs' of type 'com.atlassian.bamboo.plugins.bamboo-docker-plugin:task.docker.cli'
27-Dec-2018 16:19:01 Running image name (phpbb:php-5.6)
27-Dec-2018 16:19:01
Beginning to execute external process for build 'phpBB3 - Pull Requests - Build and Test Job #9079 (PHPBB3-PR-JOB1-9079)'
... running command line:
/usr/bin/docker run --volume /home/bamboo/xml-data/build-dir/PHPBB3-PR-JOB1:/data --workdir /data/build --rm -u=991 phpbb:php-5.6 ../phpBB/vendor/bin/phing sniff
... in: /home/bamboo/xml-data/build-dir/PHPBB3-PR-JOB1
... using extra environment variables:
bamboo_planRepository_1_branch=3.1.x
bamboo_planRepository_1_branchDisplayName=3.1.x
bamboo_repository_revision_number=dc8ff9da28b8ab4ad11c7ea94cca526f17c87fe5
bamboo_PRref=master
bamboo_resultsUrl=https://bamboo.phpbb.com/browse/PHPBB3-PR-JOB1-9079
bamboo_capability_system_builder_command_Git=/usr/bin/git
bamboo_repository_75956235_git_username=bantu
bamboo_build_working_directory=/home/bamboo/xml-data/build-dir/PHPBB3-PR-JOB1
bamboo_planRepository_1_name=phpBB Ascraeus
bamboo_buildKey=PHPBB3-PR-JOB1
bamboo_capability_phpbb_tests=true
bamboo_shortPlanName=Pull Requests
bamboo_capability_system_builder_command_fop=/usr/bin/fop
bamboo_capability_dbms_sqlite_2=true
bamboo_planRepository_name=phpBB Ascraeus
bamboo_PRnumber=5351
bamboo_buildNumber=9079
bamboo_repository_75956235_git_repositoryUrl=https://github.com/phpbb/phpbb.git
bamboo_capability_system_builder_phpunit_PHPUnit=/usr/bin/phpunit
bamboo_shortJobName=Build and Test Job
bamboo_buildResultsUrl=https://bamboo.phpbb.com/browse/PHPBB3-PR-JOB1-9079
bamboo_repository_75956235_branch_name=3.1.x
bamboo_planRepository_repositoryUrl=https://github.com/phpbb/phpbb.git
bamboo_agentId=131073
bamboo_planName=phpBB3 - Pull Requests
bamboo_build_commandline_com_atlassian_bamboo_plugins_scripttask_task_builder_script_7=/bin/sh /home/bamboo/temp/PHPBB3-PR-JOB1-9079-ScriptBuildTask-2625833215922279257.sh
bamboo_shortPlanKey=PR
bamboo_shortJobKey=JOB1
bamboo_capability_dbms_mysql_55=true
bamboo_capability_system_jdk_JDK_1_7_0_65=/usr/lib/jvm/java-7-openjdk-amd64
bamboo_planRepository_revision=dc8ff9da28b8ab4ad11c7ea94cca526f17c87fe5
bamboo_buildTimeStamp=2018-12-27T16:17:37.706Z
bamboo_repository_previous_revision_number=dc8ff9da28b8ab4ad11c7ea94cca526f17c87fe5
bamboo_capability_system_jdk_JDK_1_6_0_16=/usr/lib/jvm/java-6-sun-1.6.0.16
bamboo_capability_system_builder_mvn2_Maven_2=/usr/share/maven2
bamboo_planRepository_previousRevision=dc8ff9da28b8ab4ad11c7ea94cca526f17c87fe5
bamboo_build_commandline_com_atlassian_bamboo_plugins_scripttask_task_builder_script_4=/bin/sh /home/bamboo/temp/PHPBB3-PR-JOB1-9079-ScriptBuildTask-4780594757988344146.sh
bamboo_repository_git_branch=3.1.x
bamboo_buildResultKey=PHPBB3-PR-JOB1-9079
bamboo_repository_branch_name=3.1.x
bamboo_buildPlanName=phpBB3 - Pull Requests - Build and Test Job
bamboo_planRepository_1_revision=dc8ff9da28b8ab4ad11c7ea94cca526f17c87fe5
bamboo_repository_name=phpBB Ascraeus
bamboo_buildFailed=false
bamboo_capability_system_docker_executable=/usr/bin/docker
bamboo_build_commandline_com_atlassian_bamboo_plugins_bamboo_docker_plugin_task_docker_cli_12=/usr/bin/docker run --volume /home/bamboo/xml-data/build-dir/PHPBB3-PR-JOB1:/data --workdir /data/phpBB --rm -e HOME=/home/bamboo -u=991 phpbb:php-5.6 /bin/bash -c php ../composer.phar install --dev; cd ../build; ../phpBB/vendor/bin/phing clean prepare
bamboo_planRepository_branch=3.1.x
bamboo_agentWorkingDirectory=/home/bamboo/xml-data/build-dir
bamboo_capability_system_git_executable=/usr/bin/git
bamboo_capability_system_builder_phpunit_PHPUnit_3_4=/usr/bin/phpunit
bamboo_repository_git_username=bantu
bamboo_planRepository_1_previousRevision=dc8ff9da28b8ab4ad11c7ea94cca526f17c87fe5
bamboo_repository_75956235_revision_number=dc8ff9da28b8ab4ad11c7ea94cca526f17c87fe5
bamboo_planRepository_branchDisplayName=3.1.x
bamboo_planRepository_1_type=gitv2
bamboo_planRepository_branchName=3.1.x
bamboo_repository_75956235_previous_revision_number=dc8ff9da28b8ab4ad11c7ea94cca526f17c87fe5
bamboo_capability_system_jdk_JDK=/usr/lib/jvm/java-6-sun
bamboo_plan_storageTag=PHPBB3-PR
bamboo_hg_cache_directory=/home/bamboo/xml-data/build-dir/_hg-repositories-cache
bamboo_planRepository_1_username=bantu
bamboo_planRepository_type=gitv2
bamboo_git_cache_directory=/home/bamboo/xml-data/build-dir/_git-repositories-cache
bamboo_ManualBuildTriggerReason_userName=Build Robot
bamboo_repository_git_repositoryUrl=https://github.com/phpbb/phpbb.git
bamboo_repository_75956235_git_branch=3.1.x
bamboo_capability_system_builder_ant_Ant=/usr/share/ant
bamboo_repository_75956235_name=phpBB Ascraeus
bamboo_tmp_directory=/home/bamboo/temp
bamboo_working_directory=/home/bamboo/xml-data/build-dir/PHPBB3-PR-JOB1
bamboo_planKey=PHPBB3-PR
bamboo_capability_local=true
bamboo_planRepository_1_repositoryUrl=https://github.com/phpbb/phpbb.git
bamboo_planRepository_username=bantu
bamboo_capability_system_jdk_JDK_1_6=/usr/lib/jvm/java-6-sun
bamboo_capability_system_jdk_JDK_1_7=/usr/lib/jvm/java-7-openjdk-amd64
bamboo_planRepository_1_branchName=3.1.x
27-Dec-2018 16:19:01 Buildfile: /data/build/build.xml
27-Dec-2018 16:19:02
27-Dec-2018 16:19:02 phpBB > sniff:
27-Dec-2018 16:19:02
27-Dec-2018 16:19:09 ............................................................  60 / 769 (8%)
27-Dec-2018 16:19:10 ............................................................ 120 / 769 (16%)
27-Dec-2018 16:19:11 ............................................................ 180 / 769 (23%)
27-Dec-2018 16:19:12 ............................................................ 240 / 769 (31%)
27-Dec-2018 16:19:14 ............................................................ 300 / 769 (39%)
27-Dec-2018 16:19:20 ............................................................ 360 / 769 (47%)
27-Dec-2018 16:19:24 ............................................................ 420 / 769 (55%)
27-Dec-2018 16:19:29 ............................................................ 480 / 769 (62%)
27-Dec-2018 16:19:33 ............................................................ 540 / 769 (70%)
27-Dec-2018 16:19:37 ............................................................ 600 / 769 (78%)
27-Dec-2018 16:19:42 ...........................................................E 660 / 769 (86%)
27-Dec-2018 16:19:46 EE.......................................................... 720 / 769 (94%)
27-Dec-2018 16:19:48 .................................................
27-Dec-2018 16:19:48
27-Dec-2018 16:19:48
27-Dec-2018 16:19:48 FILE: /data/phpBB/phpbb/privatemessage/compose.php
27-Dec-2018 16:19:48 ----------------------------------------------------------------------
27-Dec-2018 16:19:48 FOUND 41 ERRORS AFFECTING 41 LINES
27-Dec-2018 16:19:48 ----------------------------------------------------------------------
27-Dec-2018 16:19:48   121 | ERROR | [x] Functions must not contain multiple empty lines in a
27-Dec-2018 16:19:48       |       |     row; found 8 empty lines
27-Dec-2018 16:19:48       |       |     (Squiz.WhiteSpace.SuperfluousWhitespace.EmptyLines)
27-Dec-2018 16:19:48   212 | ERROR | [x] Whitespace found at end of line
27-Dec-2018 16:19:48       |       |     (Squiz.WhiteSpace.SuperfluousWhitespace.EndLine)
27-Dec-2018 16:19:48   736 | ERROR | [x] Whitespace found at end of line
27-Dec-2018 16:19:48       |       |     (Squiz.WhiteSpace.SuperfluousWhitespace.EndLine)
27-Dec-2018 16:19:48 1191 | ERROR | [x] Whitespace found at end of line
27-Dec-2018 16:19:48       |       |     (Squiz.WhiteSpace.SuperfluousWhitespace.EndLine)
27-Dec-2018 16:19:48 1301 | ERROR | [x] Whitespace found at end of line
27-Dec-2018 16:19:48       |       |     (Squiz.WhiteSpace.SuperfluousWhitespace.EndLine)
27-Dec-2018 16:19:48 1306 | ERROR | [x] Whitespace found at end of line
27-Dec-2018 16:19:48       |       |     (Squiz.WhiteSpace.SuperfluousWhitespace.EndLine)
27-Dec-2018 16:19:48 1312 | ERROR | [x] Whitespace found at end of line
27-Dec-2018 16:19:48       |       |     (Squiz.WhiteSpace.SuperfluousWhitespace.EndLine)
27-Dec-2018 16:19:48 1325 | ERROR | [x] Whitespace found at end of line
27-Dec-2018 16:19:48       |       |     (Squiz.WhiteSpace.SuperfluousWhitespace.EndLine)
27-Dec-2018 16:19:48 1354 | ERROR | [x] Whitespace found at end of line
27-Dec-2018 16:19:48       |       |     (Squiz.WhiteSpace.SuperfluousWhitespace.EndLine)
27-Dec-2018 16:19:48 1360 | ERROR | [x] Whitespace found at end of line
27-Dec-2018 16:19:48       |       |     (Squiz.WhiteSpace.SuperfluousWhitespace.EndLine)
27-Dec-2018 16:19:48 1365 | ERROR | [x] Whitespace found at end of line
27-Dec-2018 16:19:48       |       |     (Squiz.WhiteSpace.SuperfluousWhitespace.EndLine)
27-Dec-2018 16:19:48 1371 | ERROR | [x] Whitespace found at end of line
27-Dec-2018 16:19:48       |       |     (Squiz.WhiteSpace.SuperfluousWhitespace.EndLine)
27-Dec-2018 16:19:48 1374 | ERROR | [x] Whitespace found at end of line
27-Dec-2018 16:19:48       |       |     (Squiz.WhiteSpace.SuperfluousWhitespace.EndLine)
27-Dec-2018 16:19:48 1378 | ERROR | [x] Whitespace found at end of line
27-Dec-2018 16:19:48       |       |     (Squiz.WhiteSpace.SuperfluousWhitespace.EndLine)
27-Dec-2018 16:19:48 1384 | ERROR | [x] Whitespace found at end of line
27-Dec-2018 16:19:48       |       |     (Squiz.WhiteSpace.SuperfluousWhitespace.EndLine)
27-Dec-2018 16:19:48 1389 | ERROR | [x] Whitespace found at end of line
27-Dec-2018 16:19:48       |       |     (Squiz.WhiteSpace.SuperfluousWhitespace.EndLine)
27-Dec-2018 16:19:48 1392 | ERROR | [x] Whitespace found at end of line
27-Dec-2018 16:19:48       |       |     (Squiz.WhiteSpace.SuperfluousWhitespace.EndLine)
27-Dec-2018 16:19:48 1399 | ERROR | [x] Whitespace found at end of line
27-Dec-2018 16:19:48       |       |     (Squiz.WhiteSpace.SuperfluousWhitespace.EndLine)
27-Dec-2018 16:19:48 1404 | ERROR | [x] Whitespace found at end of line
27-Dec-2018 16:19:48       |       |     (Squiz.WhiteSpace.SuperfluousWhitespace.EndLine)
27-Dec-2018 16:19:48 1412 | ERROR | [x] Whitespace found at end of line
27-Dec-2018 16:19:48       |       |     (Squiz.WhiteSpace.SuperfluousWhitespace.EndLine)
27-Dec-2018 16:19:48 1415 | ERROR | [x] Whitespace found at end of line
27-Dec-2018 16:19:48       |       |     (Squiz.WhiteSpace.SuperfluousWhitespace.EndLine)
27-Dec-2018 16:19:48 1426 | ERROR | [x] Whitespace found at end of line
27-Dec-2018 16:19:48       |       |     (Squiz.WhiteSpace.SuperfluousWhitespace.EndLine)
27-Dec-2018 16:19:48 1433 | ERROR | [x] Whitespace found at end of line
27-Dec-2018 16:19:48       |       |     (Squiz.WhiteSpace.SuperfluousWhitespace.EndLine)
27-Dec-2018 16:19:48 1437 | ERROR | [x] Whitespace found at end of line
27-Dec-2018 16:19:48       |       |     (Squiz.WhiteSpace.SuperfluousWhitespace.EndLine)
27-Dec-2018 16:19:48 1444 | ERROR | [x] Whitespace found at end of line
27-Dec-2018 16:19:48       |       |     (Squiz.WhiteSpace.SuperfluousWhitespace.EndLine)
27-Dec-2018 16:19:48 1448 | ERROR | [x] Whitespace found at end of line
27-Dec-2018 16:19:48       |       |     (Squiz.WhiteSpace.SuperfluousWhitespace.EndLine)
27-Dec-2018 16:19:48 1453 | ERROR | [x] Whitespace found at end of line
27-Dec-2018 16:19:48       |       |     (Squiz.WhiteSpace.SuperfluousWhitespace.EndLine)
27-Dec-2018 16:19:48 1466 | ERROR | [x] Whitespace found at end of line
27-Dec-2018 16:19:48       |       |     (Squiz.WhiteSpace.SuperfluousWhitespace.EndLine)
27-Dec-2018 16:19:48 1468 | ERROR | [x] Whitespace found at end of line
27-Dec-2018 16:19:48       |       |     (Squiz.WhiteSpace.SuperfluousWhitespace.EndLine)
27-Dec-2018 16:19:48 1480 | ERROR | [x] Whitespace found at end of line
27-Dec-2018 16:19:48       |       |     (Squiz.WhiteSpace.SuperfluousWhitespace.EndLine)
27-Dec-2018 16:19:48 1484 | ERROR | [x] Whitespace found at end of line
27-Dec-2018 16:19:48       |       |     (Squiz.WhiteSpace.SuperfluousWhitespace.EndLine)
27-Dec-2018 16:19:48 1490 | ERROR | [x] Whitespace found at end of line
27-Dec-2018 16:19:48       |       |     (Squiz.WhiteSpace.SuperfluousWhitespace.EndLine)
27-Dec-2018 16:19:48 1496 | ERROR | [x] Whitespace found at end of line
27-Dec-2018 16:19:48       |       |     (Squiz.WhiteSpace.SuperfluousWhitespace.EndLine)
27-Dec-2018 16:19:48 1501 | ERROR | [x] Whitespace found at end of line
27-Dec-2018 16:19:48       |       |     (Squiz.WhiteSpace.SuperfluousWhitespace.EndLine)
27-Dec-2018 16:19:48 1512 | ERROR | [x] Whitespace found at end of line
27-Dec-2018 16:19:48       |       |     (Squiz.WhiteSpace.SuperfluousWhitespace.EndLine)
27-Dec-2018 16:19:48 1515 | ERROR | [x] Whitespace found at end of line
27-Dec-2018 16:19:48       |       |     (Squiz.WhiteSpace.SuperfluousWhitespace.EndLine)
27-Dec-2018 16:19:48 1529 | ERROR | [x] Whitespace found at end of line
27-Dec-2018 16:19:48       |       |     (Squiz.WhiteSpace.SuperfluousWhitespace.EndLine)
27-Dec-2018 16:19:48 1538 | ERROR | [x] Whitespace found at end of line
27-Dec-2018 16:19:48       |       |     (Squiz.WhiteSpace.SuperfluousWhitespace.EndLine)
27-Dec-2018 16:19:48 1543 | ERROR | [x] Whitespace found at end of line
27-Dec-2018 16:19:48       |       |     (Squiz.WhiteSpace.SuperfluousWhitespace.EndLine)
27-Dec-2018 16:19:48 1550 | ERROR | [x] Whitespace found at end of line
27-Dec-2018 16:19:48       |       |     (Squiz.WhiteSpace.SuperfluousWhitespace.EndLine)
27-Dec-2018 16:19:48 1564 | ERROR | [x] Whitespace found at end of line
27-Dec-2018 16:19:48       |       |     (Squiz.WhiteSpace.SuperfluousWhitespace.EndLine)
27-Dec-2018 16:19:48 ----------------------------------------------------------------------
27-Dec-2018 16:19:48 PHPCBF CAN FIX THE 41 MARKED SNIFF VIOLATIONS AUTOMATICALLY
27-Dec-2018 16:19:48 ----------------------------------------------------------------------
27-Dec-2018 16:19:48
27-Dec-2018 16:19:48
27-Dec-2018 16:19:48 FILE: /data/phpBB/phpbb/privatemessage/view.php
27-Dec-2018 16:19:48 ----------------------------------------------------------------------
27-Dec-2018 16:19:48 FOUND 3 ERRORS AFFECTING 3 LINES
27-Dec-2018 16:19:48 ----------------------------------------------------------------------
27-Dec-2018 16:19:48 103 | ERROR | [x] Expected 1 space between type hint and argument
27-Dec-2018 16:19:48      |       |     "$group_helper"; 2 found
27-Dec-2018 16:19:48      |       |     (Squiz.Functions.FunctionDeclarationArgumentSpacing.SpacingAfterHint)
27-Dec-2018 16:19:48 269 | ERROR | [x] Whitespace found at end of line
27-Dec-2018 16:19:48      |       |     (Squiz.WhiteSpace.SuperfluousWhitespace.EndLine)
27-Dec-2018 16:19:48 372 | ERROR | [x] Whitespace found at end of line
27-Dec-2018 16:19:48      |       |     (Squiz.WhiteSpace.SuperfluousWhitespace.EndLine)
27-Dec-2018 16:19:48 ----------------------------------------------------------------------
27-Dec-2018 16:19:48 PHPCBF CAN FIX THE 3 MARKED SNIFF VIOLATIONS AUTOMATICALLY
27-Dec-2018 16:19:48 ----------------------------------------------------------------------
27-Dec-2018 16:19:48
27-Dec-2018 16:19:48
27-Dec-2018 16:19:48 FILE: /data/phpBB/phpbb/privatemessage/helper.php
27-Dec-2018 16:19:48 ----------------------------------------------------------------------
27-Dec-2018 16:19:48 FOUND 4 ERRORS AFFECTING 4 LINES
27-Dec-2018 16:19:48 ----------------------------------------------------------------------
27-Dec-2018 16:19:48 21 | ERROR | [x] Whitespace found at end of line
27-Dec-2018 16:19:48     |       |     (Squiz.WhiteSpace.SuperfluousWhitespace.EndLine)
27-Dec-2018 16:19:48 26 | ERROR | [x] Whitespace found at end of line
27-Dec-2018 16:19:48     |       |     (Squiz.WhiteSpace.SuperfluousWhitespace.EndLine)
27-Dec-2018 16:19:48 32 | ERROR | [x] Whitespace found at end of line
27-Dec-2018 16:19:48     |       |     (Squiz.WhiteSpace.SuperfluousWhitespace.EndLine)
27-Dec-2018 16:19:48 45 | ERROR | [x] Whitespace found at end of line
27-Dec-2018 16:19:48     |       |     (Squiz.WhiteSpace.SuperfluousWhitespace.EndLine)
27-Dec-2018 16:19:48 ----------------------------------------------------------------------
27-Dec-2018 16:19:48 PHPCBF CAN FIX THE 4 MARKED SNIFF VIOLATIONS AUTOMATICALLY
27-Dec-2018 16:19:48 ----------------------------------------------------------------------
27-Dec-2018 16:19:48
27-Dec-2018 16:19:48 Time: 46.38 secs; Memory: 64Mb
27-Dec-2018 16:19:48
27-Dec-2018 16:19:56 ............................................................  60 / 208 (29%)
27-Dec-2018 16:20:15 ........E................................................... 120 / 208 (58%)
27-Dec-2018 16:20:29 ............................................................ 180 / 208 (87%)
27-Dec-2018 16:20:36 .................E..........
27-Dec-2018 16:20:36
27-Dec-2018 16:20:36
27-Dec-2018 16:20:36 FILE: /data/phpBB/includes/functions_privmsgs.php
27-Dec-2018 16:20:36 ----------------------------------------------------------------------
27-Dec-2018 16:20:36 FOUND 2 ERRORS AFFECTING 1 LINE
27-Dec-2018 16:20:36 ----------------------------------------------------------------------
27-Dec-2018 16:20:36 1624 | ERROR | [x] Expected 1 space between comma and argument
27-Dec-2018 16:20:36       |       |     "$sql_limit"; 0 found
27-Dec-2018 16:20:36       |       |     (Squiz.Functions.FunctionDeclarationArgumentSpacing.NoSpaceBeforeArg)
27-Dec-2018 16:20:36 1624 | ERROR | [x] Expected 1 space between comma and argument
27-Dec-2018 16:20:36       |       |     "$sql_start"; 0 found
27-Dec-2018 16:20:36       |       |     (Squiz.Functions.FunctionDeclarationArgumentSpacing.NoSpaceBeforeArg)
27-Dec-2018 16:20:36 ----------------------------------------------------------------------
27-Dec-2018 16:20:36 PHPCBF CAN FIX THE 2 MARKED SNIFF VIOLATIONS AUTOMATICALLY
27-Dec-2018 16:20:36 ----------------------------------------------------------------------
27-Dec-2018 16:20:36
27-Dec-2018 16:20:36
27-Dec-2018 16:20:36 FILE: /data/phpBB/includes/ucp/ucp_pm.php
27-Dec-2018 16:20:36 ----------------------------------------------------------------------
27-Dec-2018 16:20:36 FOUND 1 ERROR AFFECTING 1 LINE
27-Dec-2018 16:20:36 ----------------------------------------------------------------------
27-Dec-2018 16:20:36 52 | ERROR | [x] Functions must not contain multiple empty lines in a
27-Dec-2018 16:20:36     |       |     row; found 11 empty lines
27-Dec-2018 16:20:36     |       |     (Squiz.WhiteSpace.SuperfluousWhitespace.EmptyLines)
27-Dec-2018 16:20:36 ----------------------------------------------------------------------
27-Dec-2018 16:20:36 PHPCBF CAN FIX THE 1 MARKED SNIFF VIOLATIONS AUTOMATICALLY
27-Dec-2018 16:20:36 ----------------------------------------------------------------------
27-Dec-2018 16:20:36
27-Dec-2018 16:20:36 Time: 48.25 secs; Memory: 61Mb
27-Dec-2018 16:20:36
27-Dec-2018 16:20:36
27-Dec-2018 16:20:36
27-Dec-2018 16:20:36 Time: 21ms; Memory: 3.75Mb
27-Dec-2018 16:20:36
27-Dec-2018 16:20:36        [if] Error in IfTask
27-Dec-2018 16:20:36 Execution of target "sniff" failed for the following reason: /data/build/build.xml:109:6: /data/build/build.xml:115:9: PHP Code Sniffer failed.
27-Dec-2018 16:20:36
27-Dec-2018 16:20:36 BUILD FAILED
27-Dec-2018 16:20:36 /data/build/build.xml:109:6: /data/build/build.xml:115:9: PHP Code Sniffer failed.
27-Dec-2018 16:20:36 Total time: 2 minutes  35.00 seconds
27-Dec-2018 16:20:36
27-Dec-2018 16:20:37 Error occurred while running Task 'Run sniffs(11)' of type com.atlassian.bamboo.plugins.bamboo-docker-plugin:task.docker.cli.
27-Dec-2018 16:20:37 com.atlassian.bamboo.task.TaskException: Failed to execute task
27-Dec-2018 16:20:37         at com.atlassian.bamboo.plugins.docker.service.RunService.execute(RunService.java:75)
27-Dec-2018 16:20:37         at com.atlassian.bamboo.plugins.docker.tasks.cli.DockerCliTask.execute(DockerCliTask.java:70)
27-Dec-2018 16:20:37         at com.atlassian.bamboo.task.TaskExecutorImpl.lambda$executeTasks$3(TaskExecutorImpl.java:285)
27-Dec-2018 16:20:37         at com.atlassian.bamboo.task.TaskExecutorImpl.executeTaskWithPrePostActions(TaskExecutorImpl.java:224)
27-Dec-2018 16:20:37         at com.atlassian.bamboo.task.TaskExecutorImpl.executeTasks(TaskExecutorImpl.java:285)
27-Dec-2018 16:20:37         at com.atlassian.bamboo.task.TaskExecutorImpl.execute(TaskExecutorImpl.java:112)
27-Dec-2018 16:20:37         at com.atlassian.bamboo.build.pipeline.tasks.ExecuteBuildTask.call(ExecuteBuildTask.java:71)
27-Dec-2018 16:20:37         at com.atlassian.bamboo.v2.build.agent.DefaultBuildAgent.executeBuildPhase(DefaultBuildAgent.java:203)
27-Dec-2018 16:20:37         at com.atlassian.bamboo.v2.build.agent.DefaultBuildAgent.build(DefaultBuildAgent.java:175)
27-Dec-2018 16:20:37         at com.atlassian.bamboo.v2.build.agent.BuildAgentControllerImpl.lambda$waitAndPerformBuild$0(BuildAgentControllerImpl.java:122)
27-Dec-2018 16:20:37         at com.atlassian.bamboo.variable.CustomVariableContextImpl.withVariableSubstitutor(CustomVariableContextImpl.java:185)
27-Dec-2018 16:20:37         at com.atlassian.bamboo.v2.build.agent.BuildAgentControllerImpl.waitAndPerformBuild(BuildAgentControllerImpl.java:117)
27-Dec-2018 16:20:37         at com.atlassian.bamboo.v2.build.agent.DefaultBuildAgent$1.run(DefaultBuildAgent.java:126)
27-Dec-2018 16:20:37         at com.atlassian.bamboo.utils.BambooRunnables$1.run(BambooRunnables.java:48)
27-Dec-2018 16:20:37         at com.atlassian.bamboo.security.ImpersonationHelper.runWith(ImpersonationHelper.java:26)
27-Dec-2018 16:20:37         at com.atlassian.bamboo.security.ImpersonationHelper.runWithSystemAuthority(ImpersonationHelper.java:17)
27-Dec-2018 16:20:37         at com.atlassian.bamboo.security.ImpersonationHelper$1.run(ImpersonationHelper.java:41)
27-Dec-2018 16:20:37         at java.lang.Thread.run(Thread.java:748)
27-Dec-2018 16:20:37 Caused by: com.atlassian.bamboo.docker.DockerException: Error running Docker run command
27-Dec-2018 16:20:37         at com.atlassian.bamboo.docker.DockerContainerServiceImpl.run(DockerContainerServiceImpl.java:118)
27-Dec-2018 16:20:37         at sun.reflect.GeneratedMethodAccessor2070.invoke(Unknown Source)
27-Dec-2018 16:20:37         at sun.reflect.DelegatingMethodAccessorImpl.invoke(DelegatingMethodAccessorImpl.java:43)
27-Dec-2018 16:20:37         at java.lang.reflect.Method.invoke(Method.java:498)
27-Dec-2018 16:20:37         at com.atlassian.plugin.util.ContextClassLoaderSettingInvocationHandler.invoke(ContextClassLoaderSettingInvocationHandler.java:26)
27-Dec-2018 16:20:37         at com.sun.proxy.$Proxy401.run(Unknown Source)
27-Dec-2018 16:20:37         at sun.reflect.GeneratedMethodAccessor2070.invoke(Unknown Source)
27-Dec-2018 16:20:37         at sun.reflect.DelegatingMethodAccessorImpl.invoke(DelegatingMethodAccessorImpl.java:43)
27-Dec-2018 16:20:37         at java.lang.reflect.Method.invoke(Method.java:498)
27-Dec-2018 16:20:37         at org.springframework.aop.support.AopUtils.invokeJoinpointUsingReflection(AopUtils.java:302)
27-Dec-2018 16:20:37         at org.eclipse.gemini.blueprint.service.importer.support.internal.aop.ServiceInvoker.doInvoke(ServiceInvoker.java:56)
27-Dec-2018 16:20:37         at org.eclipse.gemini.blueprint.service.importer.support.internal.aop.ServiceInvoker.invoke(ServiceInvoker.java:60)
27-Dec-2018 16:20:37         at org.springframework.aop.framework.ReflectiveMethodInvocation.proceed(ReflectiveMethodInvocation.java:179)
27-Dec-2018 16:20:37         at org.springframework.aop.support.DelegatingIntroductionInterceptor.doProceed(DelegatingIntroductionInterceptor.java:133)
27-Dec-2018 16:20:37         at org.springframework.aop.support.DelegatingIntroductionInterceptor.invoke(DelegatingIntroductionInterceptor.java:121)
27-Dec-2018 16:20:37         at org.springframework.aop.framework.ReflectiveMethodInvocation.proceed(ReflectiveMethodInvocation.java:179)
27-Dec-2018 16:20:37         at org.eclipse.gemini.blueprint.service.util.internal.aop.ServiceTCCLInterceptor.invokeUnprivileged(ServiceTCCLInterceptor.java:70)
27-Dec-2018 16:20:37         at org.eclipse.gemini.blueprint.service.util.internal.aop.ServiceTCCLInterceptor.invoke(ServiceTCCLInterceptor.java:53)
27-Dec-2018 16:20:37         at org.springframework.aop.framework.ReflectiveMethodInvocation.proceed(ReflectiveMethodInvocation.java:179)
27-Dec-2018 16:20:37         at org.eclipse.gemini.blueprint.service.importer.support.LocalBundleContextAdvice.invoke(LocalBundleContextAdvice.java:57)
27-Dec-2018 16:20:37         at org.springframework.aop.framework.ReflectiveMethodInvocation.proceed(ReflectiveMethodInvocation.java:179)
27-Dec-2018 16:20:37         at org.springframework.aop.support.DelegatingIntroductionInterceptor.doProceed(DelegatingIntroductionInterceptor.java:133)
27-Dec-2018 16:20:37         at org.springframework.aop.support.DelegatingIntroductionInterceptor.invoke(DelegatingIntroductionInterceptor.java:121)
27-Dec-2018 16:20:37         at org.springframework.aop.framework.ReflectiveMethodInvocation.proceed(ReflectiveMethodInvocation.java:179)
27-Dec-2018 16:20:37         at org.springframework.aop.framework.JdkDynamicAopProxy.invoke(JdkDynamicAopProxy.java:207)
27-Dec-2018 16:20:37         at com.sun.proxy.$Proxy667.run(Unknown Source)
27-Dec-2018 16:20:37         at com.atlassian.bamboo.plugins.docker.client.DockerCmd.run(DockerCmd.java:51)
27-Dec-2018 16:20:37         at com.atlassian.bamboo.plugins.docker.service.RunService.execute(RunService.java:64)
27-Dec-2018 16:20:37         ... 17 more
27-Dec-2018 16:20:37 Caused by: com.atlassian.utils.process.ProcessException: Error executing /usr/bin/docker run --volume /home/bamboo/xml-data/build-dir/PHPBB3-PR-JOB1:/data --workdir /data/build --rm -u=991 phpbb:php-5.6 ../phpBB/vendor/bin/phing sniff
27-Dec-2018 16:20:37         at com.atlassian.bamboo.docker.DockerContainerServiceImpl.execute(DockerContainerServiceImpl.java:252)
27-Dec-2018 16:20:37         at com.atlassian.bamboo.docker.DockerContainerServiceImpl.run(DockerContainerServiceImpl.java:106)
27-Dec-2018 16:20:37         ... 44 more
27-Dec-2018 16:20:37 Starting task 'Parsing test results produced by script' of type 'com.atlassian.bamboo.plugins.testresultparser:task.testresultparser.junit'
27-Dec-2018 16:20:37 Parsing test results under /home/bamboo/xml-data/build-dir/PHPBB3-PR-JOB1...
27-Dec-2018 16:20:37 Failing task since test cases were expected but none were found.
27-Dec-2018 16:20:37 Finished task 'Parsing test results produced by script' with result: Failed
27-Dec-2018 16:20:37
Substituting variable: ${bamboo.PRnumber} with 5351
27-Dec-2018 16:20:37
Substituting variable: ${bamboo.buildResultsUrl} with https://bamboo.phpbb.com/browse/PHPBB3-PR-JOB1-9079
27-Dec-2018 16:20:37
Substituting variable: ${bamboo.buildResultsUrl} with https://bamboo.phpbb.com/browse/PHPBB3-PR-JOB1-9079
27-Dec-2018 16:20:37 Starting task 'Set result build status' of type 'com.atlassian.bamboo.plugins.scripttask:task.builder.script'
27-Dec-2018 16:20:37
Beginning to execute external process for build 'phpBB3 - Pull Requests - Build and Test Job #9079 (PHPBB3-PR-JOB1-9079)'
... running command line:
/bin/sh /home/bamboo/temp/PHPBB3-PR-JOB1-9079-ScriptBuildTask-8964049992534385933.sh
... in: /home/bamboo/xml-data/build-dir/PHPBB3-PR-JOB1
... using extra environment variables:
bamboo_planRepository_1_branch=3.1.x
bamboo_planRepository_1_branchDisplayName=3.1.x
bamboo_repository_revision_number=dc8ff9da28b8ab4ad11c7ea94cca526f17c87fe5
bamboo_PRref=master
bamboo_resultsUrl=https://bamboo.phpbb.com/browse/PHPBB3-PR-JOB1-9079
bamboo_capability_system_builder_command_Git=/usr/bin/git
bamboo_repository_75956235_git_username=bantu
bamboo_build_working_directory=/home/bamboo/xml-data/build-dir/PHPBB3-PR-JOB1
bamboo_planRepository_1_name=phpBB Ascraeus
bamboo_buildKey=PHPBB3-PR-JOB1
bamboo_capability_phpbb_tests=true
bamboo_shortPlanName=Pull Requests
bamboo_capability_system_builder_command_fop=/usr/bin/fop
bamboo_capability_dbms_sqlite_2=true
bamboo_planRepository_name=phpBB Ascraeus
bamboo_PRnumber=5351
bamboo_buildNumber=9079
bamboo_repository_75956235_git_repositoryUrl=https://github.com/phpbb/phpbb.git
bamboo_capability_system_builder_phpunit_PHPUnit=/usr/bin/phpunit
bamboo_shortJobName=Build and Test Job
bamboo_buildResultsUrl=https://bamboo.phpbb.com/browse/PHPBB3-PR-JOB1-9079
bamboo_repository_75956235_branch_name=3.1.x
bamboo_planRepository_repositoryUrl=https://github.com/phpbb/phpbb.git
bamboo_agentId=131073
bamboo_planName=phpBB3 - Pull Requests
bamboo_build_commandline_com_atlassian_bamboo_plugins_scripttask_task_builder_script_7=/bin/sh /home/bamboo/temp/PHPBB3-PR-JOB1-9079-ScriptBuildTask-2625833215922279257.sh
bamboo_shortPlanKey=PR
bamboo_shortJobKey=JOB1
bamboo_capability_dbms_mysql_55=true
bamboo_capability_system_jdk_JDK_1_7_0_65=/usr/lib/jvm/java-7-openjdk-amd64
bamboo_planRepository_revision=dc8ff9da28b8ab4ad11c7ea94cca526f17c87fe5
bamboo_buildTimeStamp=2018-12-27T16:17:37.706Z
bamboo_repository_previous_revision_number=dc8ff9da28b8ab4ad11c7ea94cca526f17c87fe5
bamboo_capability_system_jdk_JDK_1_6_0_16=/usr/lib/jvm/java-6-sun-1.6.0.16
bamboo_capability_system_builder_mvn2_Maven_2=/usr/share/maven2
bamboo_planRepository_previousRevision=dc8ff9da28b8ab4ad11c7ea94cca526f17c87fe5
bamboo_build_commandline_com_atlassian_bamboo_plugins_scripttask_task_builder_script_4=/bin/sh /home/bamboo/temp/PHPBB3-PR-JOB1-9079-ScriptBuildTask-4780594757988344146.sh
bamboo_repository_git_branch=3.1.x
bamboo_buildResultKey=PHPBB3-PR-JOB1-9079
bamboo_repository_branch_name=3.1.x
bamboo_buildPlanName=phpBB3 - Pull Requests - Build and Test Job
bamboo_planRepository_1_revision=dc8ff9da28b8ab4ad11c7ea94cca526f17c87fe5
bamboo_repository_name=phpBB Ascraeus
bamboo_buildFailed=true
bamboo_capability_system_docker_executable=/usr/bin/docker
bamboo_build_commandline_com_atlassian_bamboo_plugins_bamboo_docker_plugin_task_docker_cli_11=/usr/bin/docker run --volume /home/bamboo/xml-data/build-dir/PHPBB3-PR-JOB1:/data --workdir /data/build --rm -u=991 phpbb:php-5.6 ../phpBB/vendor/bin/phing sniff
bamboo_build_commandline_com_atlassian_bamboo_plugins_bamboo_docker_plugin_task_docker_cli_12=/usr/bin/docker run --volume /home/bamboo/xml-data/build-dir/PHPBB3-PR-JOB1:/data --workdir /data/phpBB --rm -e HOME=/home/bamboo -u=991 phpbb:php-5.6 /bin/bash -c php ../composer.phar install --dev; cd ../build; ../phpBB/vendor/bin/phing clean prepare
bamboo_planRepository_branch=3.1.x
bamboo_agentWorkingDirectory=/home/bamboo/xml-data/build-dir
bamboo_jobFailed=true
bamboo_capability_system_git_executable=/usr/bin/git
bamboo_capability_system_builder_phpunit_PHPUnit_3_4=/usr/bin/phpunit
bamboo_repository_git_username=bantu
bamboo_planRepository_1_previousRevision=dc8ff9da28b8ab4ad11c7ea94cca526f17c87fe5
bamboo_repository_75956235_revision_number=dc8ff9da28b8ab4ad11c7ea94cca526f17c87fe5
bamboo_planRepository_branchDisplayName=3.1.x
bamboo_planRepository_1_type=gitv2
bamboo_planRepository_branchName=3.1.x
bamboo_repository_75956235_previous_revision_number=dc8ff9da28b8ab4ad11c7ea94cca526f17c87fe5
bamboo_capability_system_jdk_JDK=/usr/lib/jvm/java-6-sun
bamboo_plan_storageTag=PHPBB3-PR
bamboo_hg_cache_directory=/home/bamboo/xml-data/build-dir/_hg-repositories-cache
bamboo_planRepository_1_username=bantu
bamboo_planRepository_type=gitv2
bamboo_git_cache_directory=/home/bamboo/xml-data/build-dir/_git-repositories-cache
bamboo_ManualBuildTriggerReason_userName=Build Robot
bamboo_repository_git_repositoryUrl=https://github.com/phpbb/phpbb.git
bamboo_repository_75956235_git_branch=3.1.x
bamboo_capability_system_builder_ant_Ant=/usr/share/ant
bamboo_repository_75956235_name=phpBB Ascraeus
bamboo_tmp_directory=/home/bamboo/temp
bamboo_working_directory=/home/bamboo/xml-data/build-dir/PHPBB3-PR-JOB1
bamboo_planKey=PHPBB3-PR
bamboo_capability_local=true
bamboo_planRepository_1_repositoryUrl=https://github.com/phpbb/phpbb.git
bamboo_planRepository_username=bantu
bamboo_capability_system_jdk_JDK_1_6=/usr/lib/jvm/java-6-sun
bamboo_capability_system_jdk_JDK_1_7=/usr/lib/jvm/java-7-openjdk-amd64
bamboo_planRepository_1_branchName=3.1.x
27-Dec-2018 16:20:37 From https://github.com/phpbb/phpbb
27-Dec-2018 16:20:37 * branch            refs/pull/5351/head -> FETCH_HEAD
27-Dec-2018 16:20:37 grep: build/logs/phpunit.xml: No such file or directory
27-Dec-2018 16:20:37 grep: build/logs/phpunit.xml: No such file or directory
27-Dec-2018 16:20:37   % Total    % Received % Xferd  Average Speed   Time    Time     Time  Current
27-Dec-2018 16:20:37                                  Dload  Upload   Total   Spent    Left  Speed
27-Dec-2018 16:20:37
27-Dec-2018 16:20:37   0     0    0     0    0     0      0      0 --:--:-- --:--:-- --:--:--     0
27-Dec-2018 16:20:37 100   273  100    93  100   180    292    566 --:--:-- --:--:-- --:--:--   567
27-Dec-2018 16:20:37 Finished task 'Set result build status' with result: Success
27-Dec-2018 16:20:37 Running post build plugin 'NCover Results Collector'
27-Dec-2018 16:20:37 Running post build plugin 'Artifact Copier'
27-Dec-2018 16:20:37 Running post build plugin 'npm Cache Cleanup'
27-Dec-2018 16:20:37 Running post build plugin 'Clover Results Collector'
27-Dec-2018 16:20:37 Running post build plugin 'Docker Container Cleanup'
27-Dec-2018 16:20:38 Successfully removed working directory at '/home/bamboo/xml-data/build-dir/PHPBB3-PR-JOB1'
27-Dec-2018 16:20:38 Finalising the build...
27-Dec-2018 16:20:38 Stopping timer.
27-Dec-2018 16:20:38 Build PHPBB3-PR-JOB1-9079 completed.
27-Dec-2018 16:20:38 Running on server: post build plugin 'NCover Results Collector'
27-Dec-2018 16:20:38 Running on server: post build plugin 'Build Hanging Detection Configuration'
27-Dec-2018 16:20:38 Running on server: post build plugin 'Clover Delta Calculator'
27-Dec-2018 16:20:38 Running on server: post build plugin 'Maven Dependencies Postprocessor'
27-Dec-2018 16:20:38 All post build plugins have finished
27-Dec-2018 16:20:38 Generating build results summary...
27-Dec-2018 16:20:38 Saving build results to disk...
27-Dec-2018 16:20:38 Logging substituted variables...
27-Dec-2018 16:20:38 Indexing build results...
27-Dec-2018 16:20:38 Finished building PHPBB3-PR-JOB1-9079.
27-Dec-2018 16:20:38
Substituting variable: ${bamboo.PRnumber} with 5351