Tests pending pull requests

Build: #9084 failed

Job: Build and Test Job failed

Stages & jobs

  1. Build and Test

Build log

The build generated 412 lines of output. Download or view full build log

28-Dec-2018 08:40:35 Build phpBB3 - Pull Requests - Build and Test Job #9084 (PHPBB3-PR-JOB1-9084) started building on agent Default Agent
28-Dec-2018 08:40:35
28-Dec-2018 08:40:35 Build working directory is /home/bamboo/xml-data/build-dir/PHPBB3-PR-JOB1
28-Dec-2018 08:40:35 Executing build phpBB3 - Pull Requests - Build and Test Job #9084 (PHPBB3-PR-JOB1-9084)
28-Dec-2018 08:40:35 Starting task 'Checkout develop branch' of type 'com.atlassian.bamboo.plugins.vcs:task.vcs.checkout'
28-Dec-2018 08:40:35 Build always requires a clean checkout
28-Dec-2018 08:40:35 Cleaning build directory '/home/bamboo/xml-data/build-dir/PHPBB3-PR-JOB1'
28-Dec-2018 08:40:35 Checking out into /home/bamboo/xml-data/build-dir/PHPBB3-PR-JOB1
28-Dec-2018 08:40:35 Updating source code to revision: dc8ff9da28b8ab4ad11c7ea94cca526f17c87fe5
28-Dec-2018 08:40:35 Fetching 'refs/heads/3.1.x' from 'https://github.com/phpbb/phpbb.git'.
28-Dec-2018 08:40:36 Checking out revision dc8ff9da28b8ab4ad11c7ea94cca526f17c87fe5.
28-Dec-2018 08:40:36 Creating local git repository in '/home/bamboo/xml-data/build-dir/PHPBB3-PR-JOB1/.git'.
28-Dec-2018 08:40:36 Cloning into '/home/bamboo/xml-data/build-dir/PHPBB3-PR-JOB1'...
28-Dec-2018 08:40:36 done.
28-Dec-2018 08:40:38 Switched to a new branch '3.1.x'
28-Dec-2018 08:40:38 Branch 3.1.x set up to track remote branch 3.1.x from origin.
28-Dec-2018 08:40:38 Updated source code to revision: dc8ff9da28b8ab4ad11c7ea94cca526f17c87fe5
28-Dec-2018 08:40:38 Finished task 'Checkout develop branch' with result: Success
28-Dec-2018 08:40:38 Running pre-build action: VCS Version Collector
28-Dec-2018 08:40:39
Substituting variable: ${bamboo.PRnumber} with 5351
28-Dec-2018 08:40:39
Substituting variable: ${bamboo.buildResultsUrl} with https://bamboo.phpbb.com/browse/PHPBB3-PR-JOB1-9084
28-Dec-2018 08:40:39 Starting task 'Set pending build status' of type 'com.atlassian.bamboo.plugins.scripttask:task.builder.script'
28-Dec-2018 08:40:39
Beginning to execute external process for build 'phpBB3 - Pull Requests - Build and Test Job #9084 (PHPBB3-PR-JOB1-9084)'
... running command line:
/bin/sh /home/bamboo/temp/PHPBB3-PR-JOB1-9084-ScriptBuildTask-8011772890481661190.sh
... in: /home/bamboo/xml-data/build-dir/PHPBB3-PR-JOB1
... using extra environment variables:
bamboo_planRepository_1_branch=3.1.x
bamboo_planRepository_1_branchDisplayName=3.1.x
bamboo_repository_revision_number=dc8ff9da28b8ab4ad11c7ea94cca526f17c87fe5
bamboo_PRref=master
bamboo_resultsUrl=https://bamboo.phpbb.com/browse/PHPBB3-PR-JOB1-9084
bamboo_capability_system_builder_command_Git=/usr/bin/git
bamboo_repository_75956235_git_username=bantu
bamboo_build_working_directory=/home/bamboo/xml-data/build-dir/PHPBB3-PR-JOB1
bamboo_planRepository_1_name=phpBB Ascraeus
bamboo_buildKey=PHPBB3-PR-JOB1
bamboo_capability_phpbb_tests=true
bamboo_shortPlanName=Pull Requests
bamboo_capability_system_builder_command_fop=/usr/bin/fop
bamboo_capability_dbms_sqlite_2=true
bamboo_planRepository_name=phpBB Ascraeus
bamboo_PRnumber=5351
bamboo_buildNumber=9084
bamboo_repository_75956235_git_repositoryUrl=https://github.com/phpbb/phpbb.git
bamboo_capability_system_builder_phpunit_PHPUnit=/usr/bin/phpunit
bamboo_shortJobName=Build and Test Job
bamboo_buildResultsUrl=https://bamboo.phpbb.com/browse/PHPBB3-PR-JOB1-9084
bamboo_repository_75956235_branch_name=3.1.x
bamboo_planRepository_repositoryUrl=https://github.com/phpbb/phpbb.git
bamboo_agentId=131073
bamboo_planName=phpBB3 - Pull Requests
bamboo_shortPlanKey=PR
bamboo_shortJobKey=JOB1
bamboo_capability_dbms_mysql_55=true
bamboo_capability_system_jdk_JDK_1_7_0_65=/usr/lib/jvm/java-7-openjdk-amd64
bamboo_planRepository_revision=dc8ff9da28b8ab4ad11c7ea94cca526f17c87fe5
bamboo_buildTimeStamp=2018-12-28T08:40:35.253Z
bamboo_repository_previous_revision_number=dc8ff9da28b8ab4ad11c7ea94cca526f17c87fe5
bamboo_capability_system_jdk_JDK_1_6_0_16=/usr/lib/jvm/java-6-sun-1.6.0.16
bamboo_capability_system_builder_mvn2_Maven_2=/usr/share/maven2
bamboo_planRepository_previousRevision=dc8ff9da28b8ab4ad11c7ea94cca526f17c87fe5
bamboo_repository_git_branch=3.1.x
bamboo_buildResultKey=PHPBB3-PR-JOB1-9084
bamboo_repository_branch_name=3.1.x
bamboo_buildPlanName=phpBB3 - Pull Requests - Build and Test Job
bamboo_planRepository_1_revision=dc8ff9da28b8ab4ad11c7ea94cca526f17c87fe5
bamboo_repository_name=phpBB Ascraeus
bamboo_buildFailed=false
bamboo_capability_system_docker_executable=/usr/bin/docker
bamboo_planRepository_branch=3.1.x
bamboo_agentWorkingDirectory=/home/bamboo/xml-data/build-dir
bamboo_capability_system_git_executable=/usr/bin/git
bamboo_capability_system_builder_phpunit_PHPUnit_3_4=/usr/bin/phpunit
bamboo_repository_git_username=bantu
bamboo_planRepository_1_previousRevision=dc8ff9da28b8ab4ad11c7ea94cca526f17c87fe5
bamboo_repository_75956235_revision_number=dc8ff9da28b8ab4ad11c7ea94cca526f17c87fe5
bamboo_planRepository_branchDisplayName=3.1.x
bamboo_planRepository_1_type=gitv2
bamboo_planRepository_branchName=3.1.x
bamboo_repository_75956235_previous_revision_number=dc8ff9da28b8ab4ad11c7ea94cca526f17c87fe5
bamboo_capability_system_jdk_JDK=/usr/lib/jvm/java-6-sun
bamboo_plan_storageTag=PHPBB3-PR
bamboo_hg_cache_directory=/home/bamboo/xml-data/build-dir/_hg-repositories-cache
bamboo_planRepository_1_username=bantu
bamboo_planRepository_type=gitv2
bamboo_git_cache_directory=/home/bamboo/xml-data/build-dir/_git-repositories-cache
bamboo_ManualBuildTriggerReason_userName=Build Robot
bamboo_repository_git_repositoryUrl=https://github.com/phpbb/phpbb.git
bamboo_repository_75956235_git_branch=3.1.x
bamboo_capability_system_builder_ant_Ant=/usr/share/ant
bamboo_repository_75956235_name=phpBB Ascraeus
bamboo_tmp_directory=/home/bamboo/temp
bamboo_working_directory=/home/bamboo/xml-data/build-dir/PHPBB3-PR-JOB1
bamboo_planKey=PHPBB3-PR
bamboo_capability_local=true
bamboo_planRepository_1_repositoryUrl=https://github.com/phpbb/phpbb.git
bamboo_planRepository_username=bantu
bamboo_capability_system_jdk_JDK_1_6=/usr/lib/jvm/java-6-sun
bamboo_capability_system_jdk_JDK_1_7=/usr/lib/jvm/java-7-openjdk-amd64
bamboo_planRepository_1_branchName=3.1.x
28-Dec-2018 08:40:42 From https://github.com/phpbb/phpbb
28-Dec-2018 08:40:42 * branch            refs/pull/5351/head -> FETCH_HEAD
28-Dec-2018 08:40:42   % Total    % Received % Xferd  Average Speed   Time    Time     Time  Current
28-Dec-2018 08:40:42                                  Dload  Upload   Total   Spent    Left  Speed
28-Dec-2018 08:40:42
28-Dec-2018 08:40:42   0     0    0     0    0     0      0      0 --:--:-- --:--:-- --:--:--     0
28-Dec-2018 08:40:42 100   275  100    93  100   182    321    628 --:--:-- --:--:-- --:--:--   627
28-Dec-2018 08:40:42 100   275  100    93  100   182    320    628 --:--:-- --:--:-- --:--:--   627
28-Dec-2018 08:40:42 Finished task 'Set pending build status' with result: Success
28-Dec-2018 08:40:42
Substituting variable: ${bamboo.PRnumber} with 5351
28-Dec-2018 08:40:42 Starting task 'Fetch PR' of type 'com.atlassian.bamboo.plugins.scripttask:task.builder.script'
28-Dec-2018 08:40:42
Beginning to execute external process for build 'phpBB3 - Pull Requests - Build and Test Job #9084 (PHPBB3-PR-JOB1-9084)'
... running command line:
/bin/sh /home/bamboo/temp/PHPBB3-PR-JOB1-9084-ScriptBuildTask-6548244205878743175.sh
... in: /home/bamboo/xml-data/build-dir/PHPBB3-PR-JOB1
... using extra environment variables:
bamboo_planRepository_1_branch=3.1.x
bamboo_planRepository_1_branchDisplayName=3.1.x
bamboo_repository_revision_number=dc8ff9da28b8ab4ad11c7ea94cca526f17c87fe5
bamboo_PRref=master
bamboo_resultsUrl=https://bamboo.phpbb.com/browse/PHPBB3-PR-JOB1-9084
bamboo_capability_system_builder_command_Git=/usr/bin/git
bamboo_repository_75956235_git_username=bantu
bamboo_build_working_directory=/home/bamboo/xml-data/build-dir/PHPBB3-PR-JOB1
bamboo_planRepository_1_name=phpBB Ascraeus
bamboo_buildKey=PHPBB3-PR-JOB1
bamboo_capability_phpbb_tests=true
bamboo_shortPlanName=Pull Requests
bamboo_capability_system_builder_command_fop=/usr/bin/fop
bamboo_capability_dbms_sqlite_2=true
bamboo_planRepository_name=phpBB Ascraeus
bamboo_PRnumber=5351
bamboo_buildNumber=9084
bamboo_repository_75956235_git_repositoryUrl=https://github.com/phpbb/phpbb.git
bamboo_capability_system_builder_phpunit_PHPUnit=/usr/bin/phpunit
bamboo_shortJobName=Build and Test Job
bamboo_buildResultsUrl=https://bamboo.phpbb.com/browse/PHPBB3-PR-JOB1-9084
bamboo_repository_75956235_branch_name=3.1.x
bamboo_planRepository_repositoryUrl=https://github.com/phpbb/phpbb.git
bamboo_agentId=131073
bamboo_planName=phpBB3 - Pull Requests
bamboo_build_commandline_com_atlassian_bamboo_plugins_scripttask_task_builder_script_7=/bin/sh /home/bamboo/temp/PHPBB3-PR-JOB1-9084-ScriptBuildTask-8011772890481661190.sh
bamboo_shortPlanKey=PR
bamboo_shortJobKey=JOB1
bamboo_capability_dbms_mysql_55=true
bamboo_capability_system_jdk_JDK_1_7_0_65=/usr/lib/jvm/java-7-openjdk-amd64
bamboo_planRepository_revision=dc8ff9da28b8ab4ad11c7ea94cca526f17c87fe5
bamboo_buildTimeStamp=2018-12-28T08:40:35.253Z
bamboo_repository_previous_revision_number=dc8ff9da28b8ab4ad11c7ea94cca526f17c87fe5
bamboo_capability_system_jdk_JDK_1_6_0_16=/usr/lib/jvm/java-6-sun-1.6.0.16
bamboo_capability_system_builder_mvn2_Maven_2=/usr/share/maven2
bamboo_planRepository_previousRevision=dc8ff9da28b8ab4ad11c7ea94cca526f17c87fe5
bamboo_repository_git_branch=3.1.x
bamboo_buildResultKey=PHPBB3-PR-JOB1-9084
bamboo_repository_branch_name=3.1.x
bamboo_buildPlanName=phpBB3 - Pull Requests - Build and Test Job
bamboo_planRepository_1_revision=dc8ff9da28b8ab4ad11c7ea94cca526f17c87fe5
bamboo_repository_name=phpBB Ascraeus
bamboo_buildFailed=false
bamboo_capability_system_docker_executable=/usr/bin/docker
bamboo_planRepository_branch=3.1.x
bamboo_agentWorkingDirectory=/home/bamboo/xml-data/build-dir
bamboo_capability_system_git_executable=/usr/bin/git
bamboo_capability_system_builder_phpunit_PHPUnit_3_4=/usr/bin/phpunit
bamboo_repository_git_username=bantu
bamboo_planRepository_1_previousRevision=dc8ff9da28b8ab4ad11c7ea94cca526f17c87fe5
bamboo_repository_75956235_revision_number=dc8ff9da28b8ab4ad11c7ea94cca526f17c87fe5
bamboo_planRepository_branchDisplayName=3.1.x
bamboo_planRepository_1_type=gitv2
bamboo_planRepository_branchName=3.1.x
bamboo_repository_75956235_previous_revision_number=dc8ff9da28b8ab4ad11c7ea94cca526f17c87fe5
bamboo_capability_system_jdk_JDK=/usr/lib/jvm/java-6-sun
bamboo_plan_storageTag=PHPBB3-PR
bamboo_hg_cache_directory=/home/bamboo/xml-data/build-dir/_hg-repositories-cache
bamboo_planRepository_1_username=bantu
bamboo_planRepository_type=gitv2
bamboo_git_cache_directory=/home/bamboo/xml-data/build-dir/_git-repositories-cache
bamboo_ManualBuildTriggerReason_userName=Build Robot
bamboo_repository_git_repositoryUrl=https://github.com/phpbb/phpbb.git
bamboo_repository_75956235_git_branch=3.1.x
bamboo_capability_system_builder_ant_Ant=/usr/share/ant
bamboo_repository_75956235_name=phpBB Ascraeus
bamboo_tmp_directory=/home/bamboo/temp
bamboo_working_directory=/home/bamboo/xml-data/build-dir/PHPBB3-PR-JOB1
bamboo_planKey=PHPBB3-PR
bamboo_capability_local=true
bamboo_planRepository_1_repositoryUrl=https://github.com/phpbb/phpbb.git
bamboo_planRepository_username=bantu
bamboo_capability_system_jdk_JDK_1_6=/usr/lib/jvm/java-6-sun
bamboo_capability_system_jdk_JDK_1_7=/usr/lib/jvm/java-7-openjdk-amd64
bamboo_planRepository_1_branchName=3.1.x
28-Dec-2018 08:40:44 From https://github.com/phpbb/phpbb
28-Dec-2018 08:40:44 * branch            refs/pull/5351/merge -> FETCH_HEAD
28-Dec-2018 08:40:45 Note: checking out 'FETCH_HEAD'.
28-Dec-2018 08:40:45
28-Dec-2018 08:40:45 You are in 'detached HEAD' state. You can look around, make experimental
28-Dec-2018 08:40:45 changes and commit them, and you can discard any commits you make in this
28-Dec-2018 08:40:45 state without impacting any branches by performing another checkout.
28-Dec-2018 08:40:45
28-Dec-2018 08:40:45 If you want to create a new branch to retain commits you create, you may
28-Dec-2018 08:40:45 do so (now or later) by using -b with the checkout command again. Example:
28-Dec-2018 08:40:45
28-Dec-2018 08:40:45   git checkout -b new_branch_name
28-Dec-2018 08:40:45
28-Dec-2018 08:40:45 HEAD is now at 949a038... Merge cf16e0603d6e5d2c733a9e61f10cf7a14435b1b9 into 5bc078652cfd1d9d1b6d9ce766fac176915146b9
28-Dec-2018 08:40:45 Finished task 'Fetch PR' with result: Success
28-Dec-2018 08:40:45 Skipping execution of task 'Prepare directory' as it is disabled
28-Dec-2018 08:40:45
Substituting variable: ${bamboo.working.directory} with /home/bamboo/xml-data/build-dir/PHPBB3-PR-JOB1
28-Dec-2018 08:40:45 Starting task 'Prepare directory' of type 'com.atlassian.bamboo.plugins.bamboo-docker-plugin:task.docker.cli'
28-Dec-2018 08:40:45 Running image name (phpbb:php-5.6)
28-Dec-2018 08:40:45
Beginning to execute external process for build 'phpBB3 - Pull Requests - Build and Test Job #9084 (PHPBB3-PR-JOB1-9084)'
... running command line:
/usr/bin/docker run --volume /home/bamboo/xml-data/build-dir/PHPBB3-PR-JOB1:/data --workdir /data/phpBB --rm -e HOME=/home/bamboo -u=991 phpbb:php-5.6 /bin/bash -c php ../composer.phar install --dev; cd ../build; ../phpBB/vendor/bin/phing clean prepare
... in: /home/bamboo/xml-data/build-dir/PHPBB3-PR-JOB1
... using extra environment variables:
bamboo_planRepository_1_branch=3.1.x
bamboo_planRepository_1_branchDisplayName=3.1.x
bamboo_repository_revision_number=dc8ff9da28b8ab4ad11c7ea94cca526f17c87fe5
bamboo_PRref=master
bamboo_resultsUrl=https://bamboo.phpbb.com/browse/PHPBB3-PR-JOB1-9084
bamboo_capability_system_builder_command_Git=/usr/bin/git
bamboo_repository_75956235_git_username=bantu
bamboo_build_working_directory=/home/bamboo/xml-data/build-dir/PHPBB3-PR-JOB1
bamboo_planRepository_1_name=phpBB Ascraeus
bamboo_buildKey=PHPBB3-PR-JOB1
bamboo_capability_phpbb_tests=true
bamboo_shortPlanName=Pull Requests
bamboo_capability_system_builder_command_fop=/usr/bin/fop
bamboo_capability_dbms_sqlite_2=true
bamboo_planRepository_name=phpBB Ascraeus
bamboo_PRnumber=5351
bamboo_buildNumber=9084
bamboo_repository_75956235_git_repositoryUrl=https://github.com/phpbb/phpbb.git
bamboo_capability_system_builder_phpunit_PHPUnit=/usr/bin/phpunit
bamboo_shortJobName=Build and Test Job
bamboo_buildResultsUrl=https://bamboo.phpbb.com/browse/PHPBB3-PR-JOB1-9084
bamboo_repository_75956235_branch_name=3.1.x
bamboo_planRepository_repositoryUrl=https://github.com/phpbb/phpbb.git
bamboo_agentId=131073
bamboo_planName=phpBB3 - Pull Requests
bamboo_build_commandline_com_atlassian_bamboo_plugins_scripttask_task_builder_script_7=/bin/sh /home/bamboo/temp/PHPBB3-PR-JOB1-9084-ScriptBuildTask-8011772890481661190.sh
bamboo_shortPlanKey=PR
bamboo_shortJobKey=JOB1
bamboo_capability_dbms_mysql_55=true
bamboo_capability_system_jdk_JDK_1_7_0_65=/usr/lib/jvm/java-7-openjdk-amd64
bamboo_planRepository_revision=dc8ff9da28b8ab4ad11c7ea94cca526f17c87fe5
bamboo_buildTimeStamp=2018-12-28T08:40:35.253Z
bamboo_repository_previous_revision_number=dc8ff9da28b8ab4ad11c7ea94cca526f17c87fe5
bamboo_capability_system_jdk_JDK_1_6_0_16=/usr/lib/jvm/java-6-sun-1.6.0.16
bamboo_capability_system_builder_mvn2_Maven_2=/usr/share/maven2
bamboo_planRepository_previousRevision=dc8ff9da28b8ab4ad11c7ea94cca526f17c87fe5
bamboo_build_commandline_com_atlassian_bamboo_plugins_scripttask_task_builder_script_4=/bin/sh /home/bamboo/temp/PHPBB3-PR-JOB1-9084-ScriptBuildTask-6548244205878743175.sh
bamboo_repository_git_branch=3.1.x
bamboo_buildResultKey=PHPBB3-PR-JOB1-9084
bamboo_repository_branch_name=3.1.x
bamboo_buildPlanName=phpBB3 - Pull Requests - Build and Test Job
bamboo_planRepository_1_revision=dc8ff9da28b8ab4ad11c7ea94cca526f17c87fe5
bamboo_repository_name=phpBB Ascraeus
bamboo_buildFailed=false
bamboo_capability_system_docker_executable=/usr/bin/docker
bamboo_planRepository_branch=3.1.x
bamboo_agentWorkingDirectory=/home/bamboo/xml-data/build-dir
bamboo_capability_system_git_executable=/usr/bin/git
bamboo_capability_system_builder_phpunit_PHPUnit_3_4=/usr/bin/phpunit
bamboo_repository_git_username=bantu
bamboo_planRepository_1_previousRevision=dc8ff9da28b8ab4ad11c7ea94cca526f17c87fe5
bamboo_repository_75956235_revision_number=dc8ff9da28b8ab4ad11c7ea94cca526f17c87fe5
bamboo_planRepository_branchDisplayName=3.1.x
bamboo_planRepository_1_type=gitv2
bamboo_planRepository_branchName=3.1.x
bamboo_repository_75956235_previous_revision_number=dc8ff9da28b8ab4ad11c7ea94cca526f17c87fe5
bamboo_capability_system_jdk_JDK=/usr/lib/jvm/java-6-sun
bamboo_plan_storageTag=PHPBB3-PR
bamboo_hg_cache_directory=/home/bamboo/xml-data/build-dir/_hg-repositories-cache
bamboo_planRepository_1_username=bantu
bamboo_planRepository_type=gitv2
bamboo_git_cache_directory=/home/bamboo/xml-data/build-dir/_git-repositories-cache
bamboo_ManualBuildTriggerReason_userName=Build Robot
bamboo_repository_git_repositoryUrl=https://github.com/phpbb/phpbb.git
bamboo_repository_75956235_git_branch=3.1.x
bamboo_capability_system_builder_ant_Ant=/usr/share/ant
bamboo_repository_75956235_name=phpBB Ascraeus
bamboo_tmp_directory=/home/bamboo/temp
bamboo_working_directory=/home/bamboo/xml-data/build-dir/PHPBB3-PR-JOB1
bamboo_planKey=PHPBB3-PR
bamboo_capability_local=true
bamboo_planRepository_1_repositoryUrl=https://github.com/phpbb/phpbb.git
bamboo_planRepository_username=bantu
bamboo_capability_system_jdk_JDK_1_6=/usr/lib/jvm/java-6-sun
bamboo_capability_system_jdk_JDK_1_7=/usr/lib/jvm/java-7-openjdk-amd64
bamboo_planRepository_1_branchName=3.1.x
28-Dec-2018 08:40:47 Cannot create cache directory /home/bamboo/.composer/cache/repo/https---repo.packagist.org/, or directory is not writable. Proceeding without cache
28-Dec-2018 08:40:47 Cannot create cache directory /home/bamboo/.composer/cache/files/, or directory is not writable. Proceeding without cache
28-Dec-2018 08:40:47 You are using the deprecated option "dev". Dev packages are installed by default now.
28-Dec-2018 08:40:47 Loading composer repositories with package information
28-Dec-2018 08:40:47 Installing dependencies (including require-dev) from lock file
28-Dec-2018 08:40:47 Warning: The lock file is not up to date with the latest changes in composer.json. You may be getting outdated dependencies. Run update to update them.
28-Dec-2018 08:40:47 Package operations: 76 installs, 0 updates, 0 removals
28-Dec-2018 08:40:48   - Installing composer/installers (v1.5.0): Downloading (connecting...)Downloading (0%)           Downloading (5%)Downloading (20%)Downloading (25%)Downloading (30%)Downloading (45%)Downloading (50%)Downloading (55%)Downloading (75%)Downloading (80%)Downloading (85%)Downloading (100%)
28-Dec-2018 08:40:49   - Installing bantu/ini-get-wrapper (v1.0.1): Downloading (connecting...)Downloading (100%)         
28-Dec-2018 08:40:49   - Installing symfony/process (v3.4.15): Downloading (connecting...)Downloading (100%)         
28-Dec-2018 08:40:50   - Installing symfony/finder (v3.4.15): Downloading (connecting...)Downloading (0%)           Downloading (5%)Downloading (50%)Downloading (55%)Downloading (60%)Downloading (65%)Downloading (95%)Downloading (100%)
28-Dec-2018 08:40:51   - Installing symfony/polyfill-ctype (v1.9.0): Downloading (connecting...)Downloading (0%)           Downloading (100%)
28-Dec-2018 08:40:52   - Installing symfony/filesystem (v3.4.15): Downloading (connecting...)Downloading (100%)         
28-Dec-2018 08:40:52   - Installing symfony/polyfill-mbstring (v1.9.0): Downloading (connecting...)Downloading (0%)           Downloading (30%)Downloading (65%)Downloading (95%)Downloading (100%)
28-Dec-2018 08:40:53   - Installing psr/log (1.0.2): Downloading (connecting...)Downloading (0%)           Downloading (15%)Downloading (100%)
28-Dec-2018 08:40:54   - Installing symfony/debug (v3.4.15): Downloading (connecting...)Downloading (100%)         
28-Dec-2018 08:40:55   - Installing symfony/console (v3.4.15): Downloading (connecting...)Downloading (0%)           Downloading (5%)Downloading (10%)Downloading (15%)Downloading (20%)Downloading (25%)Downloading (30%)Downloading (35%)Downloading (40%)Downloading (45%)Downloading (50%)Downloading (55%)Downloading (60%)Downloading (65%)Downloading (70%)Downloading (75%)Downloading (80%)Downloading (85%)Downloading (90%)Downloading (95%)Downloading (100%)
28-Dec-2018 08:40:55   - Installing seld/phar-utils (1.0.1): Downloading (connecting...)Downloading (0%)           Downloading (30%)Downloading (60%)Downloading (90%)Downloading (100%)
28-Dec-2018 08:40:56   - Installing seld/jsonlint (1.7.1): Downloading (connecting...)Downloading (0%)           Downloading (15%)Downloading (50%)Downloading (100%)
28-Dec-2018 08:40:57   - Installing justinrainbow/json-schema (5.2.7): Downloading (connecting...)Downloading (0%)           Downloading (20%)Downloading (25%)Downloading (30%)Downloading (35%)Downloading (50%)Downloading (55%)Downloading (70%)Downloading (75%)Downloading (90%)Downloading (95%)Downloading (100%)
28-Dec-2018 08:40:57   - Installing composer/xdebug-handler (1.3.0): Downloading (connecting...)Downloading (0%)           Downloading (25%)Downloading (95%)Downloading (100%)
28-Dec-2018 08:40:58   - Installing composer/spdx-licenses (1.4.0): Downloading (connecting...)Downloading (100%)         
28-Dec-2018 08:40:59   - Installing composer/semver (1.4.2): Downloading (connecting...)Downloading (0%)           Downloading (35%)Downloading (85%)Downloading (100%)
28-Dec-2018 08:41:00   - Installing composer/ca-bundle (1.1.2): Downloading (connecting...)Downloading (0%)           Downloading (5%)Downloading (10%)Downloading (15%)Downloading (20%)Downloading (25%)Downloading (30%)Downloading (35%)Downloading (40%)Downloading (45%)Downloading (50%)Downloading (55%)Downloading (60%)Downloading (65%)Downloading (70%)Downloading (75%)Downloading (80%)Downloading (85%)Downloading (90%)Downloading (95%)Downloading (100%)
28-Dec-2018 08:41:01   - Installing composer/composer (1.7.2): Downloading (connecting...)Downloading (100%)         
28-Dec-2018 08:41:02   - Installing google/recaptcha (1.2.1): Downloading (connecting...)Downloading (0%)           Downloading (5%)Downloading (10%)Downloading (15%)Downloading (20%)Downloading (95%)Downloading (100%)
28-Dec-2018 08:41:02   - Installing guzzlehttp/promises (v1.3.1): Downloading (connecting...)Downloading (0%)           Downloading (30%)Downloading (60%)Downloading (80%)Downloading (100%)
28-Dec-2018 08:41:03   - Installing psr/http-message (1.0.1): Downloading (connecting...)Downloading (0%)           Downloading (100%)
28-Dec-2018 08:41:04   - Installing guzzlehttp/psr7 (1.4.2): Downloading (connecting...)Downloading (0%)           Downloading (5%)Downloading (10%)Downloading (15%)Downloading (20%)Downloading (90%)Downloading (95%)Downloading (100%)
28-Dec-2018 08:41:05   - Installing lusitanian/oauth (v0.8.11): Downloading (connecting...)Downloading (0%)           Downloading (5%)Downloading (10%)Downloading (15%)Downloading (30%)Downloading (35%)Downloading (45%)Downloading (50%)Downloading (55%)Downloading (60%)Downloading (65%)Downloading (70%)Downloading (75%)Downloading (80%)Downloading (90%)Downloading (95%)Downloading (100%)
28-Dec-2018 08:41:05   - Installing marc1706/fast-image-size (v1.1.4): Downloading (connecting...)Downloading (100%)         
28-Dec-2018 08:41:09   - Installing patchwork/utf8 (v1.3.1): Downloading (connecting...)Downloading (0%)           Downloading (5%)Downloading (10%)Downloading (15%)Downloading (20%)Downloading (25%)Downloading (30%)Downloading (35%)Downloading (40%)Downloading (45%)Downloading (50%)Downloading (55%)Downloading (60%)Downloading (65%)Downloading (70%)Downloading (75%)Downloading (80%)Downloading (85%)Downloading (90%)Downloading (95%)Downloading (100%)
28-Dec-2018 08:41:09   - Installing psr/container (1.0.0): Downloading (connecting...)Downloading (0%)           Downloading (75%)Downloading (100%)
28-Dec-2018 08:41:10   - Installing s9e/text-formatter (0.13.1): Downloading (connecting...)Downloading (100%)         
28-Dec-2018 08:41:11   - Installing symfony/config (v3.4.15): Downloading (connecting...)Downloading (0%)           Downloading (5%)Downloading (10%)Downloading (15%)Downloading (20%)Downloading (25%)Downloading (30%)Downloading (35%)Downloading (40%)Downloading (45%)Downloading (50%)Downloading (55%)Downloading (60%)Downloading (65%)Downloading (70%)Downloading (75%)Downloading (80%)Downloading (85%)Downloading (90%)Downloading (95%)Downloading (100%)
28-Dec-2018 08:41:12   - Installing paragonie/random_compat (v1.4.3): Downloading (connecting...)Downloading (0%)           Downloading (10%)Downloading (35%)Downloading (45%)Downloading (50%)Downloading (60%)Downloading (85%)Downloading (100%)
28-Dec-2018 08:41:13   - Installing symfony/polyfill-php70 (v1.9.0): Downloading (connecting...)Downloading (100%)         
28-Dec-2018 08:41:14   - Installing symfony/http-foundation (v3.4.15): Downloading (connecting...)Downloading (0%)           Downloading (5%)Downloading (10%)Downloading (15%)Downloading (20%)Downloading (25%)Downloading (30%)Downloading (35%)Downloading (40%)Downloading (45%)Downloading (50%)Downloading (55%)Downloading (60%)Downloading (65%)Downloading (70%)Downloading (75%)Downloading (80%)Downloading (85%)Downloading (90%)Downloading (95%)Downloading (100%)
28-Dec-2018 08:41:15   - Installing symfony/event-dispatcher (v3.4.15): Downloading (connecting...)Downloading (0%)           Downloading (5%)Downloading (100%)
28-Dec-2018 08:41:16   - Installing symfony/http-kernel (v3.4.15): Downloading (connecting...)Downloading (100%)         
28-Dec-2018 08:41:17   - Installing symfony/dependency-injection (v3.4.15): Downloading (connecting...)Downloading (100%)         
28-Dec-2018 08:41:18   - Installing zendframework/zend-eventmanager (3.2.1): Downloading (connecting...)Downloading (0%)           Downloading (15%)Downloading (20%)Downloading (35%)Downloading (45%)Downloading (65%)Downloading (80%)Downloading (85%)Downloading (100%)
28-Dec-2018 08:41:19   - Installing zendframework/zend-code (2.6.3): Downloading (connecting...)Downloading (100%)         
28-Dec-2018 08:41:21   - Installing ocramius/proxy-manager (1.0.2): Downloading (connecting...)Downloading (0%)           Downloading (5%)Downloading (10%)Downloading (15%)Downloading (20%)Downloading (25%)Downloading (30%)Downloading (35%)Downloading (40%)Downloading (45%)Downloading (50%)Downloading (55%)Downloading (60%)Downloading (65%)Downloading (70%)Downloading (75%)Downloading (80%)Downloading (85%)Downloading (95%)Downloading (100%)
28-Dec-2018 08:41:22   - Installing symfony/proxy-manager-bridge (v3.4.15): Downloading (connecting...)Downloading (100%)         
28-Dec-2018 08:41:22   - Installing symfony/routing (v3.4.15): Downloading (connecting...)Downloading (100%)         
28-Dec-2018 08:41:25   - Installing twig/twig (v1.35.4): Downloading (connecting...)Downloading (0%)           Downloading (5%)Downloading (10%)Downloading (15%)Downloading (20%)Downloading (25%)Downloading (30%)Downloading (35%)Downloading (40%)Downloading (45%)Downloading (50%)Downloading (55%)Downloading (60%)Downloading (65%)Downloading (70%)Downloading (75%)Downloading (80%)Downloading (85%)Downloading (90%)Downloading (95%)Downloading (100%)
28-Dec-2018 08:41:26   - Installing symfony/twig-bridge (v3.4.15): Downloading (connecting...)Downloading (100%)         
28-Dec-2018 08:41:26   - Installing symfony/dom-crawler (v3.4.15): Downloading (connecting...)Downloading (100%)         
28-Dec-2018 08:41:27   - Installing symfony/css-selector (v3.4.15): Downloading (connecting...)Downloading (0%)           Downloading (5%)Downloading (10%)Downloading (15%)Downloading (20%)Downloading (25%)Downloading (30%)Downloading (35%)Downloading (40%)Downloading (45%)Downloading (50%)Downloading (55%)Downloading (60%)Downloading (65%)Downloading (100%)
28-Dec-2018 08:41:28   - Installing symfony/browser-kit (v3.4.15): Downloading (connecting...)Downloading (0%)           Downloading (5%)Downloading (65%)Downloading (70%)Downloading (100%)
28-Dec-2018 08:41:29   - Installing guzzlehttp/guzzle (6.3.3): Downloading (connecting...)Downloading (0%)           Downloading (5%)Downloading (15%)Downloading (20%)Downloading (30%)Downloading (35%)Downloading (40%)Downloading (45%)Downloading (55%)Downloading (60%)Downloading (70%)Downloading (75%)Downloading (80%)Downloading (90%)Downloading (95%)Downloading (100%)
28-Dec-2018 08:41:29   - Installing fabpot/goutte (v3.2.3): Downloading (connecting...)Downloading (0%)           Downloading (40%)Downloading (100%)
28-Dec-2018 08:41:30   - Installing facebook/webdriver (1.6.0): Downloading (connecting...)Downloading (0%)           Downloading (5%)Downloading (10%)Downloading (15%)Downloading (20%)Downloading (25%)Downloading (30%)Downloading (35%)Downloading (40%)Downloading (45%)Downloading (50%)Downloading (55%)Downloading (60%)Downloading (65%)Downloading (70%)Downloading (75%)Downloading (80%)Downloading (85%)Downloading (90%)Downloading (95%)Downloading (100%)
28-Dec-2018 08:41:31   - Installing symfony/yaml (v3.4.15): Downloading (connecting...)Downloading (100%)         
28-Dec-2018 08:41:32   - Installing laravel/homestead (v7.17.0): Downloading (connecting...)Downloading (100%)         
28-Dec-2018 08:41:37   - Installing phing/phing (2.4.14): Downloading (connecting...)Downloading (100%)         
28-Dec-2018 08:41:38   - Installing webmozart/assert (1.3.0): Downloading (connecting...)Downloading (0%)           Downloading (65%)Downloading (85%)Downloading (100%)
28-Dec-2018 08:41:38   - Installing phpdocumentor/reflection-common (1.0.1): Downloading (connecting...)Downloading (0%)           Downloading (100%)
28-Dec-2018 08:41:39   - Installing phpdocumentor/type-resolver (0.4.0): Downloading (connecting...)Downloading (0%)           Downloading (5%)Downloading (100%)
28-Dec-2018 08:41:40   - Installing phpdocumentor/reflection-docblock (3.3.2): Downloading (connecting...)Downloading (100%)         
28-Dec-2018 08:41:40   - Installing sebastian/version (2.0.1): Downloading (connecting...)Downloading (0%)           Downloading (100%)
28-Dec-2018 08:41:41   - Installing sebastian/resource-operations (1.0.0): Downloading (connecting...)Downloading (0%)           Downloading (65%)Downloading (100%)
28-Dec-2018 08:41:42   - Installing sebastian/recursion-context (2.0.0): Downloading (connecting...)Downloading (0%)           Downloading (100%)
28-Dec-2018 08:41:42   - Installing sebastian/object-enumerator (2.0.1): Downloading (connecting...)Downloading (0%)           Downloading (100%)
28-Dec-2018 08:41:43   - Installing sebastian/global-state (1.1.1): Downloading (connecting...)Downloading (0%)           Downloading (40%)Downloading (70%)Downloading (100%)
28-Dec-2018 08:41:44   - Installing sebastian/exporter (2.0.0): Downloading (connecting...)Downloading (0%)           Downloading (100%)
28-Dec-2018 08:41:44   - Installing sebastian/environment (2.0.0): Downloading (connecting...)Downloading (0%)           Downloading (15%)Downloading (30%)Downloading (45%)Downloading (60%)Downloading (75%)Downloading (90%)Downloading (100%)
28-Dec-2018 08:41:45   - Installing sebastian/diff (1.4.3): Downloading (connecting...)Downloading (0%)           Downloading (35%)Downloading (50%)Downloading (85%)Downloading (90%)Downloading (100%)
28-Dec-2018 08:41:45   - Installing sebastian/comparator (1.2.4): Downloading (connecting...)Downloading (0%)           Downloading (10%)Downloading (45%)Downloading (55%)Downloading (65%)Downloading (70%)Downloading (100%)
28-Dec-2018 08:41:46   - Installing phpunit/php-text-template (1.2.1): Downloading (connecting...)Downloading (0%)           Downloading (35%)Downloading (100%)
28-Dec-2018 08:41:47   - Installing doctrine/instantiator (1.0.5): Downloading (connecting...)Downloading (0%)           Downloading (15%)Downloading (30%)Downloading (45%)Downloading (100%)
28-Dec-2018 08:41:48   - Installing phpunit/phpunit-mock-objects (3.4.4): Downloading (connecting...)Downloading (0%)           Downloading (5%)Downloading (10%)Downloading (15%)Downloading (20%)Downloading (30%)Downloading (35%)Downloading (40%)Downloading (50%)Downloading (55%)Downloading (60%)Downloading (65%)Downloading (80%)Downloading (85%)Downloading (90%)Downloading (95%)Downloading (100%)
28-Dec-2018 08:41:48   - Installing phpunit/php-timer (1.0.9): Downloading (connecting...)Downloading (0%)           Downloading (45%)Downloading (90%)Downloading (100%)
28-Dec-2018 08:41:49   - Installing phpunit/php-file-iterator (1.4.5): Downloading (connecting...)Downloading (0%)           Downloading (100%)
28-Dec-2018 08:41:49   - Installing sebastian/code-unit-reverse-lookup (1.0.1): Downloading (connecting...)Downloading (0%)           Downloading (55%)Downloading (100%)
28-Dec-2018 08:41:50   - Installing phpunit/php-token-stream (1.4.12): Downloading (connecting...)Downloading (0%)           Downloading (5%)Downloading (10%)Downloading (15%)Downloading (20%)Downloading (65%)Downloading (70%)Downloading (75%)Downloading (80%)Downloading (85%)Downloading (90%)Downloading (100%)
28-Dec-2018 08:41:50   - Installing phpunit/php-code-coverage (4.0.8): Downloading (connecting...)Downloading (0%)           Downloading (5%)Downloading (10%)Downloading (15%)Downloading (20%)Downloading (25%)Downloading (30%)Downloading (35%)Downloading (40%)Downloading (45%)Downloading (50%)Downloading (55%)Downloading (60%)Downloading (65%)Downloading (70%)Downloading (75%)Downloading (80%)Downloading (85%)Downloading (90%)Downloading (95%)Downloading (100%)
28-Dec-2018 08:41:51   - Installing phpspec/prophecy (1.8.0): Downloading (connecting...)Downloading (0%)           Downloading (15%)Downloading (25%)Downloading (35%)Downloading (40%)Downloading (50%)Downloading (60%)Downloading (65%)Downloading (75%)Downloading (85%)Downloading (90%)Downloading (95%)Downloading (100%)
28-Dec-2018 08:41:52   - Installing myclabs/deep-copy (1.7.0): Downloading (connecting...)Downloading (0%)           Downloading (15%)Downloading (20%)Downloading (30%)Downloading (45%)Downloading (70%)Downloading (90%)Downloading (100%)
28-Dec-2018 08:41:52   - Installing phpunit/phpunit (5.7.27): Downloading (connecting...)Downloading (0%)           Downloading (5%)Downloading (10%)Downloading (15%)Downloading (20%)Downloading (25%)Downloading (30%)Downloading (35%)Downloading (40%)Downloading (45%)Downloading (50%)Downloading (55%)Downloading (60%)Downloading (65%)Downloading (70%)Downloading (75%)Downloading (80%)Downloading (85%)Downloading (90%)Downloading (95%)Downloading (100%)
28-Dec-2018 08:41:53   - Installing phpunit/dbunit (2.0.3): Downloading (connecting...)Downloading (100%)         
28-Dec-2018 08:41:55   - Installing squizlabs/php_codesniffer (2.9.1): Downloading (connecting...)Downloading (0%)           Downloading (5%)Downloading (10%)Downloading (15%)Downloading (20%)Downloading (25%)Downloading (30%)Downloading (35%)Downloading (40%)Downloading (45%)Downloading (50%)Downloading (55%)Downloading (60%)Downloading (65%)Downloading (70%)Downloading (75%)Downloading (80%)Downloading (90%)Downloading (95%)Downloading (100%)
28-Dec-2018 08:41:56 symfony/console suggests installing symfony/lock
28-Dec-2018 08:41:56 lusitanian/oauth suggests installing predis/predis (Allows using the Redis storage backend.)
28-Dec-2018 08:41:56 patchwork/utf8 suggests installing ext-intl (Use Intl for best performance)
28-Dec-2018 08:41:56 patchwork/utf8 suggests installing ext-wfio (Use WFIO for UTF-8 filesystem access on Windows)
28-Dec-2018 08:41:56 s9e/text-formatter suggests installing ext-intl (Allows international URLs to be accepted by the URL filter)
28-Dec-2018 08:41:56 s9e/text-formatter suggests installing ext-xsl (Enables the XSLT renderer)
28-Dec-2018 08:41:56 paragonie/random_compat suggests installing ext-libsodium (Provides a modern crypto API that can be used to generate random bytes.)
28-Dec-2018 08:41:56 symfony/http-kernel suggests installing symfony/var-dumper
28-Dec-2018 08:41:56 symfony/dependency-injection suggests installing symfony/expression-language (For using expressions in service container configuration)
28-Dec-2018 08:41:56 zendframework/zend-eventmanager suggests installing container-interop/container-interop (^1.1.0, to use the lazy listeners feature)
28-Dec-2018 08:41:56 zendframework/zend-eventmanager suggests installing zendframework/zend-stdlib (^2.7.3 || ^3.0, to use the FilterChain feature)
28-Dec-2018 08:41:56 zendframework/zend-code suggests installing doctrine/annotations (Doctrine\Common\Annotations >=1.0 for annotation features)
28-Dec-2018 08:41:56 zendframework/zend-code suggests installing zendframework/zend-stdlib (Zend\Stdlib component)
28-Dec-2018 08:41:56 ocramius/proxy-manager suggests installing ocramius/generated-hydrator (To have very fast object to array to object conversion for ghost objects)
28-Dec-2018 08:41:56 ocramius/proxy-manager suggests installing zendframework/zend-json (To have the JsonRpc adapter (Remote Object feature))
28-Dec-2018 08:41:56 ocramius/proxy-manager suggests installing zendframework/zend-soap (To have the Soap adapter (Remote Object feature))
28-Dec-2018 08:41:56 ocramius/proxy-manager suggests installing zendframework/zend-stdlib (To use the hydrator proxy)
28-Dec-2018 08:41:56 ocramius/proxy-manager suggests installing zendframework/zend-xmlrpc (To have the XmlRpc adapter (Remote Object feature))
28-Dec-2018 08:41:56 symfony/routing suggests installing doctrine/annotations (For using the annotation loader)
28-Dec-2018 08:41:56 symfony/routing suggests installing symfony/expression-language (For using expression matching)
28-Dec-2018 08:41:56 symfony/twig-bridge suggests installing symfony/asset (For using the AssetExtension)
28-Dec-2018 08:41:56 symfony/twig-bridge suggests installing symfony/expression-language (For using the ExpressionExtension)
28-Dec-2018 08:41:56 symfony/twig-bridge suggests installing symfony/form (For using the FormExtension)
28-Dec-2018 08:41:56 symfony/twig-bridge suggests installing symfony/security (For using the SecurityExtension)
28-Dec-2018 08:41:56 symfony/twig-bridge suggests installing symfony/stopwatch (For using the StopwatchExtension)
28-Dec-2018 08:41:56 symfony/twig-bridge suggests installing symfony/templating (For using the TwigEngine)
28-Dec-2018 08:41:56 symfony/twig-bridge suggests installing symfony/translation (For using the TranslationExtension)
28-Dec-2018 08:41:56 symfony/twig-bridge suggests installing symfony/var-dumper (For using the DumpExtension)
28-Dec-2018 08:41:56 symfony/twig-bridge suggests installing symfony/web-link (For using the WebLinkExtension)
28-Dec-2018 08:41:56 facebook/webdriver suggests installing ext-SimpleXML (For Firefox profile creation)
28-Dec-2018 08:41:56 sebastian/global-state suggests installing ext-uopz (*)
28-Dec-2018 08:41:56 phpunit/phpunit-mock-objects suggests installing ext-soap (*)
28-Dec-2018 08:41:56 phpunit/phpunit suggests installing phpunit/php-invoker (~1.1)
28-Dec-2018 08:41:56 Generating autoload files
28-Dec-2018 08:41:57 Buildfile: /data/build/build.xml
28-Dec-2018 08:41:57
28-Dec-2018 08:41:57 phpBB > clean:
28-Dec-2018 08:41:57
28-Dec-2018 08:41:57    [delete] Directory /data/build/logs does not exist or is not a directory.
28-Dec-2018 08:41:57    [delete] Directory /data/build/api does not exist or is not a directory.
28-Dec-2018 08:41:57    [delete] Directory /data/build/codebrowser does not exist or is not a directory.
28-Dec-2018 08:41:57    [delete] Directory /data/build/coverage does not exist or is not a directory.
28-Dec-2018 08:41:57    [delete] Directory /data/build/cpd does not exist or is not a directory.
28-Dec-2018 08:41:57    [delete] Directory /data/build/dependencies does not exist or is not a directory.
28-Dec-2018 08:41:57    [delete] Directory /data/build/new_version does not exist or is not a directory.
28-Dec-2018 08:41:57    [delete] Directory /data/build/old_versions does not exist or is not a directory.
28-Dec-2018 08:41:57    [delete] Directory /data/build/save does not exist or is not a directory.
28-Dec-2018 08:41:57
28-Dec-2018 08:41:57 phpBB > prepare:
28-Dec-2018 08:41:57
28-Dec-2018 08:41:57     [mkdir] Created dir: /data/build/logs
28-Dec-2018 08:41:57     [mkdir] Created dir: /data/build/api
28-Dec-2018 08:41:57     [mkdir] Created dir: /data/build/codebrowser
28-Dec-2018 08:41:57     [mkdir] Created dir: /data/build/coverage
28-Dec-2018 08:41:57     [mkdir] Created dir: /data/build/cpd
28-Dec-2018 08:41:57     [mkdir] Created dir: /data/build/dependencies
28-Dec-2018 08:41:57     [mkdir] Created dir: /data/build/new_version
28-Dec-2018 08:41:57     [mkdir] Created dir: /data/build/new_version/files
28-Dec-2018 08:41:57     [mkdir] Created dir: /data/build/new_version/patches
28-Dec-2018 08:41:57     [mkdir] Created dir: /data/build/new_version/release_files
28-Dec-2018 08:41:57     [mkdir] Created dir: /data/build/new_version/update
28-Dec-2018 08:41:57     [mkdir] Created dir: /data/build/old_versions
28-Dec-2018 08:41:57     [mkdir] Created dir: /data/build/save
28-Dec-2018 08:41:57
28-Dec-2018 08:41:57 BUILD FINISHED
28-Dec-2018 08:41:57
28-Dec-2018 08:41:57 Total time: 0.1187 seconds
28-Dec-2018 08:41:57
28-Dec-2018 08:41:58 Finished task 'Prepare directory' with result: Success
28-Dec-2018 08:41:58 Skipping execution of task 'Run sniffs' as it is disabled
28-Dec-2018 08:41:58
Substituting variable: ${bamboo.working.directory} with /home/bamboo/xml-data/build-dir/PHPBB3-PR-JOB1
28-Dec-2018 08:41:58 Starting task 'Run sniffs' of type 'com.atlassian.bamboo.plugins.bamboo-docker-plugin:task.docker.cli'
28-Dec-2018 08:41:58 Running image name (phpbb:php-5.6)
28-Dec-2018 08:41:58
Beginning to execute external process for build 'phpBB3 - Pull Requests - Build and Test Job #9084 (PHPBB3-PR-JOB1-9084)'
... running command line:
/usr/bin/docker run --volume /home/bamboo/xml-data/build-dir/PHPBB3-PR-JOB1:/data --workdir /data/build --rm -u=991 phpbb:php-5.6 ../phpBB/vendor/bin/phing sniff
... in: /home/bamboo/xml-data/build-dir/PHPBB3-PR-JOB1
... using extra environment variables:
bamboo_planRepository_1_branch=3.1.x
bamboo_planRepository_1_branchDisplayName=3.1.x
bamboo_repository_revision_number=dc8ff9da28b8ab4ad11c7ea94cca526f17c87fe5
bamboo_PRref=master
bamboo_resultsUrl=https://bamboo.phpbb.com/browse/PHPBB3-PR-JOB1-9084
bamboo_capability_system_builder_command_Git=/usr/bin/git
bamboo_repository_75956235_git_username=bantu
bamboo_build_working_directory=/home/bamboo/xml-data/build-dir/PHPBB3-PR-JOB1
bamboo_planRepository_1_name=phpBB Ascraeus
bamboo_buildKey=PHPBB3-PR-JOB1
bamboo_capability_phpbb_tests=true
bamboo_shortPlanName=Pull Requests
bamboo_capability_system_builder_command_fop=/usr/bin/fop
bamboo_capability_dbms_sqlite_2=true
bamboo_planRepository_name=phpBB Ascraeus
bamboo_PRnumber=5351
bamboo_buildNumber=9084
bamboo_repository_75956235_git_repositoryUrl=https://github.com/phpbb/phpbb.git
bamboo_capability_system_builder_phpunit_PHPUnit=/usr/bin/phpunit
bamboo_shortJobName=Build and Test Job
bamboo_buildResultsUrl=https://bamboo.phpbb.com/browse/PHPBB3-PR-JOB1-9084
bamboo_repository_75956235_branch_name=3.1.x
bamboo_planRepository_repositoryUrl=https://github.com/phpbb/phpbb.git
bamboo_agentId=131073
bamboo_planName=phpBB3 - Pull Requests
bamboo_build_commandline_com_atlassian_bamboo_plugins_scripttask_task_builder_script_7=/bin/sh /home/bamboo/temp/PHPBB3-PR-JOB1-9084-ScriptBuildTask-8011772890481661190.sh
bamboo_shortPlanKey=PR
bamboo_shortJobKey=JOB1
bamboo_capability_dbms_mysql_55=true
bamboo_capability_system_jdk_JDK_1_7_0_65=/usr/lib/jvm/java-7-openjdk-amd64
bamboo_planRepository_revision=dc8ff9da28b8ab4ad11c7ea94cca526f17c87fe5
bamboo_buildTimeStamp=2018-12-28T08:40:35.253Z
bamboo_repository_previous_revision_number=dc8ff9da28b8ab4ad11c7ea94cca526f17c87fe5
bamboo_capability_system_jdk_JDK_1_6_0_16=/usr/lib/jvm/java-6-sun-1.6.0.16
bamboo_capability_system_builder_mvn2_Maven_2=/usr/share/maven2
bamboo_planRepository_previousRevision=dc8ff9da28b8ab4ad11c7ea94cca526f17c87fe5
bamboo_build_commandline_com_atlassian_bamboo_plugins_scripttask_task_builder_script_4=/bin/sh /home/bamboo/temp/PHPBB3-PR-JOB1-9084-ScriptBuildTask-6548244205878743175.sh
bamboo_repository_git_branch=3.1.x
bamboo_buildResultKey=PHPBB3-PR-JOB1-9084
bamboo_repository_branch_name=3.1.x
bamboo_buildPlanName=phpBB3 - Pull Requests - Build and Test Job
bamboo_planRepository_1_revision=dc8ff9da28b8ab4ad11c7ea94cca526f17c87fe5
bamboo_repository_name=phpBB Ascraeus
bamboo_buildFailed=false
bamboo_capability_system_docker_executable=/usr/bin/docker
bamboo_build_commandline_com_atlassian_bamboo_plugins_bamboo_docker_plugin_task_docker_cli_12=/usr/bin/docker run --volume /home/bamboo/xml-data/build-dir/PHPBB3-PR-JOB1:/data --workdir /data/phpBB --rm -e HOME=/home/bamboo -u=991 phpbb:php-5.6 /bin/bash -c php ../composer.phar install --dev; cd ../build; ../phpBB/vendor/bin/phing clean prepare
bamboo_planRepository_branch=3.1.x
bamboo_agentWorkingDirectory=/home/bamboo/xml-data/build-dir
bamboo_capability_system_git_executable=/usr/bin/git
bamboo_capability_system_builder_phpunit_PHPUnit_3_4=/usr/bin/phpunit
bamboo_repository_git_username=bantu
bamboo_planRepository_1_previousRevision=dc8ff9da28b8ab4ad11c7ea94cca526f17c87fe5
bamboo_repository_75956235_revision_number=dc8ff9da28b8ab4ad11c7ea94cca526f17c87fe5
bamboo_planRepository_branchDisplayName=3.1.x
bamboo_planRepository_1_type=gitv2
bamboo_planRepository_branchName=3.1.x
bamboo_repository_75956235_previous_revision_number=dc8ff9da28b8ab4ad11c7ea94cca526f17c87fe5
bamboo_capability_system_jdk_JDK=/usr/lib/jvm/java-6-sun
bamboo_plan_storageTag=PHPBB3-PR
bamboo_hg_cache_directory=/home/bamboo/xml-data/build-dir/_hg-repositories-cache
bamboo_planRepository_1_username=bantu
bamboo_planRepository_type=gitv2
bamboo_git_cache_directory=/home/bamboo/xml-data/build-dir/_git-repositories-cache
bamboo_ManualBuildTriggerReason_userName=Build Robot
bamboo_repository_git_repositoryUrl=https://github.com/phpbb/phpbb.git
bamboo_repository_75956235_git_branch=3.1.x
bamboo_capability_system_builder_ant_Ant=/usr/share/ant
bamboo_repository_75956235_name=phpBB Ascraeus
bamboo_tmp_directory=/home/bamboo/temp
bamboo_working_directory=/home/bamboo/xml-data/build-dir/PHPBB3-PR-JOB1
bamboo_planKey=PHPBB3-PR
bamboo_capability_local=true
bamboo_planRepository_1_repositoryUrl=https://github.com/phpbb/phpbb.git
bamboo_planRepository_username=bantu
bamboo_capability_system_jdk_JDK_1_6=/usr/lib/jvm/java-6-sun
bamboo_capability_system_jdk_JDK_1_7=/usr/lib/jvm/java-7-openjdk-amd64
bamboo_planRepository_1_branchName=3.1.x
28-Dec-2018 08:41:58 Buildfile: /data/build/build.xml
28-Dec-2018 08:41:58
28-Dec-2018 08:41:58 phpBB > sniff:
28-Dec-2018 08:41:58
28-Dec-2018 08:42:06 ............................................................  60 / 769 (8%)
28-Dec-2018 08:42:07 ............................................................ 120 / 769 (16%)
28-Dec-2018 08:42:08 ............................................................ 180 / 769 (23%)
28-Dec-2018 08:42:09 ............................................................ 240 / 769 (31%)
28-Dec-2018 08:42:10 ............................................................ 300 / 769 (39%)
28-Dec-2018 08:42:17 ............................................................ 360 / 769 (47%)
28-Dec-2018 08:42:21 ............................................................ 420 / 769 (55%)
28-Dec-2018 08:42:26 ............................................................ 480 / 769 (62%)
28-Dec-2018 08:42:30 ............................................................ 540 / 769 (70%)
28-Dec-2018 08:42:34 ............................................................ 600 / 769 (78%)
28-Dec-2018 08:42:41 ...........................................................E 660 / 769 (86%)
28-Dec-2018 08:42:46 EE.......................................................... 720 / 769 (94%)
28-Dec-2018 08:42:47 .................................................
28-Dec-2018 08:42:47
28-Dec-2018 08:42:47
28-Dec-2018 08:42:47 FILE: /data/phpBB/phpbb/privatemessage/compose.php
28-Dec-2018 08:42:47 ----------------------------------------------------------------------
28-Dec-2018 08:42:47 FOUND 3 ERRORS AFFECTING 3 LINES
28-Dec-2018 08:42:47 ----------------------------------------------------------------------
28-Dec-2018 08:42:47 18 | ERROR | There must not be unused USE statements.
28-Dec-2018 08:42:47     |       | (phpbb.Namespaces.UnusedUse.Unused)
28-Dec-2018 08:42:47 22 | ERROR | There must not be unused USE statements.
28-Dec-2018 08:42:47     |       | (phpbb.Namespaces.UnusedUse.Unused)
28-Dec-2018 08:42:47 27 | ERROR | There must not be unused USE statements.
28-Dec-2018 08:42:47     |       | (phpbb.Namespaces.UnusedUse.Unused)
28-Dec-2018 08:42:47 ----------------------------------------------------------------------
28-Dec-2018 08:42:47
28-Dec-2018 08:42:47
28-Dec-2018 08:42:47 FILE: /data/phpBB/phpbb/privatemessage/view.php
28-Dec-2018 08:42:47 ----------------------------------------------------------------------
28-Dec-2018 08:42:47 FOUND 2 ERRORS AFFECTING 2 LINES
28-Dec-2018 08:42:47 ----------------------------------------------------------------------
28-Dec-2018 08:42:47 18 | ERROR | There must not be unused USE statements.
28-Dec-2018 08:42:47     |       | (phpbb.Namespaces.UnusedUse.Unused)
28-Dec-2018 08:42:47 21 | ERROR | There must not be unused USE statements.
28-Dec-2018 08:42:47     |       | (phpbb.Namespaces.UnusedUse.Unused)
28-Dec-2018 08:42:47 ----------------------------------------------------------------------
28-Dec-2018 08:42:47
28-Dec-2018 08:42:47
28-Dec-2018 08:42:47 FILE: /data/phpBB/phpbb/privatemessage/helper.php
28-Dec-2018 08:42:47 ----------------------------------------------------------------------
28-Dec-2018 08:42:47 FOUND 4 ERRORS AFFECTING 4 LINES
28-Dec-2018 08:42:47 ----------------------------------------------------------------------
28-Dec-2018 08:42:47 21 | ERROR | [x] Whitespace found at end of line
28-Dec-2018 08:42:47     |       |     (Squiz.WhiteSpace.SuperfluousWhitespace.EndLine)
28-Dec-2018 08:42:47 26 | ERROR | [x] Whitespace found at end of line
28-Dec-2018 08:42:47     |       |     (Squiz.WhiteSpace.SuperfluousWhitespace.EndLine)
28-Dec-2018 08:42:47 32 | ERROR | [x] Whitespace found at end of line
28-Dec-2018 08:42:47     |       |     (Squiz.WhiteSpace.SuperfluousWhitespace.EndLine)
28-Dec-2018 08:42:47 45 | ERROR | [x] Whitespace found at end of line
28-Dec-2018 08:42:47     |       |     (Squiz.WhiteSpace.SuperfluousWhitespace.EndLine)
28-Dec-2018 08:42:47 ----------------------------------------------------------------------
28-Dec-2018 08:42:47 PHPCBF CAN FIX THE 4 MARKED SNIFF VIOLATIONS AUTOMATICALLY
28-Dec-2018 08:42:47 ----------------------------------------------------------------------
28-Dec-2018 08:42:47
28-Dec-2018 08:42:47 Time: 48.99 secs; Memory: 64Mb
28-Dec-2018 08:42:47
28-Dec-2018 08:42:55 ............................................................  60 / 208 (29%)
28-Dec-2018 08:43:14 ........E................................................... 120 / 208 (58%)
28-Dec-2018 08:43:27 ............................................................ 180 / 208 (87%)
28-Dec-2018 08:43:34 .................E..........
28-Dec-2018 08:43:34
28-Dec-2018 08:43:34
28-Dec-2018 08:43:34 FILE: /data/phpBB/includes/functions_privmsgs.php
28-Dec-2018 08:43:34 ----------------------------------------------------------------------
28-Dec-2018 08:43:34 FOUND 2 ERRORS AFFECTING 1 LINE
28-Dec-2018 08:43:34 ----------------------------------------------------------------------
28-Dec-2018 08:43:34 1560 | ERROR | [x] Expected 1 space between comma and argument
28-Dec-2018 08:43:34       |       |     "$sql_limit"; 0 found
28-Dec-2018 08:43:34       |       |     (Squiz.Functions.FunctionDeclarationArgumentSpacing.NoSpaceBeforeArg)
28-Dec-2018 08:43:34 1560 | ERROR | [x] Expected 1 space between comma and argument
28-Dec-2018 08:43:34       |       |     "$sql_start"; 0 found
28-Dec-2018 08:43:34       |       |     (Squiz.Functions.FunctionDeclarationArgumentSpacing.NoSpaceBeforeArg)
28-Dec-2018 08:43:34 ----------------------------------------------------------------------
28-Dec-2018 08:43:34 PHPCBF CAN FIX THE 2 MARKED SNIFF VIOLATIONS AUTOMATICALLY
28-Dec-2018 08:43:34 ----------------------------------------------------------------------
28-Dec-2018 08:43:34
28-Dec-2018 08:43:34
28-Dec-2018 08:43:34 FILE: /data/phpBB/includes/ucp/ucp_pm.php
28-Dec-2018 08:43:34 ----------------------------------------------------------------------
28-Dec-2018 08:43:34 FOUND 1 ERROR AFFECTING 1 LINE
28-Dec-2018 08:43:34 ----------------------------------------------------------------------
28-Dec-2018 08:43:34 52 | ERROR | [x] Functions must not contain multiple empty lines in a
28-Dec-2018 08:43:34     |       |     row; found 11 empty lines
28-Dec-2018 08:43:34     |       |     (Squiz.WhiteSpace.SuperfluousWhitespace.EmptyLines)
28-Dec-2018 08:43:34 ----------------------------------------------------------------------
28-Dec-2018 08:43:34 PHPCBF CAN FIX THE 1 MARKED SNIFF VIOLATIONS AUTOMATICALLY
28-Dec-2018 08:43:34 ----------------------------------------------------------------------
28-Dec-2018 08:43:34
28-Dec-2018 08:43:34 Time: 46.78 secs; Memory: 61Mb
28-Dec-2018 08:43:34
28-Dec-2018 08:43:34
28-Dec-2018 08:43:34
28-Dec-2018 08:43:34 Time: 20ms; Memory: 3.75Mb
28-Dec-2018 08:43:34
28-Dec-2018 08:43:34        [if] Error in IfTask
28-Dec-2018 08:43:34 Execution of target "sniff" failed for the following reason: /data/build/build.xml:109:6: /data/build/build.xml:115:9: PHP Code Sniffer failed.
28-Dec-2018 08:43:34
28-Dec-2018 08:43:34 BUILD FAILED
28-Dec-2018 08:43:34 /data/build/build.xml:109:6: /data/build/build.xml:115:9: PHP Code Sniffer failed.
28-Dec-2018 08:43:34 Total time: 2 minutes  36.13 seconds
28-Dec-2018 08:43:34
28-Dec-2018 08:43:35 Error occurred while running Task 'Run sniffs(11)' of type com.atlassian.bamboo.plugins.bamboo-docker-plugin:task.docker.cli.
28-Dec-2018 08:43:35 com.atlassian.bamboo.task.TaskException: Failed to execute task
28-Dec-2018 08:43:35         at com.atlassian.bamboo.plugins.docker.service.RunService.execute(RunService.java:75)
28-Dec-2018 08:43:35         at com.atlassian.bamboo.plugins.docker.tasks.cli.DockerCliTask.execute(DockerCliTask.java:70)
28-Dec-2018 08:43:35         at com.atlassian.bamboo.task.TaskExecutorImpl.lambda$executeTasks$3(TaskExecutorImpl.java:285)
28-Dec-2018 08:43:35         at com.atlassian.bamboo.task.TaskExecutorImpl.executeTaskWithPrePostActions(TaskExecutorImpl.java:224)
28-Dec-2018 08:43:35         at com.atlassian.bamboo.task.TaskExecutorImpl.executeTasks(TaskExecutorImpl.java:285)
28-Dec-2018 08:43:35         at com.atlassian.bamboo.task.TaskExecutorImpl.execute(TaskExecutorImpl.java:112)
28-Dec-2018 08:43:35         at com.atlassian.bamboo.build.pipeline.tasks.ExecuteBuildTask.call(ExecuteBuildTask.java:71)
28-Dec-2018 08:43:35         at com.atlassian.bamboo.v2.build.agent.DefaultBuildAgent.executeBuildPhase(DefaultBuildAgent.java:203)
28-Dec-2018 08:43:35         at com.atlassian.bamboo.v2.build.agent.DefaultBuildAgent.build(DefaultBuildAgent.java:175)
28-Dec-2018 08:43:35         at com.atlassian.bamboo.v2.build.agent.BuildAgentControllerImpl.lambda$waitAndPerformBuild$0(BuildAgentControllerImpl.java:122)
28-Dec-2018 08:43:35         at com.atlassian.bamboo.variable.CustomVariableContextImpl.withVariableSubstitutor(CustomVariableContextImpl.java:185)
28-Dec-2018 08:43:35         at com.atlassian.bamboo.v2.build.agent.BuildAgentControllerImpl.waitAndPerformBuild(BuildAgentControllerImpl.java:117)
28-Dec-2018 08:43:35         at com.atlassian.bamboo.v2.build.agent.DefaultBuildAgent$1.run(DefaultBuildAgent.java:126)
28-Dec-2018 08:43:35         at com.atlassian.bamboo.utils.BambooRunnables$1.run(BambooRunnables.java:48)
28-Dec-2018 08:43:35         at com.atlassian.bamboo.security.ImpersonationHelper.runWith(ImpersonationHelper.java:26)
28-Dec-2018 08:43:35         at com.atlassian.bamboo.security.ImpersonationHelper.runWithSystemAuthority(ImpersonationHelper.java:17)
28-Dec-2018 08:43:35         at com.atlassian.bamboo.security.ImpersonationHelper$1.run(ImpersonationHelper.java:41)
28-Dec-2018 08:43:35         at java.lang.Thread.run(Thread.java:748)
28-Dec-2018 08:43:35 Caused by: com.atlassian.bamboo.docker.DockerException: Error running Docker run command
28-Dec-2018 08:43:35         at com.atlassian.bamboo.docker.DockerContainerServiceImpl.run(DockerContainerServiceImpl.java:118)
28-Dec-2018 08:43:35         at sun.reflect.GeneratedMethodAccessor2070.invoke(Unknown Source)
28-Dec-2018 08:43:35         at sun.reflect.DelegatingMethodAccessorImpl.invoke(DelegatingMethodAccessorImpl.java:43)
28-Dec-2018 08:43:35         at java.lang.reflect.Method.invoke(Method.java:498)
28-Dec-2018 08:43:35         at com.atlassian.plugin.util.ContextClassLoaderSettingInvocationHandler.invoke(ContextClassLoaderSettingInvocationHandler.java:26)
28-Dec-2018 08:43:35         at com.sun.proxy.$Proxy401.run(Unknown Source)
28-Dec-2018 08:43:35         at sun.reflect.GeneratedMethodAccessor2070.invoke(Unknown Source)
28-Dec-2018 08:43:35         at sun.reflect.DelegatingMethodAccessorImpl.invoke(DelegatingMethodAccessorImpl.java:43)
28-Dec-2018 08:43:35         at java.lang.reflect.Method.invoke(Method.java:498)
28-Dec-2018 08:43:35         at org.springframework.aop.support.AopUtils.invokeJoinpointUsingReflection(AopUtils.java:302)
28-Dec-2018 08:43:35         at org.eclipse.gemini.blueprint.service.importer.support.internal.aop.ServiceInvoker.doInvoke(ServiceInvoker.java:56)
28-Dec-2018 08:43:35         at org.eclipse.gemini.blueprint.service.importer.support.internal.aop.ServiceInvoker.invoke(ServiceInvoker.java:60)
28-Dec-2018 08:43:35         at org.springframework.aop.framework.ReflectiveMethodInvocation.proceed(ReflectiveMethodInvocation.java:179)
28-Dec-2018 08:43:35         at org.springframework.aop.support.DelegatingIntroductionInterceptor.doProceed(DelegatingIntroductionInterceptor.java:133)
28-Dec-2018 08:43:35         at org.springframework.aop.support.DelegatingIntroductionInterceptor.invoke(DelegatingIntroductionInterceptor.java:121)
28-Dec-2018 08:43:35         at org.springframework.aop.framework.ReflectiveMethodInvocation.proceed(ReflectiveMethodInvocation.java:179)
28-Dec-2018 08:43:35         at org.eclipse.gemini.blueprint.service.util.internal.aop.ServiceTCCLInterceptor.invokeUnprivileged(ServiceTCCLInterceptor.java:70)
28-Dec-2018 08:43:35         at org.eclipse.gemini.blueprint.service.util.internal.aop.ServiceTCCLInterceptor.invoke(ServiceTCCLInterceptor.java:53)
28-Dec-2018 08:43:35         at org.springframework.aop.framework.ReflectiveMethodInvocation.proceed(ReflectiveMethodInvocation.java:179)
28-Dec-2018 08:43:35         at org.eclipse.gemini.blueprint.service.importer.support.LocalBundleContextAdvice.invoke(LocalBundleContextAdvice.java:57)
28-Dec-2018 08:43:35         at org.springframework.aop.framework.ReflectiveMethodInvocation.proceed(ReflectiveMethodInvocation.java:179)
28-Dec-2018 08:43:35         at org.springframework.aop.support.DelegatingIntroductionInterceptor.doProceed(DelegatingIntroductionInterceptor.java:133)
28-Dec-2018 08:43:35         at org.springframework.aop.support.DelegatingIntroductionInterceptor.invoke(DelegatingIntroductionInterceptor.java:121)
28-Dec-2018 08:43:35         at org.springframework.aop.framework.ReflectiveMethodInvocation.proceed(ReflectiveMethodInvocation.java:179)
28-Dec-2018 08:43:35         at org.springframework.aop.framework.JdkDynamicAopProxy.invoke(JdkDynamicAopProxy.java:207)
28-Dec-2018 08:43:35         at com.sun.proxy.$Proxy667.run(Unknown Source)
28-Dec-2018 08:43:35         at com.atlassian.bamboo.plugins.docker.client.DockerCmd.run(DockerCmd.java:51)
28-Dec-2018 08:43:35         at com.atlassian.bamboo.plugins.docker.service.RunService.execute(RunService.java:64)
28-Dec-2018 08:43:35         ... 17 more
28-Dec-2018 08:43:35 Caused by: com.atlassian.utils.process.ProcessException: Error executing /usr/bin/docker run --volume /home/bamboo/xml-data/build-dir/PHPBB3-PR-JOB1:/data --workdir /data/build --rm -u=991 phpbb:php-5.6 ../phpBB/vendor/bin/phing sniff
28-Dec-2018 08:43:35         at com.atlassian.bamboo.docker.DockerContainerServiceImpl.execute(DockerContainerServiceImpl.java:252)
28-Dec-2018 08:43:35         at com.atlassian.bamboo.docker.DockerContainerServiceImpl.run(DockerContainerServiceImpl.java:106)
28-Dec-2018 08:43:35         ... 44 more
28-Dec-2018 08:43:35 Starting task 'Parsing test results produced by script' of type 'com.atlassian.bamboo.plugins.testresultparser:task.testresultparser.junit'
28-Dec-2018 08:43:35 Parsing test results under /home/bamboo/xml-data/build-dir/PHPBB3-PR-JOB1...
28-Dec-2018 08:43:35 Failing task since test cases were expected but none were found.
28-Dec-2018 08:43:35 Finished task 'Parsing test results produced by script' with result: Failed
28-Dec-2018 08:43:35
Substituting variable: ${bamboo.PRnumber} with 5351
28-Dec-2018 08:43:35
Substituting variable: ${bamboo.buildResultsUrl} with https://bamboo.phpbb.com/browse/PHPBB3-PR-JOB1-9084
28-Dec-2018 08:43:35
Substituting variable: ${bamboo.buildResultsUrl} with https://bamboo.phpbb.com/browse/PHPBB3-PR-JOB1-9084
28-Dec-2018 08:43:35 Starting task 'Set result build status' of type 'com.atlassian.bamboo.plugins.scripttask:task.builder.script'
28-Dec-2018 08:43:35
Beginning to execute external process for build 'phpBB3 - Pull Requests - Build and Test Job #9084 (PHPBB3-PR-JOB1-9084)'
... running command line:
/bin/sh /home/bamboo/temp/PHPBB3-PR-JOB1-9084-ScriptBuildTask-4037806454071160211.sh
... in: /home/bamboo/xml-data/build-dir/PHPBB3-PR-JOB1
... using extra environment variables:
bamboo_planRepository_1_branch=3.1.x
bamboo_planRepository_1_branchDisplayName=3.1.x
bamboo_repository_revision_number=dc8ff9da28b8ab4ad11c7ea94cca526f17c87fe5
bamboo_PRref=master
bamboo_resultsUrl=https://bamboo.phpbb.com/browse/PHPBB3-PR-JOB1-9084
bamboo_capability_system_builder_command_Git=/usr/bin/git
bamboo_repository_75956235_git_username=bantu
bamboo_build_working_directory=/home/bamboo/xml-data/build-dir/PHPBB3-PR-JOB1
bamboo_planRepository_1_name=phpBB Ascraeus
bamboo_buildKey=PHPBB3-PR-JOB1
bamboo_capability_phpbb_tests=true
bamboo_shortPlanName=Pull Requests
bamboo_capability_system_builder_command_fop=/usr/bin/fop
bamboo_capability_dbms_sqlite_2=true
bamboo_planRepository_name=phpBB Ascraeus
bamboo_PRnumber=5351
bamboo_buildNumber=9084
bamboo_repository_75956235_git_repositoryUrl=https://github.com/phpbb/phpbb.git
bamboo_capability_system_builder_phpunit_PHPUnit=/usr/bin/phpunit
bamboo_shortJobName=Build and Test Job
bamboo_buildResultsUrl=https://bamboo.phpbb.com/browse/PHPBB3-PR-JOB1-9084
bamboo_repository_75956235_branch_name=3.1.x
bamboo_planRepository_repositoryUrl=https://github.com/phpbb/phpbb.git
bamboo_agentId=131073
bamboo_planName=phpBB3 - Pull Requests
bamboo_build_commandline_com_atlassian_bamboo_plugins_scripttask_task_builder_script_7=/bin/sh /home/bamboo/temp/PHPBB3-PR-JOB1-9084-ScriptBuildTask-8011772890481661190.sh
bamboo_shortPlanKey=PR
bamboo_shortJobKey=JOB1
bamboo_capability_dbms_mysql_55=true
bamboo_capability_system_jdk_JDK_1_7_0_65=/usr/lib/jvm/java-7-openjdk-amd64
bamboo_planRepository_revision=dc8ff9da28b8ab4ad11c7ea94cca526f17c87fe5
bamboo_buildTimeStamp=2018-12-28T08:40:35.253Z
bamboo_repository_previous_revision_number=dc8ff9da28b8ab4ad11c7ea94cca526f17c87fe5
bamboo_capability_system_jdk_JDK_1_6_0_16=/usr/lib/jvm/java-6-sun-1.6.0.16
bamboo_capability_system_builder_mvn2_Maven_2=/usr/share/maven2
bamboo_planRepository_previousRevision=dc8ff9da28b8ab4ad11c7ea94cca526f17c87fe5
bamboo_build_commandline_com_atlassian_bamboo_plugins_scripttask_task_builder_script_4=/bin/sh /home/bamboo/temp/PHPBB3-PR-JOB1-9084-ScriptBuildTask-6548244205878743175.sh
bamboo_repository_git_branch=3.1.x
bamboo_buildResultKey=PHPBB3-PR-JOB1-9084
bamboo_repository_branch_name=3.1.x
bamboo_buildPlanName=phpBB3 - Pull Requests - Build and Test Job
bamboo_planRepository_1_revision=dc8ff9da28b8ab4ad11c7ea94cca526f17c87fe5
bamboo_repository_name=phpBB Ascraeus
bamboo_buildFailed=true
bamboo_capability_system_docker_executable=/usr/bin/docker
bamboo_build_commandline_com_atlassian_bamboo_plugins_bamboo_docker_plugin_task_docker_cli_11=/usr/bin/docker run --volume /home/bamboo/xml-data/build-dir/PHPBB3-PR-JOB1:/data --workdir /data/build --rm -u=991 phpbb:php-5.6 ../phpBB/vendor/bin/phing sniff
bamboo_build_commandline_com_atlassian_bamboo_plugins_bamboo_docker_plugin_task_docker_cli_12=/usr/bin/docker run --volume /home/bamboo/xml-data/build-dir/PHPBB3-PR-JOB1:/data --workdir /data/phpBB --rm -e HOME=/home/bamboo -u=991 phpbb:php-5.6 /bin/bash -c php ../composer.phar install --dev; cd ../build; ../phpBB/vendor/bin/phing clean prepare
bamboo_planRepository_branch=3.1.x
bamboo_agentWorkingDirectory=/home/bamboo/xml-data/build-dir
bamboo_jobFailed=true
bamboo_capability_system_git_executable=/usr/bin/git
bamboo_capability_system_builder_phpunit_PHPUnit_3_4=/usr/bin/phpunit
bamboo_repository_git_username=bantu
bamboo_planRepository_1_previousRevision=dc8ff9da28b8ab4ad11c7ea94cca526f17c87fe5
bamboo_repository_75956235_revision_number=dc8ff9da28b8ab4ad11c7ea94cca526f17c87fe5
bamboo_planRepository_branchDisplayName=3.1.x
bamboo_planRepository_1_type=gitv2
bamboo_planRepository_branchName=3.1.x
bamboo_repository_75956235_previous_revision_number=dc8ff9da28b8ab4ad11c7ea94cca526f17c87fe5
bamboo_capability_system_jdk_JDK=/usr/lib/jvm/java-6-sun
bamboo_plan_storageTag=PHPBB3-PR
bamboo_hg_cache_directory=/home/bamboo/xml-data/build-dir/_hg-repositories-cache
bamboo_planRepository_1_username=bantu
bamboo_planRepository_type=gitv2
bamboo_git_cache_directory=/home/bamboo/xml-data/build-dir/_git-repositories-cache
bamboo_ManualBuildTriggerReason_userName=Build Robot
bamboo_repository_git_repositoryUrl=https://github.com/phpbb/phpbb.git
bamboo_repository_75956235_git_branch=3.1.x
bamboo_capability_system_builder_ant_Ant=/usr/share/ant
bamboo_repository_75956235_name=phpBB Ascraeus
bamboo_tmp_directory=/home/bamboo/temp
bamboo_working_directory=/home/bamboo/xml-data/build-dir/PHPBB3-PR-JOB1
bamboo_planKey=PHPBB3-PR
bamboo_capability_local=true
bamboo_planRepository_1_repositoryUrl=https://github.com/phpbb/phpbb.git
bamboo_planRepository_username=bantu
bamboo_capability_system_jdk_JDK_1_6=/usr/lib/jvm/java-6-sun
bamboo_capability_system_jdk_JDK_1_7=/usr/lib/jvm/java-7-openjdk-amd64
bamboo_planRepository_1_branchName=3.1.x
28-Dec-2018 08:43:36 From https://github.com/phpbb/phpbb
28-Dec-2018 08:43:36 * branch            refs/pull/5351/head -> FETCH_HEAD
28-Dec-2018 08:43:36 grep: build/logs/phpunit.xml: No such file or directory
28-Dec-2018 08:43:36 grep: build/logs/phpunit.xml: No such file or directory
28-Dec-2018 08:43:36   % Total    % Received % Xferd  Average Speed   Time    Time     Time  Current
28-Dec-2018 08:43:36                                  Dload  Upload   Total   Spent    Left  Speed
28-Dec-2018 08:43:36
28-Dec-2018 08:43:36   0     0    0     0    0     0      0      0 --:--:-- --:--:-- --:--:--     0
28-Dec-2018 08:43:36   0     0    0     0    0     0      0      0 --:--:-- --:--:-- --:--:--     0
28-Dec-2018 08:43:36 100   273  100    93  100   180    195    378 --:--:-- --:--:-- --:--:--   378
28-Dec-2018 08:43:36 Finished task 'Set result build status' with result: Success
28-Dec-2018 08:43:36 Running post build plugin 'NCover Results Collector'
28-Dec-2018 08:43:36 Running post build plugin 'Artifact Copier'
28-Dec-2018 08:43:36 Running post build plugin 'npm Cache Cleanup'
28-Dec-2018 08:43:36 Running post build plugin 'Clover Results Collector'
28-Dec-2018 08:43:36 Running post build plugin 'Docker Container Cleanup'
28-Dec-2018 08:43:37 Successfully removed working directory at '/home/bamboo/xml-data/build-dir/PHPBB3-PR-JOB1'
28-Dec-2018 08:43:37 Finalising the build...
28-Dec-2018 08:43:37 Stopping timer.
28-Dec-2018 08:43:37 Build PHPBB3-PR-JOB1-9084 completed.
28-Dec-2018 08:43:37 Running on server: post build plugin 'NCover Results Collector'
28-Dec-2018 08:43:37 Running on server: post build plugin 'Build Hanging Detection Configuration'
28-Dec-2018 08:43:37 Running on server: post build plugin 'Clover Delta Calculator'
28-Dec-2018 08:43:37 Running on server: post build plugin 'Maven Dependencies Postprocessor'
28-Dec-2018 08:43:37 All post build plugins have finished
28-Dec-2018 08:43:37 Generating build results summary...
28-Dec-2018 08:43:37 Saving build results to disk...
28-Dec-2018 08:43:37 Logging substituted variables...
28-Dec-2018 08:43:37 Indexing build results...
28-Dec-2018 08:43:37 Finished building PHPBB3-PR-JOB1-9084.
28-Dec-2018 08:43:37
Substituting variable: ${bamboo.PRnumber} with 5351