Tests pending pull requests

Build: #9157 failed

Job: Build and Test Job failed

Stages & jobs

  1. Build and Test

Build log

The build generated 406 lines of output. Download or view full build log

10-Jan-2019 14:05:19 Build phpBB3 - Pull Requests - Build and Test Job #9157 (PHPBB3-PR-JOB1-9157) started building on agent Default Agent
10-Jan-2019 14:05:19
10-Jan-2019 14:05:19 Build working directory is /home/bamboo/xml-data/build-dir/PHPBB3-PR-JOB1
10-Jan-2019 14:05:19 Executing build phpBB3 - Pull Requests - Build and Test Job #9157 (PHPBB3-PR-JOB1-9157)
10-Jan-2019 14:05:19 Starting task 'Checkout develop branch' of type 'com.atlassian.bamboo.plugins.vcs:task.vcs.checkout'
10-Jan-2019 14:05:19 Build always requires a clean checkout
10-Jan-2019 14:05:19 Cleaning build directory '/home/bamboo/xml-data/build-dir/PHPBB3-PR-JOB1'
10-Jan-2019 14:05:19 Checking out into /home/bamboo/xml-data/build-dir/PHPBB3-PR-JOB1
10-Jan-2019 14:05:19 Updating source code to revision: dc8ff9da28b8ab4ad11c7ea94cca526f17c87fe5
10-Jan-2019 14:05:19 Fetching 'refs/heads/3.1.x' from 'https://github.com/phpbb/phpbb.git'.
10-Jan-2019 14:05:20 Checking out revision dc8ff9da28b8ab4ad11c7ea94cca526f17c87fe5.
10-Jan-2019 14:05:20 Creating local git repository in '/home/bamboo/xml-data/build-dir/PHPBB3-PR-JOB1/.git'.
10-Jan-2019 14:05:20 Cloning into '/home/bamboo/xml-data/build-dir/PHPBB3-PR-JOB1'...
10-Jan-2019 14:05:20 done.
10-Jan-2019 14:05:23 Switched to a new branch '3.1.x'
10-Jan-2019 14:05:23 Branch 3.1.x set up to track remote branch 3.1.x from origin.
10-Jan-2019 14:05:23 Updated source code to revision: dc8ff9da28b8ab4ad11c7ea94cca526f17c87fe5
10-Jan-2019 14:05:23 Finished task 'Checkout develop branch' with result: Success
10-Jan-2019 14:05:23 Running pre-build action: VCS Version Collector
10-Jan-2019 14:05:23
Substituting variable: ${bamboo.PRnumber} with 5504
10-Jan-2019 14:05:23
Substituting variable: ${bamboo.buildResultsUrl} with https://bamboo.phpbb.com/browse/PHPBB3-PR-JOB1-9157
10-Jan-2019 14:05:23 Starting task 'Set pending build status' of type 'com.atlassian.bamboo.plugins.scripttask:task.builder.script'
10-Jan-2019 14:05:23
Beginning to execute external process for build 'phpBB3 - Pull Requests - Build and Test Job #9157 (PHPBB3-PR-JOB1-9157)'
... running command line:
/bin/sh /home/bamboo/temp/PHPBB3-PR-JOB1-9157-ScriptBuildTask-2744389045418328204.sh
... in: /home/bamboo/xml-data/build-dir/PHPBB3-PR-JOB1
... using extra environment variables:
bamboo_planRepository_1_branch=3.1.x
bamboo_planRepository_1_branchDisplayName=3.1.x
bamboo_repository_revision_number=dc8ff9da28b8ab4ad11c7ea94cca526f17c87fe5
bamboo_PRref=master
bamboo_resultsUrl=https://bamboo.phpbb.com/browse/PHPBB3-PR-JOB1-9157
bamboo_capability_system_builder_command_Git=/usr/bin/git
bamboo_repository_75956235_git_username=bantu
bamboo_build_working_directory=/home/bamboo/xml-data/build-dir/PHPBB3-PR-JOB1
bamboo_planRepository_1_name=phpBB Ascraeus
bamboo_buildKey=PHPBB3-PR-JOB1
bamboo_capability_phpbb_tests=true
bamboo_shortPlanName=Pull Requests
bamboo_capability_system_builder_command_fop=/usr/bin/fop
bamboo_capability_dbms_sqlite_2=true
bamboo_planRepository_name=phpBB Ascraeus
bamboo_PRnumber=5504
bamboo_buildNumber=9157
bamboo_repository_75956235_git_repositoryUrl=https://github.com/phpbb/phpbb.git
bamboo_capability_system_builder_phpunit_PHPUnit=/usr/bin/phpunit
bamboo_shortJobName=Build and Test Job
bamboo_buildResultsUrl=https://bamboo.phpbb.com/browse/PHPBB3-PR-JOB1-9157
bamboo_repository_75956235_branch_name=3.1.x
bamboo_planRepository_repositoryUrl=https://github.com/phpbb/phpbb.git
bamboo_agentId=131073
bamboo_planName=phpBB3 - Pull Requests
bamboo_shortPlanKey=PR
bamboo_shortJobKey=JOB1
bamboo_capability_dbms_mysql_55=true
bamboo_capability_system_jdk_JDK_1_7_0_65=/usr/lib/jvm/java-7-openjdk-amd64
bamboo_planRepository_revision=dc8ff9da28b8ab4ad11c7ea94cca526f17c87fe5
bamboo_buildTimeStamp=2019-01-10T14:05:18.937Z
bamboo_repository_previous_revision_number=dc8ff9da28b8ab4ad11c7ea94cca526f17c87fe5
bamboo_capability_system_jdk_JDK_1_6_0_16=/usr/lib/jvm/java-6-sun-1.6.0.16
bamboo_capability_system_builder_mvn2_Maven_2=/usr/share/maven2
bamboo_planRepository_previousRevision=dc8ff9da28b8ab4ad11c7ea94cca526f17c87fe5
bamboo_repository_git_branch=3.1.x
bamboo_buildResultKey=PHPBB3-PR-JOB1-9157
bamboo_repository_branch_name=3.1.x
bamboo_buildPlanName=phpBB3 - Pull Requests - Build and Test Job
bamboo_planRepository_1_revision=dc8ff9da28b8ab4ad11c7ea94cca526f17c87fe5
bamboo_repository_name=phpBB Ascraeus
bamboo_buildFailed=false
bamboo_capability_system_docker_executable=/usr/bin/docker
bamboo_planRepository_branch=3.1.x
bamboo_agentWorkingDirectory=/home/bamboo/xml-data/build-dir
bamboo_capability_system_git_executable=/usr/bin/git
bamboo_capability_system_builder_phpunit_PHPUnit_3_4=/usr/bin/phpunit
bamboo_repository_git_username=bantu
bamboo_planRepository_1_previousRevision=dc8ff9da28b8ab4ad11c7ea94cca526f17c87fe5
bamboo_repository_75956235_revision_number=dc8ff9da28b8ab4ad11c7ea94cca526f17c87fe5
bamboo_planRepository_branchDisplayName=3.1.x
bamboo_planRepository_1_type=gitv2
bamboo_planRepository_branchName=3.1.x
bamboo_repository_75956235_previous_revision_number=dc8ff9da28b8ab4ad11c7ea94cca526f17c87fe5
bamboo_capability_system_jdk_JDK=/usr/lib/jvm/java-6-sun
bamboo_plan_storageTag=PHPBB3-PR
bamboo_hg_cache_directory=/home/bamboo/xml-data/build-dir/_hg-repositories-cache
bamboo_planRepository_1_username=bantu
bamboo_planRepository_type=gitv2
bamboo_git_cache_directory=/home/bamboo/xml-data/build-dir/_git-repositories-cache
bamboo_ManualBuildTriggerReason_userName=Build Robot
bamboo_repository_git_repositoryUrl=https://github.com/phpbb/phpbb.git
bamboo_repository_75956235_git_branch=3.1.x
bamboo_capability_system_builder_ant_Ant=/usr/share/ant
bamboo_repository_75956235_name=phpBB Ascraeus
bamboo_tmp_directory=/home/bamboo/temp
bamboo_working_directory=/home/bamboo/xml-data/build-dir/PHPBB3-PR-JOB1
bamboo_planKey=PHPBB3-PR
bamboo_capability_local=true
bamboo_planRepository_1_repositoryUrl=https://github.com/phpbb/phpbb.git
bamboo_planRepository_username=bantu
bamboo_capability_system_jdk_JDK_1_6=/usr/lib/jvm/java-6-sun
bamboo_capability_system_jdk_JDK_1_7=/usr/lib/jvm/java-7-openjdk-amd64
bamboo_planRepository_1_branchName=3.1.x
10-Jan-2019 14:05:26 From https://github.com/phpbb/phpbb
10-Jan-2019 14:05:26 * branch            refs/pull/5504/head -> FETCH_HEAD
10-Jan-2019 14:05:26   % Total    % Received % Xferd  Average Speed   Time    Time     Time  Current
10-Jan-2019 14:05:26                                  Dload  Upload   Total   Spent    Left  Speed
10-Jan-2019 14:05:26
10-Jan-2019 14:05:27   0     0    0     0    0     0      0      0 --:--:-- --:--:-- --:--:--     0
10-Jan-2019 14:05:27   0     0    0     0    0     0      0      0 --:--:-- --:--:-- --:--:--     0
10-Jan-2019 14:05:27 100   275  100    93  100   182    141    276 --:--:-- --:--:-- --:--:--   276
10-Jan-2019 14:05:27 Finished task 'Set pending build status' with result: Success
10-Jan-2019 14:05:27
Substituting variable: ${bamboo.PRnumber} with 5504
10-Jan-2019 14:05:27 Starting task 'Fetch PR' of type 'com.atlassian.bamboo.plugins.scripttask:task.builder.script'
10-Jan-2019 14:05:27
Beginning to execute external process for build 'phpBB3 - Pull Requests - Build and Test Job #9157 (PHPBB3-PR-JOB1-9157)'
... running command line:
/bin/sh /home/bamboo/temp/PHPBB3-PR-JOB1-9157-ScriptBuildTask-8877758602309508470.sh
... in: /home/bamboo/xml-data/build-dir/PHPBB3-PR-JOB1
... using extra environment variables:
bamboo_planRepository_1_branch=3.1.x
bamboo_planRepository_1_branchDisplayName=3.1.x
bamboo_repository_revision_number=dc8ff9da28b8ab4ad11c7ea94cca526f17c87fe5
bamboo_PRref=master
bamboo_resultsUrl=https://bamboo.phpbb.com/browse/PHPBB3-PR-JOB1-9157
bamboo_capability_system_builder_command_Git=/usr/bin/git
bamboo_repository_75956235_git_username=bantu
bamboo_build_working_directory=/home/bamboo/xml-data/build-dir/PHPBB3-PR-JOB1
bamboo_planRepository_1_name=phpBB Ascraeus
bamboo_buildKey=PHPBB3-PR-JOB1
bamboo_capability_phpbb_tests=true
bamboo_shortPlanName=Pull Requests
bamboo_capability_system_builder_command_fop=/usr/bin/fop
bamboo_capability_dbms_sqlite_2=true
bamboo_planRepository_name=phpBB Ascraeus
bamboo_PRnumber=5504
bamboo_buildNumber=9157
bamboo_repository_75956235_git_repositoryUrl=https://github.com/phpbb/phpbb.git
bamboo_capability_system_builder_phpunit_PHPUnit=/usr/bin/phpunit
bamboo_shortJobName=Build and Test Job
bamboo_buildResultsUrl=https://bamboo.phpbb.com/browse/PHPBB3-PR-JOB1-9157
bamboo_repository_75956235_branch_name=3.1.x
bamboo_planRepository_repositoryUrl=https://github.com/phpbb/phpbb.git
bamboo_agentId=131073
bamboo_planName=phpBB3 - Pull Requests
bamboo_build_commandline_com_atlassian_bamboo_plugins_scripttask_task_builder_script_7=/bin/sh /home/bamboo/temp/PHPBB3-PR-JOB1-9157-ScriptBuildTask-2744389045418328204.sh
bamboo_shortPlanKey=PR
bamboo_shortJobKey=JOB1
bamboo_capability_dbms_mysql_55=true
bamboo_capability_system_jdk_JDK_1_7_0_65=/usr/lib/jvm/java-7-openjdk-amd64
bamboo_planRepository_revision=dc8ff9da28b8ab4ad11c7ea94cca526f17c87fe5
bamboo_buildTimeStamp=2019-01-10T14:05:18.937Z
bamboo_repository_previous_revision_number=dc8ff9da28b8ab4ad11c7ea94cca526f17c87fe5
bamboo_capability_system_jdk_JDK_1_6_0_16=/usr/lib/jvm/java-6-sun-1.6.0.16
bamboo_capability_system_builder_mvn2_Maven_2=/usr/share/maven2
bamboo_planRepository_previousRevision=dc8ff9da28b8ab4ad11c7ea94cca526f17c87fe5
bamboo_repository_git_branch=3.1.x
bamboo_buildResultKey=PHPBB3-PR-JOB1-9157
bamboo_repository_branch_name=3.1.x
bamboo_buildPlanName=phpBB3 - Pull Requests - Build and Test Job
bamboo_planRepository_1_revision=dc8ff9da28b8ab4ad11c7ea94cca526f17c87fe5
bamboo_repository_name=phpBB Ascraeus
bamboo_buildFailed=false
bamboo_capability_system_docker_executable=/usr/bin/docker
bamboo_planRepository_branch=3.1.x
bamboo_agentWorkingDirectory=/home/bamboo/xml-data/build-dir
bamboo_capability_system_git_executable=/usr/bin/git
bamboo_capability_system_builder_phpunit_PHPUnit_3_4=/usr/bin/phpunit
bamboo_repository_git_username=bantu
bamboo_planRepository_1_previousRevision=dc8ff9da28b8ab4ad11c7ea94cca526f17c87fe5
bamboo_repository_75956235_revision_number=dc8ff9da28b8ab4ad11c7ea94cca526f17c87fe5
bamboo_planRepository_branchDisplayName=3.1.x
bamboo_planRepository_1_type=gitv2
bamboo_planRepository_branchName=3.1.x
bamboo_repository_75956235_previous_revision_number=dc8ff9da28b8ab4ad11c7ea94cca526f17c87fe5
bamboo_capability_system_jdk_JDK=/usr/lib/jvm/java-6-sun
bamboo_plan_storageTag=PHPBB3-PR
bamboo_hg_cache_directory=/home/bamboo/xml-data/build-dir/_hg-repositories-cache
bamboo_planRepository_1_username=bantu
bamboo_planRepository_type=gitv2
bamboo_git_cache_directory=/home/bamboo/xml-data/build-dir/_git-repositories-cache
bamboo_ManualBuildTriggerReason_userName=Build Robot
bamboo_repository_git_repositoryUrl=https://github.com/phpbb/phpbb.git
bamboo_repository_75956235_git_branch=3.1.x
bamboo_capability_system_builder_ant_Ant=/usr/share/ant
bamboo_repository_75956235_name=phpBB Ascraeus
bamboo_tmp_directory=/home/bamboo/temp
bamboo_working_directory=/home/bamboo/xml-data/build-dir/PHPBB3-PR-JOB1
bamboo_planKey=PHPBB3-PR
bamboo_capability_local=true
bamboo_planRepository_1_repositoryUrl=https://github.com/phpbb/phpbb.git
bamboo_planRepository_username=bantu
bamboo_capability_system_jdk_JDK_1_6=/usr/lib/jvm/java-6-sun
bamboo_capability_system_jdk_JDK_1_7=/usr/lib/jvm/java-7-openjdk-amd64
bamboo_planRepository_1_branchName=3.1.x
10-Jan-2019 14:05:35 From https://github.com/phpbb/phpbb
10-Jan-2019 14:05:35 * branch            refs/pull/5504/merge -> FETCH_HEAD
10-Jan-2019 14:05:36 Note: checking out 'FETCH_HEAD'.
10-Jan-2019 14:05:36
10-Jan-2019 14:05:36 You are in 'detached HEAD' state. You can look around, make experimental
10-Jan-2019 14:05:36 changes and commit them, and you can discard any commits you make in this
10-Jan-2019 14:05:36 state without impacting any branches by performing another checkout.
10-Jan-2019 14:05:36
10-Jan-2019 14:05:36 If you want to create a new branch to retain commits you create, you may
10-Jan-2019 14:05:36 do so (now or later) by using -b with the checkout command again. Example:
10-Jan-2019 14:05:36
10-Jan-2019 14:05:36   git checkout -b new_branch_name
10-Jan-2019 14:05:36
10-Jan-2019 14:05:36 HEAD is now at 2a0ec45... Merge db6dc4e72258d6c8e208b1432037a3d2f5081bf6 into b8cc0c77a2a0eb67bf378ad90f0bb4bde44be5b9
10-Jan-2019 14:05:36 Finished task 'Fetch PR' with result: Success
10-Jan-2019 14:05:36 Skipping execution of task 'Prepare directory' as it is disabled
10-Jan-2019 14:05:36
Substituting variable: ${bamboo.working.directory} with /home/bamboo/xml-data/build-dir/PHPBB3-PR-JOB1
10-Jan-2019 14:05:36 Starting task 'Prepare directory' of type 'com.atlassian.bamboo.plugins.bamboo-docker-plugin:task.docker.cli'
10-Jan-2019 14:05:36 Running image name (phpbb:php-7.1)
10-Jan-2019 14:05:36
Beginning to execute external process for build 'phpBB3 - Pull Requests - Build and Test Job #9157 (PHPBB3-PR-JOB1-9157)'
... running command line:
/usr/bin/docker run --volume /home/bamboo/xml-data/build-dir/PHPBB3-PR-JOB1:/data --workdir /data/phpBB --rm -e HOME=/home/bamboo -u=991 phpbb:php-7.1 /bin/bash -c php ../composer.phar install --dev; cd ../build; ../phpBB/vendor/bin/phing clean prepare
... in: /home/bamboo/xml-data/build-dir/PHPBB3-PR-JOB1
... using extra environment variables:
bamboo_planRepository_1_branch=3.1.x
bamboo_planRepository_1_branchDisplayName=3.1.x
bamboo_repository_revision_number=dc8ff9da28b8ab4ad11c7ea94cca526f17c87fe5
bamboo_PRref=master
bamboo_resultsUrl=https://bamboo.phpbb.com/browse/PHPBB3-PR-JOB1-9157
bamboo_capability_system_builder_command_Git=/usr/bin/git
bamboo_repository_75956235_git_username=bantu
bamboo_build_working_directory=/home/bamboo/xml-data/build-dir/PHPBB3-PR-JOB1
bamboo_planRepository_1_name=phpBB Ascraeus
bamboo_buildKey=PHPBB3-PR-JOB1
bamboo_capability_phpbb_tests=true
bamboo_shortPlanName=Pull Requests
bamboo_capability_system_builder_command_fop=/usr/bin/fop
bamboo_capability_dbms_sqlite_2=true
bamboo_planRepository_name=phpBB Ascraeus
bamboo_PRnumber=5504
bamboo_buildNumber=9157
bamboo_repository_75956235_git_repositoryUrl=https://github.com/phpbb/phpbb.git
bamboo_capability_system_builder_phpunit_PHPUnit=/usr/bin/phpunit
bamboo_shortJobName=Build and Test Job
bamboo_buildResultsUrl=https://bamboo.phpbb.com/browse/PHPBB3-PR-JOB1-9157
bamboo_repository_75956235_branch_name=3.1.x
bamboo_planRepository_repositoryUrl=https://github.com/phpbb/phpbb.git
bamboo_agentId=131073
bamboo_planName=phpBB3 - Pull Requests
bamboo_build_commandline_com_atlassian_bamboo_plugins_scripttask_task_builder_script_7=/bin/sh /home/bamboo/temp/PHPBB3-PR-JOB1-9157-ScriptBuildTask-2744389045418328204.sh
bamboo_shortPlanKey=PR
bamboo_shortJobKey=JOB1
bamboo_capability_dbms_mysql_55=true
bamboo_capability_system_jdk_JDK_1_7_0_65=/usr/lib/jvm/java-7-openjdk-amd64
bamboo_planRepository_revision=dc8ff9da28b8ab4ad11c7ea94cca526f17c87fe5
bamboo_buildTimeStamp=2019-01-10T14:05:18.937Z
bamboo_repository_previous_revision_number=dc8ff9da28b8ab4ad11c7ea94cca526f17c87fe5
bamboo_capability_system_jdk_JDK_1_6_0_16=/usr/lib/jvm/java-6-sun-1.6.0.16
bamboo_capability_system_builder_mvn2_Maven_2=/usr/share/maven2
bamboo_planRepository_previousRevision=dc8ff9da28b8ab4ad11c7ea94cca526f17c87fe5
bamboo_build_commandline_com_atlassian_bamboo_plugins_scripttask_task_builder_script_4=/bin/sh /home/bamboo/temp/PHPBB3-PR-JOB1-9157-ScriptBuildTask-8877758602309508470.sh
bamboo_repository_git_branch=3.1.x
bamboo_buildResultKey=PHPBB3-PR-JOB1-9157
bamboo_repository_branch_name=3.1.x
bamboo_buildPlanName=phpBB3 - Pull Requests - Build and Test Job
bamboo_planRepository_1_revision=dc8ff9da28b8ab4ad11c7ea94cca526f17c87fe5
bamboo_repository_name=phpBB Ascraeus
bamboo_buildFailed=false
bamboo_capability_system_docker_executable=/usr/bin/docker
bamboo_planRepository_branch=3.1.x
bamboo_agentWorkingDirectory=/home/bamboo/xml-data/build-dir
bamboo_capability_system_git_executable=/usr/bin/git
bamboo_capability_system_builder_phpunit_PHPUnit_3_4=/usr/bin/phpunit
bamboo_repository_git_username=bantu
bamboo_planRepository_1_previousRevision=dc8ff9da28b8ab4ad11c7ea94cca526f17c87fe5
bamboo_repository_75956235_revision_number=dc8ff9da28b8ab4ad11c7ea94cca526f17c87fe5
bamboo_planRepository_branchDisplayName=3.1.x
bamboo_planRepository_1_type=gitv2
bamboo_planRepository_branchName=3.1.x
bamboo_repository_75956235_previous_revision_number=dc8ff9da28b8ab4ad11c7ea94cca526f17c87fe5
bamboo_capability_system_jdk_JDK=/usr/lib/jvm/java-6-sun
bamboo_plan_storageTag=PHPBB3-PR
bamboo_hg_cache_directory=/home/bamboo/xml-data/build-dir/_hg-repositories-cache
bamboo_planRepository_1_username=bantu
bamboo_planRepository_type=gitv2
bamboo_git_cache_directory=/home/bamboo/xml-data/build-dir/_git-repositories-cache
bamboo_ManualBuildTriggerReason_userName=Build Robot
bamboo_repository_git_repositoryUrl=https://github.com/phpbb/phpbb.git
bamboo_repository_75956235_git_branch=3.1.x
bamboo_capability_system_builder_ant_Ant=/usr/share/ant
bamboo_repository_75956235_name=phpBB Ascraeus
bamboo_tmp_directory=/home/bamboo/temp
bamboo_working_directory=/home/bamboo/xml-data/build-dir/PHPBB3-PR-JOB1
bamboo_planKey=PHPBB3-PR
bamboo_capability_local=true
bamboo_planRepository_1_repositoryUrl=https://github.com/phpbb/phpbb.git
bamboo_planRepository_username=bantu
bamboo_capability_system_jdk_JDK_1_6=/usr/lib/jvm/java-6-sun
bamboo_capability_system_jdk_JDK_1_7=/usr/lib/jvm/java-7-openjdk-amd64
bamboo_planRepository_1_branchName=3.1.x
10-Jan-2019 14:05:38 Cannot create cache directory /home/bamboo/.composer/cache/repo/https---repo.packagist.org/, or directory is not writable. Proceeding without cache
10-Jan-2019 14:05:38 Cannot create cache directory /home/bamboo/.composer/cache/files/, or directory is not writable. Proceeding without cache
10-Jan-2019 14:05:38 You are using the deprecated option "dev". Dev packages are installed by default now.
10-Jan-2019 14:05:38 Loading composer repositories with package information
10-Jan-2019 14:05:38 Installing dependencies (including require-dev) from lock file
10-Jan-2019 14:05:38 Package operations: 81 installs, 0 updates, 0 removals
10-Jan-2019 14:05:39   - Installing composer/installers (v1.6.0): Downloading (connecting...)Downloading (0%)           Downloading (5%)Downloading (35%)Downloading (65%)Downloading (70%)Downloading (75%)Downloading (80%)Downloading (100%)
10-Jan-2019 14:05:39   - Installing ocramius/package-versions (1.3.0): Downloading (connecting...)Downloading (0%)           Downloading (40%)Downloading (100%)
10-Jan-2019 14:05:40   - Installing bantu/ini-get-wrapper (v1.0.1): Downloading (connecting...)Downloading (100%)         
10-Jan-2019 14:05:41   - Installing symfony/process (v3.4.20): Downloading (connecting...)Downloading (0%)           Downloading (5%)Downloading (30%)Downloading (35%)Downloading (40%)Downloading (45%)Downloading (70%)Downloading (75%)Downloading (100%)
10-Jan-2019 14:05:42   - Installing symfony/finder (v3.4.20): Downloading (connecting...)Downloading (0%)           Downloading (5%)Downloading (50%)Downloading (55%)Downloading (60%)Downloading (65%)Downloading (90%)Downloading (95%)Downloading (100%)
10-Jan-2019 14:05:42   - Installing symfony/polyfill-ctype (v1.10.0): Downloading (connecting...)Downloading (0%)           Downloading (100%)
10-Jan-2019 14:05:43   - Installing symfony/filesystem (v3.4.20): Downloading (connecting...)Downloading (0%)           Downloading (5%)Downloading (95%)Downloading (100%)
10-Jan-2019 14:05:44   - Installing symfony/polyfill-mbstring (v1.10.0): Downloading (connecting...)Downloading (0%)           Downloading (30%)Downloading (65%)Downloading (100%)
10-Jan-2019 14:05:44   - Installing psr/log (1.1.0): Downloading (connecting...)Downloading (0%)           Downloading (65%)Downloading (90%)Downloading (100%)
10-Jan-2019 14:05:45   - Installing symfony/debug (v3.4.20): Downloading (connecting...)Downloading (0%)           Downloading (5%)Downloading (25%)Downloading (40%)Downloading (45%)Downloading (50%)Downloading (55%)Downloading (70%)Downloading (80%)Downloading (85%)Downloading (90%)Downloading (100%)
10-Jan-2019 14:05:46   - Installing symfony/console (v3.4.20): Downloading (connecting...)Downloading (0%)           Downloading (5%)Downloading (10%)Downloading (15%)Downloading (20%)Downloading (25%)Downloading (30%)Downloading (35%)Downloading (40%)Downloading (45%)Downloading (50%)Downloading (55%)Downloading (60%)Downloading (65%)Downloading (70%)Downloading (75%)Downloading (80%)Downloading (85%)Downloading (90%)Downloading (95%)Downloading (100%)
10-Jan-2019 14:05:47   - Installing seld/phar-utils (1.0.1): Downloading (connecting...)Downloading (0%)           Downloading (30%)Downloading (60%)Downloading (90%)Downloading (100%)
10-Jan-2019 14:05:48   - Installing seld/jsonlint (1.7.1): Downloading (connecting...)Downloading (0%)           Downloading (15%)Downloading (75%)Downloading (90%)Downloading (100%)
10-Jan-2019 14:05:48   - Installing justinrainbow/json-schema (5.2.7): Downloading (connecting...)Downloading (0%)           Downloading (20%)Downloading (25%)Downloading (30%)Downloading (35%)Downloading (50%)Downloading (55%)Downloading (70%)Downloading (75%)Downloading (95%)Downloading (100%)
10-Jan-2019 14:05:49   - Installing composer/xdebug-handler (1.3.1): Downloading (connecting...)Downloading (100%)         
10-Jan-2019 14:05:50   - Installing composer/spdx-licenses (1.5.0): Downloading (connecting...)Downloading (0%)           Downloading (10%)Downloading (95%)Downloading (100%)
10-Jan-2019 14:05:50   - Installing composer/semver (1.4.2): Downloading (connecting...)Downloading (0%)           Downloading (35%)Downloading (100%)
10-Jan-2019 14:05:51   - Installing composer/ca-bundle (1.1.3): Downloading (connecting...)Downloading (0%)           Downloading (5%)Downloading (10%)Downloading (15%)Downloading (20%)Downloading (25%)Downloading (35%)Downloading (40%)Downloading (45%)Downloading (50%)Downloading (55%)Downloading (60%)Downloading (65%)Downloading (70%)Downloading (75%)Downloading (85%)Downloading (90%)Downloading (100%)
10-Jan-2019 14:05:53   - Installing composer/composer (1.8.0): Downloading (connecting...)Downloading (0%)           Downloading (5%)Downloading (10%)Downloading (15%)Downloading (20%)Downloading (25%)Downloading (30%)Downloading (35%)Downloading (40%)Downloading (45%)Downloading (50%)Downloading (55%)Downloading (60%)Downloading (65%)Downloading (70%)Downloading (75%)Downloading (80%)Downloading (85%)Downloading (90%)Downloading (95%)Downloading (100%)
10-Jan-2019 14:05:54   - Installing google/recaptcha (1.2.1): Downloading (connecting...)Downloading (0%)           Downloading (5%)Downloading (10%)Downloading (15%)Downloading (20%)Downloading (85%)Downloading (90%)Downloading (95%)Downloading (100%)
10-Jan-2019 14:05:54   - Installing guzzlehttp/promises (v1.3.1): Downloading (connecting...)Downloading (0%)           Downloading (30%)Downloading (60%)Downloading (85%)Downloading (100%)
10-Jan-2019 14:05:55   - Installing ralouphie/getallheaders (2.0.5): Downloading (connecting...)Downloading (0%)           Downloading (55%)Downloading (100%)
10-Jan-2019 14:05:55   - Installing psr/http-message (1.0.1): Downloading (connecting...)Downloading (0%)           Downloading (65%)Downloading (100%)
10-Jan-2019 14:05:56   - Installing guzzlehttp/psr7 (1.5.2): Downloading (connecting...)Downloading (0%)           Downloading (5%)Downloading (10%)Downloading (15%)Downloading (50%)Downloading (55%)Downloading (60%)Downloading (100%)
10-Jan-2019 14:05:57   - Installing lusitanian/oauth (v0.8.11): Downloading (connecting...)Downloading (0%)           Downloading (5%)Downloading (10%)Downloading (15%)Downloading (25%)Downloading (30%)Downloading (40%)Downloading (45%)Downloading (50%)Downloading (55%)Downloading (60%)Downloading (65%)Downloading (70%)Downloading (75%)Downloading (80%)Downloading (85%)Downloading (95%)Downloading (100%)
10-Jan-2019 14:05:57   - Installing marc1706/fast-image-size (v1.1.4): Downloading (connecting...)Downloading (0%)           Downloading (45%)Downloading (95%)Downloading (100%)
10-Jan-2019 14:05:58   - Installing patchwork/utf8 (v1.3.1): Downloading (connecting...)Downloading (100%)         
10-Jan-2019 14:05:59   - Installing psr/container (1.0.0): Downloading (connecting...)Downloading (0%)           Downloading (75%)Downloading (100%)
10-Jan-2019 14:06:01   - Installing s9e/text-formatter (1.3.2): Downloading (connecting...)Downloading (100%)         
10-Jan-2019 14:06:02   - Installing symfony/config (v3.4.20): Downloading (connecting...)Downloading (100%)         
10-Jan-2019 14:06:02   - Installing paragonie/random_compat (v1.4.3): Downloading (connecting...)Downloading (0%)           Downloading (10%)Downloading (30%)Downloading (65%)Downloading (70%)Downloading (80%)Downloading (90%)Downloading (100%)
10-Jan-2019 14:06:03   - Installing symfony/polyfill-php70 (v1.10.0): Downloading (connecting...)Downloading (0%)           Downloading (85%)Downloading (100%)
10-Jan-2019 14:06:04   - Installing symfony/http-foundation (v3.4.20): Downloading (connecting...)Downloading (100%)         
10-Jan-2019 14:06:04   - Installing symfony/event-dispatcher (v3.4.20): Downloading (connecting...)Downloading (0%)           Downloading (5%)Downloading (45%)Downloading (50%)Downloading (65%)Downloading (70%)Downloading (100%)
10-Jan-2019 14:06:05   - Installing symfony/http-kernel (v3.4.20): Downloading (connecting...)Downloading (0%)           Downloading (5%)Downloading (10%)Downloading (15%)Downloading (20%)Downloading (25%)Downloading (30%)Downloading (35%)Downloading (40%)Downloading (45%)Downloading (50%)Downloading (55%)Downloading (60%)Downloading (65%)Downloading (70%)Downloading (75%)Downloading (80%)Downloading (85%)Downloading (90%)Downloading (95%)Downloading (100%)
10-Jan-2019 14:06:06   - Installing symfony/dependency-injection (v3.4.20): Downloading (connecting...)Downloading (100%)         
10-Jan-2019 14:06:07   - Installing zendframework/zend-eventmanager (3.2.1): Downloading (connecting...)Downloading (0%)           Downloading (15%)Downloading (20%)Downloading (35%)Downloading (45%)Downloading (70%)Downloading (85%)Downloading (90%)Downloading (100%)
10-Jan-2019 14:06:08   - Installing zendframework/zend-code (3.3.1): Downloading (connecting...)Downloading (0%)           Downloading (5%)Downloading (10%)Downloading (15%)Downloading (20%)Downloading (25%)Downloading (30%)Downloading (35%)Downloading (40%)Downloading (45%)Downloading (50%)Downloading (55%)Downloading (60%)Downloading (65%)Downloading (70%)Downloading (75%)Downloading (80%)Downloading (85%)Downloading (90%)Downloading (95%)Downloading (100%)
10-Jan-2019 14:06:09   - Installing ocramius/proxy-manager (2.1.1): Downloading (connecting...)Downloading (100%)         
10-Jan-2019 14:06:09   - Installing symfony/proxy-manager-bridge (v3.4.20): Downloading (connecting...)Downloading (100%)         
10-Jan-2019 14:06:10   - Installing symfony/routing (v3.4.20): Downloading (connecting...)Downloading (0%)           Downloading (5%)Downloading (10%)Downloading (15%)Downloading (20%)Downloading (25%)Downloading (30%)Downloading (35%)Downloading (40%)Downloading (45%)Downloading (50%)Downloading (55%)Downloading (60%)Downloading (65%)Downloading (70%)Downloading (75%)Downloading (80%)Downloading (85%)Downloading (90%)Downloading (95%)Downloading (100%)
10-Jan-2019 14:06:11   - Installing twig/twig (v2.6.0): Downloading (connecting...)Downloading (0%)           Downloading (5%)Downloading (10%)Downloading (15%)Downloading (20%)Downloading (25%)Downloading (30%)Downloading (35%)Downloading (40%)Downloading (45%)Downloading (50%)Downloading (55%)Downloading (60%)Downloading (65%)Downloading (70%)Downloading (75%)Downloading (80%)Downloading (85%)Downloading (90%)Downloading (95%)Downloading (100%)
10-Jan-2019 14:06:12   - Installing symfony/twig-bridge (v3.4.20): Downloading (connecting...)Downloading (0%)           Downloading (5%)Downloading (10%)Downloading (15%)Downloading (20%)Downloading (30%)Downloading (35%)Downloading (40%)Downloading (45%)Downloading (50%)Downloading (55%)Downloading (60%)Downloading (65%)Downloading (70%)Downloading (75%)Downloading (80%)Downloading (90%)Downloading (95%)Downloading (100%)
10-Jan-2019 14:06:13   - Installing symfony/dom-crawler (v3.4.20): Downloading (connecting...)Downloading (0%)           Downloading (5%)Downloading (25%)Downloading (30%)Downloading (35%)Downloading (60%)Downloading (65%)Downloading (85%)Downloading (90%)Downloading (100%)
10-Jan-2019 14:06:13   - Installing symfony/css-selector (v3.4.20): Downloading (connecting...)Downloading (100%)         
10-Jan-2019 14:06:14   - Installing symfony/browser-kit (v3.4.20): Downloading (connecting...)Downloading (0%)           Downloading (5%)Downloading (70%)Downloading (100%)
10-Jan-2019 14:06:15   - Installing guzzlehttp/guzzle (6.3.3): Downloading (connecting...)Downloading (0%)           Downloading (5%)Downloading (15%)Downloading (20%)Downloading (30%)Downloading (40%)Downloading (45%)Downloading (55%)Downloading (60%)Downloading (65%)Downloading (75%)Downloading (80%)Downloading (90%)Downloading (95%)Downloading (100%)
10-Jan-2019 14:06:15   - Installing fabpot/goutte (v3.2.3): Downloading (connecting...)Downloading (0%)           Downloading (40%)Downloading (100%)
10-Jan-2019 14:06:17   - Installing facebook/webdriver (1.6.0): Downloading (connecting...)Downloading (0%)           Downloading (5%)Downloading (10%)Downloading (15%)Downloading (20%)Downloading (25%)Downloading (30%)Downloading (35%)Downloading (40%)Downloading (45%)Downloading (50%)Downloading (55%)Downloading (60%)Downloading (65%)Downloading (70%)Downloading (75%)Downloading (80%)Downloading (85%)Downloading (90%)Downloading (95%)Downloading (100%)
10-Jan-2019 14:06:17   - Installing symfony/yaml (v3.4.20): Downloading (connecting...)Downloading (0%)           Downloading (5%)Downloading (10%)Downloading (15%)Downloading (20%)Downloading (50%)Downloading (55%)Downloading (60%)Downloading (95%)Downloading (100%)
10-Jan-2019 14:06:18   - Installing laravel/homestead (v7.20.0): Downloading (connecting...)Downloading (100%)         
10-Jan-2019 14:06:22   - Installing phing/phing (2.16.1): Downloading (connecting...)Downloading (0%)           Downloading (5%)Downloading (10%)Downloading (15%)Downloading (20%)Downloading (25%)Downloading (30%)Downloading (35%)Downloading (40%)Downloading (45%)Downloading (50%)Downloading (55%)Downloading (60%)Downloading (65%)Downloading (70%)Downloading (75%)Downloading (80%)Downloading (85%)Downloading (90%)Downloading (95%)Downloading (100%)
10-Jan-2019 14:06:23   - Installing webmozart/assert (1.4.0): Downloading (connecting...)Downloading (0%)           Downloading (65%)Downloading (100%)
10-Jan-2019 14:06:23   - Installing phpdocumentor/reflection-common (1.0.1): Downloading (connecting...)Downloading (0%)           Downloading (100%)
10-Jan-2019 14:06:24   - Installing phpdocumentor/type-resolver (0.4.0): Downloading (connecting...)Downloading (0%)           Downloading (5%)Downloading (100%)
10-Jan-2019 14:06:25   - Installing phpdocumentor/reflection-docblock (4.3.0): Downloading (connecting...)Downloading (0%)           Downloading (5%)Downloading (10%)Downloading (15%)Downloading (20%)Downloading (25%)Downloading (30%)Downloading (70%)Downloading (75%)Downloading (80%)Downloading (85%)Downloading (90%)Downloading (95%)Downloading (100%)
10-Jan-2019 14:06:25   - Installing sebastian/version (2.0.1): Downloading (connecting...)Downloading (0%)           Downloading (100%)
10-Jan-2019 14:06:26   - Installing sebastian/resource-operations (2.0.1): Downloading (connecting...)Downloading (0%)           Downloading (25%)Downloading (55%)Downloading (100%)
10-Jan-2019 14:06:26   - Installing sebastian/recursion-context (3.0.0): Downloading (connecting...)Downloading (0%)           Downloading (35%)Downloading (70%)Downloading (100%)
10-Jan-2019 14:06:27   - Installing sebastian/object-reflector (1.1.1): Downloading (connecting...)Downloading (0%)           Downloading (65%)Downloading (85%)Downloading (100%)
10-Jan-2019 14:06:27   - Installing sebastian/object-enumerator (3.0.3): Downloading (connecting...)Downloading (0%)           Downloading (100%)
10-Jan-2019 14:06:28   - Installing sebastian/global-state (2.0.0): Downloading (connecting...)Downloading (0%)           Downloading (20%)Downloading (75%)Downloading (100%)
10-Jan-2019 14:06:28   - Installing sebastian/exporter (3.1.0): Downloading (connecting...)Downloading (0%)           Downloading (100%)
10-Jan-2019 14:06:29   - Installing sebastian/environment (4.0.1): Downloading (connecting...)Downloading (0%)           Downloading (100%)
10-Jan-2019 14:06:30   - Installing sebastian/diff (3.0.1): Downloading (connecting...)Downloading (0%)           Downloading (20%)Downloading (30%)Downloading (45%)Downloading (60%)Downloading (65%)Downloading (80%)Downloading (85%)Downloading (100%)
10-Jan-2019 14:06:30   - Installing sebastian/comparator (3.0.2): Downloading (connecting...)Downloading (0%)           Downloading (25%)Downloading (50%)Downloading (60%)Downloading (80%)Downloading (90%)Downloading (100%)
10-Jan-2019 14:06:30   - Installing phpunit/php-timer (2.0.0): Downloading (connecting...)Downloading (0%)           Downloading (70%)Downloading (100%)
10-Jan-2019 14:06:31   - Installing phpunit/php-text-template (1.2.1): Downloading (connecting...)Downloading (0%)           Downloading (35%)Downloading (100%)
10-Jan-2019 14:06:31   - Installing phpunit/php-file-iterator (2.0.2): Downloading (connecting...)Downloading (0%)           Downloading (35%)Downloading (70%)Downloading (100%)
10-Jan-2019 14:06:32   - Installing theseer/tokenizer (1.1.0): Downloading (connecting...)Downloading (0%)           Downloading (15%)Downloading (70%)Downloading (85%)Downloading (100%)
10-Jan-2019 14:06:33   - Installing sebastian/code-unit-reverse-lookup (1.0.1): Downloading (connecting...)Downloading (0%)           Downloading (55%)Downloading (100%)
10-Jan-2019 14:06:33   - Installing phpunit/php-token-stream (3.0.1): Downloading (connecting...)Downloading (0%)           Downloading (5%)Downloading (35%)Downloading (40%)Downloading (45%)Downloading (50%)Downloading (100%)
10-Jan-2019 14:06:35   - Installing phpunit/php-code-coverage (6.1.4): Downloading (connecting...)Downloading (0%)           Downloading (5%)Downloading (10%)Downloading (15%)Downloading (20%)Downloading (25%)Downloading (30%)Downloading (35%)Downloading (40%)Downloading (45%)Downloading (50%)Downloading (55%)Downloading (60%)Downloading (65%)Downloading (70%)Downloading (75%)Downloading (80%)Downloading (85%)Downloading (90%)Downloading (95%)Downloading (100%)
10-Jan-2019 14:06:35   - Installing doctrine/instantiator (1.1.0): Downloading (connecting...)Downloading (0%)           Downloading (25%)Downloading (50%)Downloading (95%)Downloading (100%)
10-Jan-2019 14:06:36   - Installing phpspec/prophecy (1.8.0): Downloading (connecting...)Downloading (0%)           Downloading (10%)Downloading (20%)Downloading (35%)Downloading (45%)Downloading (55%)Downloading (60%)Downloading (65%)Downloading (70%)Downloading (80%)Downloading (90%)Downloading (100%)
10-Jan-2019 14:06:36   - Installing phar-io/version (2.0.1): Downloading (connecting...)Downloading (0%)           Downloading (5%)Downloading (10%)Downloading (85%)Downloading (90%)Downloading (95%)Downloading (100%)
10-Jan-2019 14:06:37   - Installing phar-io/manifest (1.0.3): Downloading (connecting...)Downloading (0%)           Downloading (10%)Downloading (15%)Downloading (25%)Downloading (30%)Downloading (35%)Downloading (45%)Downloading (50%)Downloading (65%)Downloading (75%)Downloading (85%)Downloading (95%)Downloading (100%)
10-Jan-2019 14:06:38   - Installing myclabs/deep-copy (1.8.1): Downloading (connecting...)Downloading (0%)           Downloading (15%)Downloading (20%)Downloading (35%)Downloading (40%)Downloading (45%)Downloading (50%)Downloading (65%)Downloading (80%)Downloading (85%)Downloading (100%)
10-Jan-2019 14:06:41   - Installing phpunit/phpunit (7.5.1): Downloading (connecting...)Downloading (0%)           Downloading (5%)Downloading (10%)Downloading (15%)Downloading (20%)Downloading (25%)Downloading (30%)Downloading (35%)Downloading (40%)Downloading (45%)Downloading (50%)Downloading (55%)Downloading (60%)Downloading (65%)Downloading (70%)Downloading (80%)Downloading (85%)Downloading (90%)Downloading (95%)Downloading (100%)
10-Jan-2019 14:06:42   - Installing phpunit/dbunit (4.0.0): Downloading (connecting...)Downloading (0%)           Downloading (10%)Downloading (15%)Downloading (20%)Downloading (25%)Downloading (35%)Downloading (40%)Downloading (45%)Downloading (50%)Downloading (55%)Downloading (60%)Downloading (65%)Downloading (75%)Downloading (80%)Downloading (85%)Downloading (90%)Downloading (95%)Downloading (100%)
10-Jan-2019 14:06:43   - Installing squizlabs/php_codesniffer (3.4.0): Downloading (connecting...)Downloading (0%)           Downloading (5%)Downloading (10%)Downloading (15%)Downloading (20%)Downloading (25%)Downloading (30%)Downloading (35%)Downloading (40%)Downloading (45%)Downloading (50%)Downloading (55%)Downloading (60%)Downloading (65%)Downloading (70%)Downloading (75%)Downloading (80%)Downloading (85%)Downloading (90%)Downloading (95%)Downloading (100%)
10-Jan-2019 14:06:44 symfony/console suggests installing symfony/lock
10-Jan-2019 14:06:44 lusitanian/oauth suggests installing predis/predis (Allows using the Redis storage backend.)
10-Jan-2019 14:06:44 patchwork/utf8 suggests installing ext-intl (Use Intl for best performance)
10-Jan-2019 14:06:44 patchwork/utf8 suggests installing ext-wfio (Use WFIO for UTF-8 filesystem access on Windows)
10-Jan-2019 14:06:44 s9e/text-formatter suggests installing ext-intl (Allows international URLs to be accepted by the URL filter)
10-Jan-2019 14:06:44 s9e/text-formatter suggests installing ext-xsl (Enables the XSLT renderer)
10-Jan-2019 14:06:44 paragonie/random_compat suggests installing ext-libsodium (Provides a modern crypto API that can be used to generate random bytes.)
10-Jan-2019 14:06:44 symfony/http-kernel suggests installing symfony/var-dumper
10-Jan-2019 14:06:44 symfony/dependency-injection suggests installing symfony/expression-language (For using expressions in service container configuration)
10-Jan-2019 14:06:44 zendframework/zend-eventmanager suggests installing container-interop/container-interop (^1.1.0, to use the lazy listeners feature)
10-Jan-2019 14:06:44 zendframework/zend-eventmanager suggests installing zendframework/zend-stdlib (^2.7.3 || ^3.0, to use the FilterChain feature)
10-Jan-2019 14:06:44 zendframework/zend-code suggests installing doctrine/annotations (Doctrine\Common\Annotations >=1.0 for annotation features)
10-Jan-2019 14:06:44 zendframework/zend-code suggests installing zendframework/zend-stdlib (Zend\Stdlib component)
10-Jan-2019 14:06:44 ocramius/proxy-manager suggests installing ocramius/generated-hydrator (To have very fast object to array to object conversion for ghost objects)
10-Jan-2019 14:06:44 ocramius/proxy-manager suggests installing zendframework/zend-json (To have the JsonRpc adapter (Remote Object feature))
10-Jan-2019 14:06:44 ocramius/proxy-manager suggests installing zendframework/zend-soap (To have the Soap adapter (Remote Object feature))
10-Jan-2019 14:06:44 ocramius/proxy-manager suggests installing zendframework/zend-xmlrpc (To have the XmlRpc adapter (Remote Object feature))
10-Jan-2019 14:06:44 symfony/routing suggests installing doctrine/annotations (For using the annotation loader)
10-Jan-2019 14:06:44 symfony/routing suggests installing symfony/expression-language (For using expression matching)
10-Jan-2019 14:06:44 symfony/twig-bridge suggests installing symfony/asset (For using the AssetExtension)
10-Jan-2019 14:06:44 symfony/twig-bridge suggests installing symfony/expression-language (For using the ExpressionExtension)
10-Jan-2019 14:06:44 symfony/twig-bridge suggests installing symfony/form (For using the FormExtension)
10-Jan-2019 14:06:44 symfony/twig-bridge suggests installing symfony/security (For using the SecurityExtension)
10-Jan-2019 14:06:44 symfony/twig-bridge suggests installing symfony/stopwatch (For using the StopwatchExtension)
10-Jan-2019 14:06:44 symfony/twig-bridge suggests installing symfony/templating (For using the TwigEngine)
10-Jan-2019 14:06:44 symfony/twig-bridge suggests installing symfony/translation (For using the TranslationExtension)
10-Jan-2019 14:06:44 symfony/twig-bridge suggests installing symfony/var-dumper (For using the DumpExtension)
10-Jan-2019 14:06:44 symfony/twig-bridge suggests installing symfony/web-link (For using the WebLinkExtension)
10-Jan-2019 14:06:44 facebook/webdriver suggests installing ext-SimpleXML (For Firefox profile creation)
10-Jan-2019 14:06:44 phing/phing suggests installing pdepend/pdepend (PHP version of JDepend)
10-Jan-2019 14:06:44 phing/phing suggests installing pear/archive_tar (Tar file management class)
10-Jan-2019 14:06:44 phing/phing suggests installing pear/versioncontrol_git (A library that provides OO interface to handle Git repository)
10-Jan-2019 14:06:44 phing/phing suggests installing pear/versioncontrol_svn (A simple OO-style interface for Subversion, the free/open-source version control system)
10-Jan-2019 14:06:44 phing/phing suggests installing phpdocumentor/phpdocumentor (Documentation Generator for PHP)
10-Jan-2019 14:06:44 phing/phing suggests installing phploc/phploc (A tool for quickly measuring the size of a PHP project)
10-Jan-2019 14:06:44 phing/phing suggests installing phpmd/phpmd (PHP version of PMD tool)
10-Jan-2019 14:06:44 phing/phing suggests installing sebastian/phpcpd (Copy/Paste Detector (CPD) for PHP code)
10-Jan-2019 14:06:44 phing/phing suggests installing siad007/versioncontrol_hg (A library for interfacing with Mercurial repositories.)
10-Jan-2019 14:06:44 phing/phing suggests installing tedivm/jshrink (Javascript Minifier built in PHP)
10-Jan-2019 14:06:44 sebastian/global-state suggests installing ext-uopz (*)
10-Jan-2019 14:06:44 phpunit/phpunit suggests installing ext-soap (*)
10-Jan-2019 14:06:44 phpunit/phpunit suggests installing phpunit/php-invoker (^2.0)
10-Jan-2019 14:06:44 Package phpunit/dbunit is abandoned, you should avoid using it. No replacement was suggested.
10-Jan-2019 14:06:44 Generating autoload files
10-Jan-2019 14:06:44 ocramius/package-versions:  Generating version class...
10-Jan-2019 14:06:44 ocramius/package-versions: ...done generating version class
10-Jan-2019 14:06:44 Buildfile: /data/build/build.xml
10-Jan-2019 14:06:44
10-Jan-2019 14:06:44 phpBB > clean:
10-Jan-2019 14:06:44
10-Jan-2019 14:06:44    [delete] Directory /data/build/logs does not exist or is not a directory.
10-Jan-2019 14:06:44    [delete] Directory /data/build/api does not exist or is not a directory.
10-Jan-2019 14:06:44    [delete] Directory /data/build/codebrowser does not exist or is not a directory.
10-Jan-2019 14:06:44    [delete] Directory /data/build/coverage does not exist or is not a directory.
10-Jan-2019 14:06:44    [delete] Directory /data/build/cpd does not exist or is not a directory.
10-Jan-2019 14:06:44    [delete] Directory /data/build/dependencies does not exist or is not a directory.
10-Jan-2019 14:06:44    [delete] Directory /data/build/new_version does not exist or is not a directory.
10-Jan-2019 14:06:44    [delete] Directory /data/build/old_versions does not exist or is not a directory.
10-Jan-2019 14:06:44    [delete] Directory /data/build/save does not exist or is not a directory.
10-Jan-2019 14:06:44
10-Jan-2019 14:06:44 phpBB > prepare:
10-Jan-2019 14:06:44
10-Jan-2019 14:06:44     [mkdir] Created dir: /data/build/logs
10-Jan-2019 14:06:44     [mkdir] Created dir: /data/build/api
10-Jan-2019 14:06:44     [mkdir] Created dir: /data/build/codebrowser
10-Jan-2019 14:06:44     [mkdir] Created dir: /data/build/coverage
10-Jan-2019 14:06:44     [mkdir] Created dir: /data/build/cpd
10-Jan-2019 14:06:44     [mkdir] Created dir: /data/build/dependencies
10-Jan-2019 14:06:44     [mkdir] Created dir: /data/build/new_version
10-Jan-2019 14:06:44     [mkdir] Created dir: /data/build/new_version/files
10-Jan-2019 14:06:44     [mkdir] Created dir: /data/build/new_version/patches
10-Jan-2019 14:06:44     [mkdir] Created dir: /data/build/new_version/release_files
10-Jan-2019 14:06:44     [mkdir] Created dir: /data/build/new_version/update
10-Jan-2019 14:06:44     [mkdir] Created dir: /data/build/old_versions
10-Jan-2019 14:06:44     [mkdir] Created dir: /data/build/save
10-Jan-2019 14:06:44
10-Jan-2019 14:06:44 BUILD FINISHED
10-Jan-2019 14:06:44
10-Jan-2019 14:06:44 Total time: 0.0915 seconds
10-Jan-2019 14:06:44
10-Jan-2019 14:06:44 Finished task 'Prepare directory' with result: Success
10-Jan-2019 14:06:44 Skipping execution of task 'Run sniffs' as it is disabled
10-Jan-2019 14:06:44
Substituting variable: ${bamboo.working.directory} with /home/bamboo/xml-data/build-dir/PHPBB3-PR-JOB1
10-Jan-2019 14:06:44 Starting task 'Run sniffs' of type 'com.atlassian.bamboo.plugins.bamboo-docker-plugin:task.docker.cli'
10-Jan-2019 14:06:44 Running image name (phpbb:php-7.1)
10-Jan-2019 14:06:44
Beginning to execute external process for build 'phpBB3 - Pull Requests - Build and Test Job #9157 (PHPBB3-PR-JOB1-9157)'
... running command line:
/usr/bin/docker run --volume /home/bamboo/xml-data/build-dir/PHPBB3-PR-JOB1:/data --workdir /data/build --rm -u=991 phpbb:php-7.1 ../phpBB/vendor/bin/phing sniff
... in: /home/bamboo/xml-data/build-dir/PHPBB3-PR-JOB1
... using extra environment variables:
bamboo_planRepository_1_branch=3.1.x
bamboo_planRepository_1_branchDisplayName=3.1.x
bamboo_repository_revision_number=dc8ff9da28b8ab4ad11c7ea94cca526f17c87fe5
bamboo_PRref=master
bamboo_resultsUrl=https://bamboo.phpbb.com/browse/PHPBB3-PR-JOB1-9157
bamboo_capability_system_builder_command_Git=/usr/bin/git
bamboo_repository_75956235_git_username=bantu
bamboo_build_working_directory=/home/bamboo/xml-data/build-dir/PHPBB3-PR-JOB1
bamboo_planRepository_1_name=phpBB Ascraeus
bamboo_buildKey=PHPBB3-PR-JOB1
bamboo_capability_phpbb_tests=true
bamboo_shortPlanName=Pull Requests
bamboo_capability_system_builder_command_fop=/usr/bin/fop
bamboo_capability_dbms_sqlite_2=true
bamboo_planRepository_name=phpBB Ascraeus
bamboo_PRnumber=5504
bamboo_buildNumber=9157
bamboo_repository_75956235_git_repositoryUrl=https://github.com/phpbb/phpbb.git
bamboo_capability_system_builder_phpunit_PHPUnit=/usr/bin/phpunit
bamboo_shortJobName=Build and Test Job
bamboo_buildResultsUrl=https://bamboo.phpbb.com/browse/PHPBB3-PR-JOB1-9157
bamboo_repository_75956235_branch_name=3.1.x
bamboo_planRepository_repositoryUrl=https://github.com/phpbb/phpbb.git
bamboo_agentId=131073
bamboo_planName=phpBB3 - Pull Requests
bamboo_build_commandline_com_atlassian_bamboo_plugins_scripttask_task_builder_script_7=/bin/sh /home/bamboo/temp/PHPBB3-PR-JOB1-9157-ScriptBuildTask-2744389045418328204.sh
bamboo_shortPlanKey=PR
bamboo_shortJobKey=JOB1
bamboo_capability_dbms_mysql_55=true
bamboo_capability_system_jdk_JDK_1_7_0_65=/usr/lib/jvm/java-7-openjdk-amd64
bamboo_planRepository_revision=dc8ff9da28b8ab4ad11c7ea94cca526f17c87fe5
bamboo_buildTimeStamp=2019-01-10T14:05:18.937Z
bamboo_repository_previous_revision_number=dc8ff9da28b8ab4ad11c7ea94cca526f17c87fe5
bamboo_capability_system_jdk_JDK_1_6_0_16=/usr/lib/jvm/java-6-sun-1.6.0.16
bamboo_capability_system_builder_mvn2_Maven_2=/usr/share/maven2
bamboo_planRepository_previousRevision=dc8ff9da28b8ab4ad11c7ea94cca526f17c87fe5
bamboo_build_commandline_com_atlassian_bamboo_plugins_scripttask_task_builder_script_4=/bin/sh /home/bamboo/temp/PHPBB3-PR-JOB1-9157-ScriptBuildTask-8877758602309508470.sh
bamboo_repository_git_branch=3.1.x
bamboo_buildResultKey=PHPBB3-PR-JOB1-9157
bamboo_repository_branch_name=3.1.x
bamboo_buildPlanName=phpBB3 - Pull Requests - Build and Test Job
bamboo_planRepository_1_revision=dc8ff9da28b8ab4ad11c7ea94cca526f17c87fe5
bamboo_repository_name=phpBB Ascraeus
bamboo_buildFailed=false
bamboo_capability_system_docker_executable=/usr/bin/docker
bamboo_build_commandline_com_atlassian_bamboo_plugins_bamboo_docker_plugin_task_docker_cli_12=/usr/bin/docker run --volume /home/bamboo/xml-data/build-dir/PHPBB3-PR-JOB1:/data --workdir /data/phpBB --rm -e HOME=/home/bamboo -u=991 phpbb:php-7.1 /bin/bash -c php ../composer.phar install --dev; cd ../build; ../phpBB/vendor/bin/phing clean prepare
bamboo_planRepository_branch=3.1.x
bamboo_agentWorkingDirectory=/home/bamboo/xml-data/build-dir
bamboo_capability_system_git_executable=/usr/bin/git
bamboo_capability_system_builder_phpunit_PHPUnit_3_4=/usr/bin/phpunit
bamboo_repository_git_username=bantu
bamboo_planRepository_1_previousRevision=dc8ff9da28b8ab4ad11c7ea94cca526f17c87fe5
bamboo_repository_75956235_revision_number=dc8ff9da28b8ab4ad11c7ea94cca526f17c87fe5
bamboo_planRepository_branchDisplayName=3.1.x
bamboo_planRepository_1_type=gitv2
bamboo_planRepository_branchName=3.1.x
bamboo_repository_75956235_previous_revision_number=dc8ff9da28b8ab4ad11c7ea94cca526f17c87fe5
bamboo_capability_system_jdk_JDK=/usr/lib/jvm/java-6-sun
bamboo_plan_storageTag=PHPBB3-PR
bamboo_hg_cache_directory=/home/bamboo/xml-data/build-dir/_hg-repositories-cache
bamboo_planRepository_1_username=bantu
bamboo_planRepository_type=gitv2
bamboo_git_cache_directory=/home/bamboo/xml-data/build-dir/_git-repositories-cache
bamboo_ManualBuildTriggerReason_userName=Build Robot
bamboo_repository_git_repositoryUrl=https://github.com/phpbb/phpbb.git
bamboo_repository_75956235_git_branch=3.1.x
bamboo_capability_system_builder_ant_Ant=/usr/share/ant
bamboo_repository_75956235_name=phpBB Ascraeus
bamboo_tmp_directory=/home/bamboo/temp
bamboo_working_directory=/home/bamboo/xml-data/build-dir/PHPBB3-PR-JOB1
bamboo_planKey=PHPBB3-PR
bamboo_capability_local=true
bamboo_planRepository_1_repositoryUrl=https://github.com/phpbb/phpbb.git
bamboo_planRepository_username=bantu
bamboo_capability_system_jdk_JDK_1_6=/usr/lib/jvm/java-6-sun
bamboo_capability_system_jdk_JDK_1_7=/usr/lib/jvm/java-7-openjdk-amd64
bamboo_planRepository_1_branchName=3.1.x
10-Jan-2019 14:06:45 Buildfile: /data/build/build.xml
10-Jan-2019 14:06:45
10-Jan-2019 14:06:45 phpBB > sniff:
10-Jan-2019 14:06:45
10-Jan-2019 14:06:51 ............................................................  60 / 777 (8%)
10-Jan-2019 14:06:52 ............................................................ 120 / 777 (15%)
10-Jan-2019 14:06:53 ............................................................ 180 / 777 (23%)
10-Jan-2019 14:06:54 ............................................................ 240 / 777 (31%)
10-Jan-2019 14:06:55 ............................................................ 300 / 777 (39%)
10-Jan-2019 14:07:01 ............................................................ 360 / 777 (46%)
10-Jan-2019 14:07:05 ............................................................ 420 / 777 (54%)
10-Jan-2019 14:07:08 .................WWWWW...................................... 480 / 777 (62%)
10-Jan-2019 14:07:11 ............................................................ 540 / 777 (69%)
10-Jan-2019 14:07:14 ............................................................ 600 / 777 (77%)
10-Jan-2019 14:07:18 ............................................................ 660 / 777 (85%)
10-Jan-2019 14:07:21 ............................................................ 720 / 777 (93%)
10-Jan-2019 14:07:23 .........................................................    777 / 777 (100%)
10-Jan-2019 14:07:23
10-Jan-2019 14:07:23
10-Jan-2019 14:07:23
10-Jan-2019 14:07:23 FILE: ...ata/phpBB/phpbb/viewtopic/exception/login_required_exception.php
10-Jan-2019 14:07:23 ----------------------------------------------------------------------
10-Jan-2019 14:07:23 FOUND 0 ERRORS AND 1 WARNING AFFECTING 1 LINE
10-Jan-2019 14:07:23 ----------------------------------------------------------------------
10-Jan-2019 14:07:23 31 | WARNING | Possible useless method overriding detected
10-Jan-2019 14:07:23     |         | (Generic.CodeAnalysis.UselessOverridingMethod.Found)
10-Jan-2019 14:07:23 ----------------------------------------------------------------------
10-Jan-2019 14:07:23
10-Jan-2019 14:07:23
10-Jan-2019 14:07:23 FILE: ...ta/phpBB/phpbb/viewtopic/exception/topic_not_found_exception.php
10-Jan-2019 14:07:23 ----------------------------------------------------------------------
10-Jan-2019 14:07:23 FOUND 0 ERRORS AND 1 WARNING AFFECTING 1 LINE
10-Jan-2019 14:07:23 ----------------------------------------------------------------------
10-Jan-2019 14:07:23 31 | WARNING | Possible useless method overriding detected
10-Jan-2019 14:07:23     |         | (Generic.CodeAnalysis.UselessOverridingMethod.Found)
10-Jan-2019 14:07:23 ----------------------------------------------------------------------
10-Jan-2019 14:07:23
10-Jan-2019 14:07:23
10-Jan-2019 14:07:23 FILE: .../phpbb/viewtopic/exception/forum_password_required_exception.php
10-Jan-2019 14:07:23 ----------------------------------------------------------------------
10-Jan-2019 14:07:23 FOUND 0 ERRORS AND 1 WARNING AFFECTING 1 LINE
10-Jan-2019 14:07:23 ----------------------------------------------------------------------
10-Jan-2019 14:07:23 31 | WARNING | Possible useless method overriding detected
10-Jan-2019 14:07:23     |         | (Generic.CodeAnalysis.UselessOverridingMethod.Found)
10-Jan-2019 14:07:23 ----------------------------------------------------------------------
10-Jan-2019 14:07:23
10-Jan-2019 14:07:23
10-Jan-2019 14:07:23 FILE: .../phpBB/phpbb/viewtopic/exception/permission_denied_exception.php
10-Jan-2019 14:07:23 ----------------------------------------------------------------------
10-Jan-2019 14:07:23 FOUND 0 ERRORS AND 1 WARNING AFFECTING 1 LINE
10-Jan-2019 14:07:23 ----------------------------------------------------------------------
10-Jan-2019 14:07:23 31 | WARNING | Possible useless method overriding detected
10-Jan-2019 14:07:23     |         | (Generic.CodeAnalysis.UselessOverridingMethod.Found)
10-Jan-2019 14:07:23 ----------------------------------------------------------------------
10-Jan-2019 14:07:23
10-Jan-2019 14:07:23
10-Jan-2019 14:07:23 FILE: ...ata/phpBB/phpbb/viewtopic/exception/no_posts_found_exception.php
10-Jan-2019 14:07:23 ----------------------------------------------------------------------
10-Jan-2019 14:07:23 FOUND 0 ERRORS AND 1 WARNING AFFECTING 1 LINE
10-Jan-2019 14:07:23 ----------------------------------------------------------------------
10-Jan-2019 14:07:23 31 | WARNING | Possible useless method overriding detected
10-Jan-2019 14:07:23     |         | (Generic.CodeAnalysis.UselessOverridingMethod.Found)
10-Jan-2019 14:07:23 ----------------------------------------------------------------------
10-Jan-2019 14:07:23
10-Jan-2019 14:07:23 Time: 38.51 secs; Memory: 50.01MB
10-Jan-2019 14:07:23
10-Jan-2019 14:07:23       [php] Calling PHP function: preg_replace()
10-Jan-2019 14:07:28 ............................................................  60 / 209 (29%)
10-Jan-2019 14:07:40 ............................................................ 120 / 209 (57%)
10-Jan-2019 14:07:50 ............................................................ 180 / 209 (86%)
10-Jan-2019 14:07:55 .............................                                209 / 209 (100%)
10-Jan-2019 14:07:55
10-Jan-2019 14:07:55
10-Jan-2019 14:07:55 Time: 31.79 secs; Memory: 38.01MB
10-Jan-2019 14:07:55
10-Jan-2019 14:07:55
10-Jan-2019 14:07:55
10-Jan-2019 14:07:55 Time: 31ms; Memory: 4MB
10-Jan-2019 14:07:55
10-Jan-2019 14:07:55
10-Jan-2019 14:07:55 BUILD FAILED
10-Jan-2019 14:07:55 /data/build/build.xml:116:6: /data/build/build.xml:123:46: PHP Code Sniffer failed.
10-Jan-2019 14:07:55
10-Jan-2019 14:07:55 Total time: 1 minute  10.55 seconds
10-Jan-2019 14:07:55
10-Jan-2019 14:07:56 Error occurred while running Task 'Run sniffs(11)' of type com.atlassian.bamboo.plugins.bamboo-docker-plugin:task.docker.cli.
10-Jan-2019 14:07:56 com.atlassian.bamboo.task.TaskException: Failed to execute task
10-Jan-2019 14:07:56         at com.atlassian.bamboo.plugins.docker.service.RunService.execute(RunService.java:75)
10-Jan-2019 14:07:56         at com.atlassian.bamboo.plugins.docker.tasks.cli.DockerCliTask.execute(DockerCliTask.java:70)
10-Jan-2019 14:07:56         at com.atlassian.bamboo.task.TaskExecutorImpl.lambda$executeTasks$3(TaskExecutorImpl.java:285)
10-Jan-2019 14:07:56         at com.atlassian.bamboo.task.TaskExecutorImpl.executeTaskWithPrePostActions(TaskExecutorImpl.java:224)
10-Jan-2019 14:07:56         at com.atlassian.bamboo.task.TaskExecutorImpl.executeTasks(TaskExecutorImpl.java:285)
10-Jan-2019 14:07:56         at com.atlassian.bamboo.task.TaskExecutorImpl.execute(TaskExecutorImpl.java:112)
10-Jan-2019 14:07:56         at com.atlassian.bamboo.build.pipeline.tasks.ExecuteBuildTask.call(ExecuteBuildTask.java:71)
10-Jan-2019 14:07:56         at com.atlassian.bamboo.v2.build.agent.DefaultBuildAgent.executeBuildPhase(DefaultBuildAgent.java:203)
10-Jan-2019 14:07:56         at com.atlassian.bamboo.v2.build.agent.DefaultBuildAgent.build(DefaultBuildAgent.java:175)
10-Jan-2019 14:07:56         at com.atlassian.bamboo.v2.build.agent.BuildAgentControllerImpl.lambda$waitAndPerformBuild$0(BuildAgentControllerImpl.java:122)
10-Jan-2019 14:07:56         at com.atlassian.bamboo.variable.CustomVariableContextImpl.withVariableSubstitutor(CustomVariableContextImpl.java:185)
10-Jan-2019 14:07:56         at com.atlassian.bamboo.v2.build.agent.BuildAgentControllerImpl.waitAndPerformBuild(BuildAgentControllerImpl.java:117)
10-Jan-2019 14:07:56         at com.atlassian.bamboo.v2.build.agent.DefaultBuildAgent$1.run(DefaultBuildAgent.java:126)
10-Jan-2019 14:07:56         at com.atlassian.bamboo.utils.BambooRunnables$1.run(BambooRunnables.java:48)
10-Jan-2019 14:07:56         at com.atlassian.bamboo.security.ImpersonationHelper.runWith(ImpersonationHelper.java:26)
10-Jan-2019 14:07:56         at com.atlassian.bamboo.security.ImpersonationHelper.runWithSystemAuthority(ImpersonationHelper.java:17)
10-Jan-2019 14:07:56         at com.atlassian.bamboo.security.ImpersonationHelper$1.run(ImpersonationHelper.java:41)
10-Jan-2019 14:07:56         at java.lang.Thread.run(Thread.java:748)
10-Jan-2019 14:07:56 Caused by: com.atlassian.bamboo.docker.DockerException: Error running Docker run command
10-Jan-2019 14:07:56         at com.atlassian.bamboo.docker.DockerContainerServiceImpl.run(DockerContainerServiceImpl.java:118)
10-Jan-2019 14:07:56         at sun.reflect.GeneratedMethodAccessor2070.invoke(Unknown Source)
10-Jan-2019 14:07:56         at sun.reflect.DelegatingMethodAccessorImpl.invoke(DelegatingMethodAccessorImpl.java:43)
10-Jan-2019 14:07:56         at java.lang.reflect.Method.invoke(Method.java:498)
10-Jan-2019 14:07:56         at com.atlassian.plugin.util.ContextClassLoaderSettingInvocationHandler.invoke(ContextClassLoaderSettingInvocationHandler.java:26)
10-Jan-2019 14:07:56         at com.sun.proxy.$Proxy401.run(Unknown Source)
10-Jan-2019 14:07:56         at sun.reflect.GeneratedMethodAccessor2070.invoke(Unknown Source)
10-Jan-2019 14:07:56         at sun.reflect.DelegatingMethodAccessorImpl.invoke(DelegatingMethodAccessorImpl.java:43)
10-Jan-2019 14:07:56         at java.lang.reflect.Method.invoke(Method.java:498)
10-Jan-2019 14:07:56         at org.springframework.aop.support.AopUtils.invokeJoinpointUsingReflection(AopUtils.java:302)
10-Jan-2019 14:07:56         at org.eclipse.gemini.blueprint.service.importer.support.internal.aop.ServiceInvoker.doInvoke(ServiceInvoker.java:56)
10-Jan-2019 14:07:56         at org.eclipse.gemini.blueprint.service.importer.support.internal.aop.ServiceInvoker.invoke(ServiceInvoker.java:60)
10-Jan-2019 14:07:56         at org.springframework.aop.framework.ReflectiveMethodInvocation.proceed(ReflectiveMethodInvocation.java:179)
10-Jan-2019 14:07:56         at org.springframework.aop.support.DelegatingIntroductionInterceptor.doProceed(DelegatingIntroductionInterceptor.java:133)
10-Jan-2019 14:07:56         at org.springframework.aop.support.DelegatingIntroductionInterceptor.invoke(DelegatingIntroductionInterceptor.java:121)
10-Jan-2019 14:07:56         at org.springframework.aop.framework.ReflectiveMethodInvocation.proceed(ReflectiveMethodInvocation.java:179)
10-Jan-2019 14:07:56         at org.eclipse.gemini.blueprint.service.util.internal.aop.ServiceTCCLInterceptor.invokeUnprivileged(ServiceTCCLInterceptor.java:70)
10-Jan-2019 14:07:56         at org.eclipse.gemini.blueprint.service.util.internal.aop.ServiceTCCLInterceptor.invoke(ServiceTCCLInterceptor.java:53)
10-Jan-2019 14:07:56         at org.springframework.aop.framework.ReflectiveMethodInvocation.proceed(ReflectiveMethodInvocation.java:179)
10-Jan-2019 14:07:56         at org.eclipse.gemini.blueprint.service.importer.support.LocalBundleContextAdvice.invoke(LocalBundleContextAdvice.java:57)
10-Jan-2019 14:07:56         at org.springframework.aop.framework.ReflectiveMethodInvocation.proceed(ReflectiveMethodInvocation.java:179)
10-Jan-2019 14:07:56         at org.springframework.aop.support.DelegatingIntroductionInterceptor.doProceed(DelegatingIntroductionInterceptor.java:133)
10-Jan-2019 14:07:56         at org.springframework.aop.support.DelegatingIntroductionInterceptor.invoke(DelegatingIntroductionInterceptor.java:121)
10-Jan-2019 14:07:56         at org.springframework.aop.framework.ReflectiveMethodInvocation.proceed(ReflectiveMethodInvocation.java:179)
10-Jan-2019 14:07:56         at org.springframework.aop.framework.JdkDynamicAopProxy.invoke(JdkDynamicAopProxy.java:207)
10-Jan-2019 14:07:56         at com.sun.proxy.$Proxy667.run(Unknown Source)
10-Jan-2019 14:07:56         at com.atlassian.bamboo.plugins.docker.client.DockerCmd.run(DockerCmd.java:51)
10-Jan-2019 14:07:56         at com.atlassian.bamboo.plugins.docker.service.RunService.execute(RunService.java:64)
10-Jan-2019 14:07:56         ... 17 more
10-Jan-2019 14:07:56 Caused by: com.atlassian.utils.process.ProcessException: Error executing /usr/bin/docker run --volume /home/bamboo/xml-data/build-dir/PHPBB3-PR-JOB1:/data --workdir /data/build --rm -u=991 phpbb:php-7.1 ../phpBB/vendor/bin/phing sniff
10-Jan-2019 14:07:56         at com.atlassian.bamboo.docker.DockerContainerServiceImpl.execute(DockerContainerServiceImpl.java:252)
10-Jan-2019 14:07:56         at com.atlassian.bamboo.docker.DockerContainerServiceImpl.run(DockerContainerServiceImpl.java:106)
10-Jan-2019 14:07:56         ... 44 more
10-Jan-2019 14:07:56 Starting task 'Parsing test results produced by script' of type 'com.atlassian.bamboo.plugins.testresultparser:task.testresultparser.junit'
10-Jan-2019 14:07:56 Parsing test results under /home/bamboo/xml-data/build-dir/PHPBB3-PR-JOB1...
10-Jan-2019 14:07:56 Failing task since test cases were expected but none were found.
10-Jan-2019 14:07:56 Finished task 'Parsing test results produced by script' with result: Failed
10-Jan-2019 14:07:56
Substituting variable: ${bamboo.PRnumber} with 5504
10-Jan-2019 14:07:56
Substituting variable: ${bamboo.buildResultsUrl} with https://bamboo.phpbb.com/browse/PHPBB3-PR-JOB1-9157
10-Jan-2019 14:07:56
Substituting variable: ${bamboo.buildResultsUrl} with https://bamboo.phpbb.com/browse/PHPBB3-PR-JOB1-9157
10-Jan-2019 14:07:56 Starting task 'Set result build status' of type 'com.atlassian.bamboo.plugins.scripttask:task.builder.script'
10-Jan-2019 14:07:56
Beginning to execute external process for build 'phpBB3 - Pull Requests - Build and Test Job #9157 (PHPBB3-PR-JOB1-9157)'
... running command line:
/bin/sh /home/bamboo/temp/PHPBB3-PR-JOB1-9157-ScriptBuildTask-8418827597439533839.sh
... in: /home/bamboo/xml-data/build-dir/PHPBB3-PR-JOB1
... using extra environment variables:
bamboo_planRepository_1_branch=3.1.x
bamboo_planRepository_1_branchDisplayName=3.1.x
bamboo_repository_revision_number=dc8ff9da28b8ab4ad11c7ea94cca526f17c87fe5
bamboo_PRref=master
bamboo_resultsUrl=https://bamboo.phpbb.com/browse/PHPBB3-PR-JOB1-9157
bamboo_capability_system_builder_command_Git=/usr/bin/git
bamboo_repository_75956235_git_username=bantu
bamboo_build_working_directory=/home/bamboo/xml-data/build-dir/PHPBB3-PR-JOB1
bamboo_planRepository_1_name=phpBB Ascraeus
bamboo_buildKey=PHPBB3-PR-JOB1
bamboo_capability_phpbb_tests=true
bamboo_shortPlanName=Pull Requests
bamboo_capability_system_builder_command_fop=/usr/bin/fop
bamboo_capability_dbms_sqlite_2=true
bamboo_planRepository_name=phpBB Ascraeus
bamboo_PRnumber=5504
bamboo_buildNumber=9157
bamboo_repository_75956235_git_repositoryUrl=https://github.com/phpbb/phpbb.git
bamboo_capability_system_builder_phpunit_PHPUnit=/usr/bin/phpunit
bamboo_shortJobName=Build and Test Job
bamboo_buildResultsUrl=https://bamboo.phpbb.com/browse/PHPBB3-PR-JOB1-9157
bamboo_repository_75956235_branch_name=3.1.x
bamboo_planRepository_repositoryUrl=https://github.com/phpbb/phpbb.git
bamboo_agentId=131073
bamboo_planName=phpBB3 - Pull Requests
bamboo_build_commandline_com_atlassian_bamboo_plugins_scripttask_task_builder_script_7=/bin/sh /home/bamboo/temp/PHPBB3-PR-JOB1-9157-ScriptBuildTask-2744389045418328204.sh
bamboo_shortPlanKey=PR
bamboo_shortJobKey=JOB1
bamboo_capability_dbms_mysql_55=true
bamboo_capability_system_jdk_JDK_1_7_0_65=/usr/lib/jvm/java-7-openjdk-amd64
bamboo_planRepository_revision=dc8ff9da28b8ab4ad11c7ea94cca526f17c87fe5
bamboo_buildTimeStamp=2019-01-10T14:05:18.937Z
bamboo_repository_previous_revision_number=dc8ff9da28b8ab4ad11c7ea94cca526f17c87fe5
bamboo_capability_system_jdk_JDK_1_6_0_16=/usr/lib/jvm/java-6-sun-1.6.0.16
bamboo_capability_system_builder_mvn2_Maven_2=/usr/share/maven2
bamboo_planRepository_previousRevision=dc8ff9da28b8ab4ad11c7ea94cca526f17c87fe5
bamboo_build_commandline_com_atlassian_bamboo_plugins_scripttask_task_builder_script_4=/bin/sh /home/bamboo/temp/PHPBB3-PR-JOB1-9157-ScriptBuildTask-8877758602309508470.sh
bamboo_repository_git_branch=3.1.x
bamboo_buildResultKey=PHPBB3-PR-JOB1-9157
bamboo_repository_branch_name=3.1.x
bamboo_buildPlanName=phpBB3 - Pull Requests - Build and Test Job
bamboo_planRepository_1_revision=dc8ff9da28b8ab4ad11c7ea94cca526f17c87fe5
bamboo_repository_name=phpBB Ascraeus
bamboo_buildFailed=true
bamboo_capability_system_docker_executable=/usr/bin/docker
bamboo_build_commandline_com_atlassian_bamboo_plugins_bamboo_docker_plugin_task_docker_cli_11=/usr/bin/docker run --volume /home/bamboo/xml-data/build-dir/PHPBB3-PR-JOB1:/data --workdir /data/build --rm -u=991 phpbb:php-7.1 ../phpBB/vendor/bin/phing sniff
bamboo_build_commandline_com_atlassian_bamboo_plugins_bamboo_docker_plugin_task_docker_cli_12=/usr/bin/docker run --volume /home/bamboo/xml-data/build-dir/PHPBB3-PR-JOB1:/data --workdir /data/phpBB --rm -e HOME=/home/bamboo -u=991 phpbb:php-7.1 /bin/bash -c php ../composer.phar install --dev; cd ../build; ../phpBB/vendor/bin/phing clean prepare
bamboo_planRepository_branch=3.1.x
bamboo_agentWorkingDirectory=/home/bamboo/xml-data/build-dir
bamboo_jobFailed=true
bamboo_capability_system_git_executable=/usr/bin/git
bamboo_capability_system_builder_phpunit_PHPUnit_3_4=/usr/bin/phpunit
bamboo_repository_git_username=bantu
bamboo_planRepository_1_previousRevision=dc8ff9da28b8ab4ad11c7ea94cca526f17c87fe5
bamboo_repository_75956235_revision_number=dc8ff9da28b8ab4ad11c7ea94cca526f17c87fe5
bamboo_planRepository_branchDisplayName=3.1.x
bamboo_planRepository_1_type=gitv2
bamboo_planRepository_branchName=3.1.x
bamboo_repository_75956235_previous_revision_number=dc8ff9da28b8ab4ad11c7ea94cca526f17c87fe5
bamboo_capability_system_jdk_JDK=/usr/lib/jvm/java-6-sun
bamboo_plan_storageTag=PHPBB3-PR
bamboo_hg_cache_directory=/home/bamboo/xml-data/build-dir/_hg-repositories-cache
bamboo_planRepository_1_username=bantu
bamboo_planRepository_type=gitv2
bamboo_git_cache_directory=/home/bamboo/xml-data/build-dir/_git-repositories-cache
bamboo_ManualBuildTriggerReason_userName=Build Robot
bamboo_repository_git_repositoryUrl=https://github.com/phpbb/phpbb.git
bamboo_repository_75956235_git_branch=3.1.x
bamboo_capability_system_builder_ant_Ant=/usr/share/ant
bamboo_repository_75956235_name=phpBB Ascraeus
bamboo_tmp_directory=/home/bamboo/temp
bamboo_working_directory=/home/bamboo/xml-data/build-dir/PHPBB3-PR-JOB1
bamboo_planKey=PHPBB3-PR
bamboo_capability_local=true
bamboo_planRepository_1_repositoryUrl=https://github.com/phpbb/phpbb.git
bamboo_planRepository_username=bantu
bamboo_capability_system_jdk_JDK_1_6=/usr/lib/jvm/java-6-sun
bamboo_capability_system_jdk_JDK_1_7=/usr/lib/jvm/java-7-openjdk-amd64
bamboo_planRepository_1_branchName=3.1.x
10-Jan-2019 14:07:56 From https://github.com/phpbb/phpbb
10-Jan-2019 14:07:56 * branch            refs/pull/5504/head -> FETCH_HEAD
10-Jan-2019 14:07:56 grep: build/logs/phpunit.xml: No such file or directory
10-Jan-2019 14:07:56 grep: build/logs/phpunit.xml: No such file or directory
10-Jan-2019 14:07:56   % Total    % Received % Xferd  Average Speed   Time    Time     Time  Current
10-Jan-2019 14:07:56                                  Dload  Upload   Total   Spent    Left  Speed
10-Jan-2019 14:07:56
10-Jan-2019 14:07:56   0     0    0     0    0     0      0      0 --:--:-- --:--:-- --:--:--     0
10-Jan-2019 14:07:56 100   273  100    93  100   180    185    359 --:--:-- --:--:-- --:--:--   359
10-Jan-2019 14:07:56 Finished task 'Set result build status' with result: Success
10-Jan-2019 14:07:56 Running post build plugin 'NCover Results Collector'
10-Jan-2019 14:07:56 Running post build plugin 'Artifact Copier'
10-Jan-2019 14:07:56 Running post build plugin 'npm Cache Cleanup'
10-Jan-2019 14:07:56 Running post build plugin 'Clover Results Collector'
10-Jan-2019 14:07:56 Running post build plugin 'Docker Container Cleanup'
10-Jan-2019 14:07:57 Successfully removed working directory at '/home/bamboo/xml-data/build-dir/PHPBB3-PR-JOB1'
10-Jan-2019 14:07:57 Finalising the build...
10-Jan-2019 14:07:57 Stopping timer.
10-Jan-2019 14:07:57 Build PHPBB3-PR-JOB1-9157 completed.
10-Jan-2019 14:07:57 Running on server: post build plugin 'NCover Results Collector'
10-Jan-2019 14:07:57 Running on server: post build plugin 'Build Hanging Detection Configuration'
10-Jan-2019 14:07:57 Running on server: post build plugin 'Clover Delta Calculator'
10-Jan-2019 14:07:57 Running on server: post build plugin 'Maven Dependencies Postprocessor'
10-Jan-2019 14:07:57 All post build plugins have finished
10-Jan-2019 14:07:57 Generating build results summary...
10-Jan-2019 14:07:57 Saving build results to disk...
10-Jan-2019 14:07:57 Logging substituted variables...
10-Jan-2019 14:07:57 Indexing build results...
10-Jan-2019 14:07:57 Finished building PHPBB3-PR-JOB1-9157.
10-Jan-2019 14:07:57
Substituting variable: ${bamboo.PRnumber} with 5504