Tests pending pull requests

Build: #9529 failed

Job: Build and Test Job failed

Stages & jobs

  1. Build and Test

Build log

The build generated 526 lines of output. Download or view full build log

29-Aug-2019 08:17:26 Build phpBB3 - Pull Requests - Build and Test Job #9529 (PHPBB3-PR-JOB1-9529) started building on agent Default Agent
29-Aug-2019 08:17:26
29-Aug-2019 08:17:26 Build working directory is /home/bamboo/xml-data/build-dir/PHPBB3-PR-JOB1
29-Aug-2019 08:17:26 Executing build phpBB3 - Pull Requests - Build and Test Job #9529 (PHPBB3-PR-JOB1-9529)
29-Aug-2019 08:17:26 Starting task 'Checkout develop branch' of type 'com.atlassian.bamboo.plugins.vcs:task.vcs.checkout'
29-Aug-2019 08:17:26 Build always requires a clean checkout
29-Aug-2019 08:17:26 Cleaning build directory '/home/bamboo/xml-data/build-dir/PHPBB3-PR-JOB1'
29-Aug-2019 08:17:26 Checking out into /home/bamboo/xml-data/build-dir/PHPBB3-PR-JOB1
29-Aug-2019 08:17:26 Updating source code to revision: dc8ff9da28b8ab4ad11c7ea94cca526f17c87fe5
29-Aug-2019 08:17:26 Fetching 'refs/heads/3.1.x' from 'https://github.com/phpbb/phpbb.git'.
29-Aug-2019 08:17:27 Checking out revision dc8ff9da28b8ab4ad11c7ea94cca526f17c87fe5.
29-Aug-2019 08:17:27 Creating local git repository in '/home/bamboo/xml-data/build-dir/PHPBB3-PR-JOB1/.git'.
29-Aug-2019 08:17:27 Cloning into '/home/bamboo/xml-data/build-dir/PHPBB3-PR-JOB1'...
29-Aug-2019 08:17:27 done.
29-Aug-2019 08:17:28 Switched to a new branch '3.1.x'
29-Aug-2019 08:17:28 Branch 3.1.x set up to track remote branch 3.1.x from origin.
29-Aug-2019 08:17:28 Updated source code to revision: dc8ff9da28b8ab4ad11c7ea94cca526f17c87fe5
29-Aug-2019 08:17:28 Finished task 'Checkout develop branch' with result: Success
29-Aug-2019 08:17:28 Running pre-build action: VCS Version Collector
29-Aug-2019 08:17:28
Substituting variable: ${bamboo.PRnumber} with 5668
29-Aug-2019 08:17:28
Substituting variable: ${bamboo.buildResultsUrl} with https://bamboo.phpbb.com/browse/PHPBB3-PR-JOB1-9529
29-Aug-2019 08:17:28 Starting task 'Set pending build status' of type 'com.atlassian.bamboo.plugins.scripttask:task.builder.script'
29-Aug-2019 08:17:28
Beginning to execute external process for build 'phpBB3 - Pull Requests - Build and Test Job #9529 (PHPBB3-PR-JOB1-9529)'
... running command line:
/bin/sh /home/bamboo/temp/PHPBB3-PR-JOB1-9529-ScriptBuildTask-1210241705812720932.sh
... in: /home/bamboo/xml-data/build-dir/PHPBB3-PR-JOB1
... using extra environment variables:
bamboo_planRepository_1_branch=3.1.x
bamboo_planRepository_1_branchDisplayName=3.1.x
bamboo_repository_revision_number=dc8ff9da28b8ab4ad11c7ea94cca526f17c87fe5
bamboo_PRref=master
bamboo_resultsUrl=https://bamboo.phpbb.com/browse/PHPBB3-PR-JOB1-9529
bamboo_capability_system_builder_command_Git=/usr/bin/git
bamboo_repository_75956235_git_username=bantu
bamboo_build_working_directory=/home/bamboo/xml-data/build-dir/PHPBB3-PR-JOB1
bamboo_planRepository_1_name=phpBB Ascraeus
bamboo_buildKey=PHPBB3-PR-JOB1
bamboo_capability_phpbb_tests=true
bamboo_shortPlanName=Pull Requests
bamboo_capability_system_builder_command_fop=/usr/bin/fop
bamboo_capability_dbms_sqlite_2=true
bamboo_planRepository_name=phpBB Ascraeus
bamboo_PRnumber=5668
bamboo_buildNumber=9529
bamboo_repository_75956235_git_repositoryUrl=https://github.com/phpbb/phpbb.git
bamboo_capability_system_builder_phpunit_PHPUnit=/usr/bin/phpunit
bamboo_shortJobName=Build and Test Job
bamboo_buildResultsUrl=https://bamboo.phpbb.com/browse/PHPBB3-PR-JOB1-9529
bamboo_repository_75956235_branch_name=3.1.x
bamboo_planRepository_repositoryUrl=https://github.com/phpbb/phpbb.git
bamboo_agentId=131073
bamboo_planName=phpBB3 - Pull Requests
bamboo_shortPlanKey=PR
bamboo_shortJobKey=JOB1
bamboo_capability_dbms_mysql_55=true
bamboo_capability_system_jdk_JDK_1_7_0_65=/usr/lib/jvm/java-7-openjdk-amd64
bamboo_planRepository_revision=dc8ff9da28b8ab4ad11c7ea94cca526f17c87fe5
bamboo_buildTimeStamp=2019-08-29T08:17:26.532Z
bamboo_repository_previous_revision_number=dc8ff9da28b8ab4ad11c7ea94cca526f17c87fe5
bamboo_capability_system_jdk_JDK_1_6_0_16=/usr/lib/jvm/java-6-sun-1.6.0.16
bamboo_capability_system_builder_mvn2_Maven_2=/usr/share/maven2
bamboo_planRepository_previousRevision=dc8ff9da28b8ab4ad11c7ea94cca526f17c87fe5
bamboo_repository_git_branch=3.1.x
bamboo_buildResultKey=PHPBB3-PR-JOB1-9529
bamboo_repository_branch_name=3.1.x
bamboo_buildPlanName=phpBB3 - Pull Requests - Build and Test Job
bamboo_planRepository_1_revision=dc8ff9da28b8ab4ad11c7ea94cca526f17c87fe5
bamboo_repository_name=phpBB Ascraeus
bamboo_buildFailed=false
bamboo_capability_system_docker_executable=/usr/bin/docker
bamboo_planRepository_branch=3.1.x
bamboo_agentWorkingDirectory=/home/bamboo/xml-data/build-dir
bamboo_capability_system_git_executable=/usr/bin/git
bamboo_capability_system_builder_phpunit_PHPUnit_3_4=/usr/bin/phpunit
bamboo_repository_git_username=bantu
bamboo_planRepository_1_previousRevision=dc8ff9da28b8ab4ad11c7ea94cca526f17c87fe5
bamboo_repository_75956235_revision_number=dc8ff9da28b8ab4ad11c7ea94cca526f17c87fe5
bamboo_planRepository_branchDisplayName=3.1.x
bamboo_planRepository_1_type=gitv2
bamboo_planRepository_branchName=3.1.x
bamboo_repository_75956235_previous_revision_number=dc8ff9da28b8ab4ad11c7ea94cca526f17c87fe5
bamboo_capability_system_jdk_JDK=/usr/lib/jvm/java-6-sun
bamboo_plan_storageTag=PHPBB3-PR
bamboo_hg_cache_directory=/home/bamboo/xml-data/build-dir/_hg-repositories-cache
bamboo_planRepository_1_username=bantu
bamboo_planRepository_type=gitv2
bamboo_git_cache_directory=/home/bamboo/xml-data/build-dir/_git-repositories-cache
bamboo_ManualBuildTriggerReason_userName=Build Robot
bamboo_repository_git_repositoryUrl=https://github.com/phpbb/phpbb.git
bamboo_repository_75956235_git_branch=3.1.x
bamboo_capability_system_builder_ant_Ant=/usr/share/ant
bamboo_repository_75956235_name=phpBB Ascraeus
bamboo_tmp_directory=/home/bamboo/temp
bamboo_working_directory=/home/bamboo/xml-data/build-dir/PHPBB3-PR-JOB1
bamboo_planKey=PHPBB3-PR
bamboo_capability_local=true
bamboo_planRepository_1_repositoryUrl=https://github.com/phpbb/phpbb.git
bamboo_planRepository_username=bantu
bamboo_capability_system_jdk_JDK_1_6=/usr/lib/jvm/java-6-sun
bamboo_capability_system_jdk_JDK_1_7=/usr/lib/jvm/java-7-openjdk-amd64
bamboo_planRepository_1_branchName=3.1.x
29-Aug-2019 08:17:30 From https://github.com/phpbb/phpbb
29-Aug-2019 08:17:30 * branch            refs/pull/5668/head -> FETCH_HEAD
29-Aug-2019 08:17:30   % Total    % Received % Xferd  Average Speed   Time    Time     Time  Current
29-Aug-2019 08:17:30                                  Dload  Upload   Total   Spent    Left  Speed
29-Aug-2019 08:17:30
29-Aug-2019 08:17:30   0     0    0     0    0     0      0      0 --:--:-- --:--:-- --:--:--     0
29-Aug-2019 08:17:30 100   275  100    93  100   182    311    609 --:--:-- --:--:-- --:--:--   610
29-Aug-2019 08:17:30 Finished task 'Set pending build status' with result: Success
29-Aug-2019 08:17:30
Substituting variable: ${bamboo.PRnumber} with 5668
29-Aug-2019 08:17:30 Starting task 'Fetch PR' of type 'com.atlassian.bamboo.plugins.scripttask:task.builder.script'
29-Aug-2019 08:17:30
Beginning to execute external process for build 'phpBB3 - Pull Requests - Build and Test Job #9529 (PHPBB3-PR-JOB1-9529)'
... running command line:
/bin/sh /home/bamboo/temp/PHPBB3-PR-JOB1-9529-ScriptBuildTask-1378036433883455437.sh
... in: /home/bamboo/xml-data/build-dir/PHPBB3-PR-JOB1
... using extra environment variables:
bamboo_planRepository_1_branch=3.1.x
bamboo_planRepository_1_branchDisplayName=3.1.x
bamboo_repository_revision_number=dc8ff9da28b8ab4ad11c7ea94cca526f17c87fe5
bamboo_PRref=master
bamboo_resultsUrl=https://bamboo.phpbb.com/browse/PHPBB3-PR-JOB1-9529
bamboo_capability_system_builder_command_Git=/usr/bin/git
bamboo_repository_75956235_git_username=bantu
bamboo_build_working_directory=/home/bamboo/xml-data/build-dir/PHPBB3-PR-JOB1
bamboo_planRepository_1_name=phpBB Ascraeus
bamboo_buildKey=PHPBB3-PR-JOB1
bamboo_capability_phpbb_tests=true
bamboo_shortPlanName=Pull Requests
bamboo_capability_system_builder_command_fop=/usr/bin/fop
bamboo_capability_dbms_sqlite_2=true
bamboo_planRepository_name=phpBB Ascraeus
bamboo_PRnumber=5668
bamboo_buildNumber=9529
bamboo_repository_75956235_git_repositoryUrl=https://github.com/phpbb/phpbb.git
bamboo_capability_system_builder_phpunit_PHPUnit=/usr/bin/phpunit
bamboo_shortJobName=Build and Test Job
bamboo_buildResultsUrl=https://bamboo.phpbb.com/browse/PHPBB3-PR-JOB1-9529
bamboo_repository_75956235_branch_name=3.1.x
bamboo_planRepository_repositoryUrl=https://github.com/phpbb/phpbb.git
bamboo_agentId=131073
bamboo_planName=phpBB3 - Pull Requests
bamboo_build_commandline_com_atlassian_bamboo_plugins_scripttask_task_builder_script_7=/bin/sh /home/bamboo/temp/PHPBB3-PR-JOB1-9529-ScriptBuildTask-1210241705812720932.sh
bamboo_shortPlanKey=PR
bamboo_shortJobKey=JOB1
bamboo_capability_dbms_mysql_55=true
bamboo_capability_system_jdk_JDK_1_7_0_65=/usr/lib/jvm/java-7-openjdk-amd64
bamboo_planRepository_revision=dc8ff9da28b8ab4ad11c7ea94cca526f17c87fe5
bamboo_buildTimeStamp=2019-08-29T08:17:26.532Z
bamboo_repository_previous_revision_number=dc8ff9da28b8ab4ad11c7ea94cca526f17c87fe5
bamboo_capability_system_jdk_JDK_1_6_0_16=/usr/lib/jvm/java-6-sun-1.6.0.16
bamboo_capability_system_builder_mvn2_Maven_2=/usr/share/maven2
bamboo_planRepository_previousRevision=dc8ff9da28b8ab4ad11c7ea94cca526f17c87fe5
bamboo_repository_git_branch=3.1.x
bamboo_buildResultKey=PHPBB3-PR-JOB1-9529
bamboo_repository_branch_name=3.1.x
bamboo_buildPlanName=phpBB3 - Pull Requests - Build and Test Job
bamboo_planRepository_1_revision=dc8ff9da28b8ab4ad11c7ea94cca526f17c87fe5
bamboo_repository_name=phpBB Ascraeus
bamboo_buildFailed=false
bamboo_capability_system_docker_executable=/usr/bin/docker
bamboo_planRepository_branch=3.1.x
bamboo_agentWorkingDirectory=/home/bamboo/xml-data/build-dir
bamboo_capability_system_git_executable=/usr/bin/git
bamboo_capability_system_builder_phpunit_PHPUnit_3_4=/usr/bin/phpunit
bamboo_repository_git_username=bantu
bamboo_planRepository_1_previousRevision=dc8ff9da28b8ab4ad11c7ea94cca526f17c87fe5
bamboo_repository_75956235_revision_number=dc8ff9da28b8ab4ad11c7ea94cca526f17c87fe5
bamboo_planRepository_branchDisplayName=3.1.x
bamboo_planRepository_1_type=gitv2
bamboo_planRepository_branchName=3.1.x
bamboo_repository_75956235_previous_revision_number=dc8ff9da28b8ab4ad11c7ea94cca526f17c87fe5
bamboo_capability_system_jdk_JDK=/usr/lib/jvm/java-6-sun
bamboo_plan_storageTag=PHPBB3-PR
bamboo_hg_cache_directory=/home/bamboo/xml-data/build-dir/_hg-repositories-cache
bamboo_planRepository_1_username=bantu
bamboo_planRepository_type=gitv2
bamboo_git_cache_directory=/home/bamboo/xml-data/build-dir/_git-repositories-cache
bamboo_ManualBuildTriggerReason_userName=Build Robot
bamboo_repository_git_repositoryUrl=https://github.com/phpbb/phpbb.git
bamboo_repository_75956235_git_branch=3.1.x
bamboo_capability_system_builder_ant_Ant=/usr/share/ant
bamboo_repository_75956235_name=phpBB Ascraeus
bamboo_tmp_directory=/home/bamboo/temp
bamboo_working_directory=/home/bamboo/xml-data/build-dir/PHPBB3-PR-JOB1
bamboo_planKey=PHPBB3-PR
bamboo_capability_local=true
bamboo_planRepository_1_repositoryUrl=https://github.com/phpbb/phpbb.git
bamboo_planRepository_username=bantu
bamboo_capability_system_jdk_JDK_1_6=/usr/lib/jvm/java-6-sun
bamboo_capability_system_jdk_JDK_1_7=/usr/lib/jvm/java-7-openjdk-amd64
bamboo_planRepository_1_branchName=3.1.x
29-Aug-2019 08:17:34 From https://github.com/phpbb/phpbb
29-Aug-2019 08:17:34 * branch            refs/pull/5668/merge -> FETCH_HEAD
29-Aug-2019 08:17:34 Note: checking out 'FETCH_HEAD'.
29-Aug-2019 08:17:34
29-Aug-2019 08:17:34 You are in 'detached HEAD' state. You can look around, make experimental
29-Aug-2019 08:17:34 changes and commit them, and you can discard any commits you make in this
29-Aug-2019 08:17:34 state without impacting any branches by performing another checkout.
29-Aug-2019 08:17:34
29-Aug-2019 08:17:34 If you want to create a new branch to retain commits you create, you may
29-Aug-2019 08:17:34 do so (now or later) by using -b with the checkout command again. Example:
29-Aug-2019 08:17:34
29-Aug-2019 08:17:34   git checkout -b new_branch_name
29-Aug-2019 08:17:34
29-Aug-2019 08:17:34 HEAD is now at 3417ce4... Merge 9eb89a3575516c60d9ae4b57153ce6b57eee78f6 into 50eb426837497b54b8ec436c475afc60eb7b709a
29-Aug-2019 08:17:34 Finished task 'Fetch PR' with result: Success
29-Aug-2019 08:17:34 Skipping execution of task 'Prepare directory' as it is disabled
29-Aug-2019 08:17:34
Substituting variable: ${bamboo.working.directory} with /home/bamboo/xml-data/build-dir/PHPBB3-PR-JOB1
29-Aug-2019 08:17:34 Starting task 'Build image' of type 'com.atlassian.bamboo.plugins.bamboo-docker-plugin:task.docker.cli'
29-Aug-2019 08:17:34
Beginning to execute external process for build 'phpBB3 - Pull Requests - Build and Test Job #9529 (PHPBB3-PR-JOB1-9529)'
... running command line:
/usr/bin/docker build --force-rm=true --tag=phpbb:php-7.1 /home/bamboo/xml-data/build-dir/PHPBB3-PR-JOB1
... in: /home/bamboo/xml-data/build-dir/PHPBB3-PR-JOB1
... using extra environment variables:
bamboo_planRepository_1_branch=3.1.x
bamboo_planRepository_1_branchDisplayName=3.1.x
bamboo_repository_revision_number=dc8ff9da28b8ab4ad11c7ea94cca526f17c87fe5
bamboo_PRref=master
bamboo_resultsUrl=https://bamboo.phpbb.com/browse/PHPBB3-PR-JOB1-9529
bamboo_capability_system_builder_command_Git=/usr/bin/git
bamboo_repository_75956235_git_username=bantu
bamboo_build_working_directory=/home/bamboo/xml-data/build-dir/PHPBB3-PR-JOB1
bamboo_planRepository_1_name=phpBB Ascraeus
bamboo_buildKey=PHPBB3-PR-JOB1
bamboo_capability_phpbb_tests=true
bamboo_shortPlanName=Pull Requests
bamboo_capability_system_builder_command_fop=/usr/bin/fop
bamboo_capability_dbms_sqlite_2=true
bamboo_planRepository_name=phpBB Ascraeus
bamboo_PRnumber=5668
bamboo_buildNumber=9529
bamboo_repository_75956235_git_repositoryUrl=https://github.com/phpbb/phpbb.git
bamboo_capability_system_builder_phpunit_PHPUnit=/usr/bin/phpunit
bamboo_shortJobName=Build and Test Job
bamboo_buildResultsUrl=https://bamboo.phpbb.com/browse/PHPBB3-PR-JOB1-9529
bamboo_repository_75956235_branch_name=3.1.x
bamboo_planRepository_repositoryUrl=https://github.com/phpbb/phpbb.git
bamboo_agentId=131073
bamboo_planName=phpBB3 - Pull Requests
bamboo_build_commandline_com_atlassian_bamboo_plugins_scripttask_task_builder_script_7=/bin/sh /home/bamboo/temp/PHPBB3-PR-JOB1-9529-ScriptBuildTask-1210241705812720932.sh
bamboo_shortPlanKey=PR
bamboo_shortJobKey=JOB1
bamboo_capability_dbms_mysql_55=true
bamboo_capability_system_jdk_JDK_1_7_0_65=/usr/lib/jvm/java-7-openjdk-amd64
bamboo_planRepository_revision=dc8ff9da28b8ab4ad11c7ea94cca526f17c87fe5
bamboo_buildTimeStamp=2019-08-29T08:17:26.532Z
bamboo_repository_previous_revision_number=dc8ff9da28b8ab4ad11c7ea94cca526f17c87fe5
bamboo_capability_system_jdk_JDK_1_6_0_16=/usr/lib/jvm/java-6-sun-1.6.0.16
bamboo_capability_system_builder_mvn2_Maven_2=/usr/share/maven2
bamboo_planRepository_previousRevision=dc8ff9da28b8ab4ad11c7ea94cca526f17c87fe5
bamboo_build_commandline_com_atlassian_bamboo_plugins_scripttask_task_builder_script_4=/bin/sh /home/bamboo/temp/PHPBB3-PR-JOB1-9529-ScriptBuildTask-1378036433883455437.sh
bamboo_repository_git_branch=3.1.x
bamboo_buildResultKey=PHPBB3-PR-JOB1-9529
bamboo_repository_branch_name=3.1.x
bamboo_buildPlanName=phpBB3 - Pull Requests - Build and Test Job
bamboo_planRepository_1_revision=dc8ff9da28b8ab4ad11c7ea94cca526f17c87fe5
bamboo_repository_name=phpBB Ascraeus
bamboo_buildFailed=false
bamboo_capability_system_docker_executable=/usr/bin/docker
bamboo_planRepository_branch=3.1.x
bamboo_agentWorkingDirectory=/home/bamboo/xml-data/build-dir
bamboo_capability_system_git_executable=/usr/bin/git
bamboo_capability_system_builder_phpunit_PHPUnit_3_4=/usr/bin/phpunit
bamboo_repository_git_username=bantu
bamboo_planRepository_1_previousRevision=dc8ff9da28b8ab4ad11c7ea94cca526f17c87fe5
bamboo_repository_75956235_revision_number=dc8ff9da28b8ab4ad11c7ea94cca526f17c87fe5
bamboo_planRepository_branchDisplayName=3.1.x
bamboo_planRepository_1_type=gitv2
bamboo_planRepository_branchName=3.1.x
bamboo_repository_75956235_previous_revision_number=dc8ff9da28b8ab4ad11c7ea94cca526f17c87fe5
bamboo_capability_system_jdk_JDK=/usr/lib/jvm/java-6-sun
bamboo_plan_storageTag=PHPBB3-PR
bamboo_hg_cache_directory=/home/bamboo/xml-data/build-dir/_hg-repositories-cache
bamboo_planRepository_1_username=bantu
bamboo_planRepository_type=gitv2
bamboo_git_cache_directory=/home/bamboo/xml-data/build-dir/_git-repositories-cache
bamboo_ManualBuildTriggerReason_userName=Build Robot
bamboo_repository_git_repositoryUrl=https://github.com/phpbb/phpbb.git
bamboo_repository_75956235_git_branch=3.1.x
bamboo_capability_system_builder_ant_Ant=/usr/share/ant
bamboo_repository_75956235_name=phpBB Ascraeus
bamboo_tmp_directory=/home/bamboo/temp
bamboo_working_directory=/home/bamboo/xml-data/build-dir/PHPBB3-PR-JOB1
bamboo_planKey=PHPBB3-PR
bamboo_capability_local=true
bamboo_planRepository_1_repositoryUrl=https://github.com/phpbb/phpbb.git
bamboo_planRepository_username=bantu
bamboo_capability_system_jdk_JDK_1_6=/usr/lib/jvm/java-6-sun
bamboo_capability_system_jdk_JDK_1_7=/usr/lib/jvm/java-7-openjdk-amd64
bamboo_planRepository_1_branchName=3.1.x
29-Aug-2019 08:17:35 Sending build context to Docker daemon   31.7MB
29-Aug-2019 08:17:35
29-Aug-2019 08:17:35 Step 1/5 : FROM php:7.1
29-Aug-2019 08:17:35 ---> 6b94137690a5
29-Aug-2019 08:17:35 Step 2/5 : RUN apt-get update && apt-get install -y         git         zlib1g-dev         bzip2         zip         && docker-php-ext-install -j$(nproc) zip
29-Aug-2019 08:17:35 ---> Using cache
29-Aug-2019 08:17:35 ---> bd057f993f32
29-Aug-2019 08:17:35 Step 3/5 : RUN pecl install xdebug-2.6.1
29-Aug-2019 08:17:35 ---> Using cache
29-Aug-2019 08:17:35 ---> d5aa4092dbb1
29-Aug-2019 08:17:35 Step 4/5 : RUN docker-php-ext-enable xdebug
29-Aug-2019 08:17:35 ---> Using cache
29-Aug-2019 08:17:35 ---> 2a1393dca753
29-Aug-2019 08:17:35 Step 5/5 : RUN echo "memory_limit = 1536M" >> /usr/local/etc/php/conf.d/memory.ini
29-Aug-2019 08:17:35 ---> Using cache
29-Aug-2019 08:17:35 ---> a3f413ebf244
29-Aug-2019 08:17:35 Successfully built a3f413ebf244
29-Aug-2019 08:17:35 Successfully tagged phpbb:php-7.1
29-Aug-2019 08:17:35 Built Docker image 'phpbb:php-7.1'
29-Aug-2019 08:17:35 Finished task 'Build image' with result: Success
29-Aug-2019 08:17:35
Substituting variable: ${bamboo.working.directory} with /home/bamboo/xml-data/build-dir/PHPBB3-PR-JOB1
29-Aug-2019 08:17:35 Starting task 'Prepare directory' of type 'com.atlassian.bamboo.plugins.bamboo-docker-plugin:task.docker.cli'
29-Aug-2019 08:17:35 Running image name (phpbb:php-7.1)
29-Aug-2019 08:17:35
Beginning to execute external process for build 'phpBB3 - Pull Requests - Build and Test Job #9529 (PHPBB3-PR-JOB1-9529)'
... running command line:
/usr/bin/docker run --volume /home/bamboo/xml-data/build-dir/PHPBB3-PR-JOB1:/data --workdir /data/phpBB --rm -e HOME=/home/bamboo -u=991 phpbb:php-7.1 /bin/bash -c php ../composer.phar install --dev; cd ../build; ../phpBB/vendor/bin/phing clean prepare
... in: /home/bamboo/xml-data/build-dir/PHPBB3-PR-JOB1
... using extra environment variables:
bamboo_planRepository_1_branch=3.1.x
bamboo_planRepository_1_branchDisplayName=3.1.x
bamboo_repository_revision_number=dc8ff9da28b8ab4ad11c7ea94cca526f17c87fe5
bamboo_PRref=master
bamboo_resultsUrl=https://bamboo.phpbb.com/browse/PHPBB3-PR-JOB1-9529
bamboo_capability_system_builder_command_Git=/usr/bin/git
bamboo_repository_75956235_git_username=bantu
bamboo_build_working_directory=/home/bamboo/xml-data/build-dir/PHPBB3-PR-JOB1
bamboo_planRepository_1_name=phpBB Ascraeus
bamboo_buildKey=PHPBB3-PR-JOB1
bamboo_capability_phpbb_tests=true
bamboo_shortPlanName=Pull Requests
bamboo_capability_system_builder_command_fop=/usr/bin/fop
bamboo_capability_dbms_sqlite_2=true
bamboo_planRepository_name=phpBB Ascraeus
bamboo_PRnumber=5668
bamboo_buildNumber=9529
bamboo_repository_75956235_git_repositoryUrl=https://github.com/phpbb/phpbb.git
bamboo_capability_system_builder_phpunit_PHPUnit=/usr/bin/phpunit
bamboo_shortJobName=Build and Test Job
bamboo_buildResultsUrl=https://bamboo.phpbb.com/browse/PHPBB3-PR-JOB1-9529
bamboo_repository_75956235_branch_name=3.1.x
bamboo_planRepository_repositoryUrl=https://github.com/phpbb/phpbb.git
bamboo_agentId=131073
bamboo_planName=phpBB3 - Pull Requests
bamboo_build_commandline_com_atlassian_bamboo_plugins_scripttask_task_builder_script_7=/bin/sh /home/bamboo/temp/PHPBB3-PR-JOB1-9529-ScriptBuildTask-1210241705812720932.sh
bamboo_shortPlanKey=PR
bamboo_shortJobKey=JOB1
bamboo_capability_dbms_mysql_55=true
bamboo_capability_system_jdk_JDK_1_7_0_65=/usr/lib/jvm/java-7-openjdk-amd64
bamboo_planRepository_revision=dc8ff9da28b8ab4ad11c7ea94cca526f17c87fe5
bamboo_buildTimeStamp=2019-08-29T08:17:26.532Z
bamboo_repository_previous_revision_number=dc8ff9da28b8ab4ad11c7ea94cca526f17c87fe5
bamboo_capability_system_jdk_JDK_1_6_0_16=/usr/lib/jvm/java-6-sun-1.6.0.16
bamboo_capability_system_builder_mvn2_Maven_2=/usr/share/maven2
bamboo_planRepository_previousRevision=dc8ff9da28b8ab4ad11c7ea94cca526f17c87fe5
bamboo_build_commandline_com_atlassian_bamboo_plugins_scripttask_task_builder_script_4=/bin/sh /home/bamboo/temp/PHPBB3-PR-JOB1-9529-ScriptBuildTask-1378036433883455437.sh
bamboo_repository_git_branch=3.1.x
bamboo_buildResultKey=PHPBB3-PR-JOB1-9529
bamboo_repository_branch_name=3.1.x
bamboo_buildPlanName=phpBB3 - Pull Requests - Build and Test Job
bamboo_planRepository_1_revision=dc8ff9da28b8ab4ad11c7ea94cca526f17c87fe5
bamboo_repository_name=phpBB Ascraeus
bamboo_buildFailed=false
bamboo_capability_system_docker_executable=/usr/bin/docker
bamboo_build_commandline_com_atlassian_bamboo_plugins_bamboo_docker_plugin_task_docker_cli_13=/usr/bin/docker build --force-rm=true --tag=phpbb:php-7.1 /home/bamboo/xml-data/build-dir/PHPBB3-PR-JOB1
bamboo_planRepository_branch=3.1.x
bamboo_agentWorkingDirectory=/home/bamboo/xml-data/build-dir
bamboo_capability_system_git_executable=/usr/bin/git
bamboo_capability_system_builder_phpunit_PHPUnit_3_4=/usr/bin/phpunit
bamboo_repository_git_username=bantu
bamboo_planRepository_1_previousRevision=dc8ff9da28b8ab4ad11c7ea94cca526f17c87fe5
bamboo_repository_75956235_revision_number=dc8ff9da28b8ab4ad11c7ea94cca526f17c87fe5
bamboo_planRepository_branchDisplayName=3.1.x
bamboo_planRepository_1_type=gitv2
bamboo_planRepository_branchName=3.1.x
bamboo_repository_75956235_previous_revision_number=dc8ff9da28b8ab4ad11c7ea94cca526f17c87fe5
bamboo_capability_system_jdk_JDK=/usr/lib/jvm/java-6-sun
bamboo_plan_storageTag=PHPBB3-PR
bamboo_hg_cache_directory=/home/bamboo/xml-data/build-dir/_hg-repositories-cache
bamboo_planRepository_1_username=bantu
bamboo_planRepository_type=gitv2
bamboo_git_cache_directory=/home/bamboo/xml-data/build-dir/_git-repositories-cache
bamboo_ManualBuildTriggerReason_userName=Build Robot
bamboo_repository_git_repositoryUrl=https://github.com/phpbb/phpbb.git
bamboo_repository_75956235_git_branch=3.1.x
bamboo_capability_system_builder_ant_Ant=/usr/share/ant
bamboo_repository_75956235_name=phpBB Ascraeus
bamboo_tmp_directory=/home/bamboo/temp
bamboo_working_directory=/home/bamboo/xml-data/build-dir/PHPBB3-PR-JOB1
bamboo_planKey=PHPBB3-PR
bamboo_capability_local=true
bamboo_planRepository_1_repositoryUrl=https://github.com/phpbb/phpbb.git
bamboo_planRepository_username=bantu
bamboo_capability_system_jdk_JDK_1_6=/usr/lib/jvm/java-6-sun
bamboo_capability_system_jdk_JDK_1_7=/usr/lib/jvm/java-7-openjdk-amd64
bamboo_planRepository_1_branchName=3.1.x
29-Aug-2019 08:17:36 Cannot create cache directory /home/bamboo/.composer/cache/repo/https---repo.packagist.org/, or directory is not writable. Proceeding without cache
29-Aug-2019 08:17:36 Cannot create cache directory /home/bamboo/.composer/cache/files/, or directory is not writable. Proceeding without cache
29-Aug-2019 08:17:36 You are using the deprecated option "dev". Dev packages are installed by default now.
29-Aug-2019 08:17:36 Loading composer repositories with package information
29-Aug-2019 08:17:36 Installing dependencies (including require-dev) from lock file
29-Aug-2019 08:17:36 Package operations: 82 installs, 0 updates, 0 removals
29-Aug-2019 08:17:37   - Installing composer/installers (v1.6.0): Downloading (connecting...)Downloading (0%)           Downloading (5%)Downloading (40%)Downloading (45%)Downloading (50%)Downloading (55%)Downloading (60%)Downloading (65%)Downloading (80%)Downloading (85%)Downloading (90%)Downloading (100%)
29-Aug-2019 08:17:37   - Installing ocramius/package-versions (1.4.0): Downloading (connecting...)Downloading (0%)           Downloading (30%)Downloading (60%)Downloading (80%)Downloading (100%)
29-Aug-2019 08:17:38   - Installing bantu/ini-get-wrapper (v1.0.1): Downloading (connecting...)Downloading (100%)         
29-Aug-2019 08:17:38   - Installing symfony/process (v3.4.30): Downloading (connecting...)Downloading (0%)           Downloading (5%)Downloading (20%)Downloading (25%)Downloading (55%)Downloading (60%)Downloading (65%)Downloading (75%)Downloading (80%)Downloading (85%)Downloading (100%)
29-Aug-2019 08:17:39   - Installing symfony/finder (v3.4.30): Downloading (connecting...)Downloading (0%)           Downloading (5%)Downloading (50%)Downloading (55%)Downloading (60%)Downloading (90%)Downloading (95%)Downloading (100%)
29-Aug-2019 08:17:39   - Installing symfony/polyfill-ctype (v1.11.0): Downloading (connecting...)Downloading (0%)           Downloading (100%)
29-Aug-2019 08:17:40   - Installing symfony/filesystem (v3.4.30): Downloading (connecting...)Downloading (0%)           Downloading (5%)Downloading (10%)Downloading (100%)
29-Aug-2019 08:17:40   - Installing symfony/polyfill-mbstring (v1.11.0): Downloading (connecting...)Downloading (0%)           Downloading (30%)Downloading (55%)Downloading (100%)
29-Aug-2019 08:17:41   - Installing psr/log (1.1.0): Downloading (connecting...)Downloading (0%)           Downloading (65%)Downloading (100%)
29-Aug-2019 08:17:41   - Installing symfony/debug (v3.4.30): Downloading (connecting...)Downloading (0%)           Downloading (5%)Downloading (15%)Downloading (20%)Downloading (35%)Downloading (45%)Downloading (50%)Downloading (60%)Downloading (65%)Downloading (75%)Downloading (90%)Downloading (95%)Downloading (100%)
29-Aug-2019 08:17:42   - Installing symfony/console (v3.4.30): Downloading (connecting...)Downloading (0%)           Downloading (5%)Downloading (10%)Downloading (15%)Downloading (20%)Downloading (25%)Downloading (30%)Downloading (35%)Downloading (40%)Downloading (45%)Downloading (50%)Downloading (60%)Downloading (65%)Downloading (70%)Downloading (75%)Downloading (80%)Downloading (85%)Downloading (90%)Downloading (95%)Downloading (100%)
29-Aug-2019 08:17:42   - Installing seld/phar-utils (1.0.1): Downloading (connecting...)Downloading (0%)           Downloading (30%)Downloading (60%)Downloading (90%)Downloading (100%)
29-Aug-2019 08:17:43   - Installing seld/jsonlint (1.7.1): Downloading (connecting...)Downloading (0%)           Downloading (15%)Downloading (85%)Downloading (100%)
29-Aug-2019 08:17:44   - Installing justinrainbow/json-schema (5.2.8): Downloading (connecting...)Downloading (0%)           Downloading (5%)Downloading (15%)Downloading (20%)Downloading (30%)Downloading (35%)Downloading (45%)Downloading (50%)Downloading (70%)Downloading (75%)Downloading (80%)Downloading (100%)
29-Aug-2019 08:17:44   - Installing composer/xdebug-handler (1.3.3): Downloading (connecting...)Downloading (0%)           Downloading (85%)Downloading (100%)
29-Aug-2019 08:17:45   - Installing composer/spdx-licenses (1.5.2): Downloading (connecting...)Downloading (100%)         
29-Aug-2019 08:17:45   - Installing composer/semver (1.5.0): Downloading (connecting...)Downloading (0%)           Downloading (35%)Downloading (85%)Downloading (100%)
29-Aug-2019 08:17:45   - Installing composer/ca-bundle (1.1.4): Downloading (connecting...)Downloading (0%)           Downloading (5%)Downloading (10%)Downloading (15%)Downloading (20%)Downloading (25%)Downloading (30%)Downloading (35%)Downloading (40%)Downloading (45%)Downloading (50%)Downloading (55%)Downloading (60%)Downloading (65%)Downloading (70%)Downloading (75%)Downloading (80%)Downloading (85%)Downloading (90%)Downloading (95%)Downloading (100%)
29-Aug-2019 08:17:46   - Installing composer/composer (1.8.6): Downloading (connecting...)Downloading (100%)         
29-Aug-2019 08:17:47   - Installing google/recaptcha (1.2.2): Downloading (connecting...)Downloading (0%)           Downloading (5%)Downloading (10%)Downloading (50%)Downloading (55%)Downloading (60%)Downloading (90%)Downloading (95%)Downloading (100%)
29-Aug-2019 08:17:47   - Installing guzzlehttp/promises (v1.3.1): Downloading (connecting...)Downloading (0%)           Downloading (30%)Downloading (45%)Downloading (75%)Downloading (100%)
29-Aug-2019 08:17:48   - Installing ralouphie/getallheaders (3.0.3): Downloading (connecting...)Downloading (0%)           Downloading (100%)
29-Aug-2019 08:17:48   - Installing psr/http-message (1.0.1): Downloading (connecting...)Downloading (0%)           Downloading (95%)Downloading (100%)
29-Aug-2019 08:17:48   - Installing guzzlehttp/psr7 (1.6.1): Downloading (connecting...)Downloading (0%)           Downloading (5%)Downloading (10%)Downloading (20%)Downloading (25%)Downloading (30%)Downloading (35%)Downloading (40%)Downloading (80%)Downloading (85%)Downloading (90%)Downloading (95%)Downloading (100%)
29-Aug-2019 08:17:49   - Installing lusitanian/oauth (v0.8.11): Downloading (connecting...)Downloading (100%)         
29-Aug-2019 08:17:50   - Installing marc1706/fast-image-size (v1.1.4): Downloading (connecting...)Downloading (0%)           Downloading (45%)Downloading (100%)
29-Aug-2019 08:17:50   - Installing patchwork/utf8 (v1.3.1): Downloading (connecting...)Downloading (100%)         
29-Aug-2019 08:17:51   - Installing psr/container (1.0.0): Downloading (connecting...)Downloading (0%)           Downloading (75%)Downloading (100%)
29-Aug-2019 08:17:51   - Installing s9e/regexp-builder (1.4.3): Downloading (connecting...)Downloading (100%)         
29-Aug-2019 08:17:52   - Installing s9e/text-formatter (2.1.0): Downloading (connecting...)Downloading (100%)         
29-Aug-2019 08:17:53   - Installing symfony/config (v3.4.30): Downloading (connecting...)Downloading (100%)         
29-Aug-2019 08:17:53   - Installing paragonie/random_compat (v2.0.18): Downloading (connecting...)Downloading (0%)           Downloading (25%)Downloading (50%)Downloading (75%)Downloading (100%)
29-Aug-2019 08:17:54   - Installing symfony/polyfill-php70 (v1.11.0): Downloading (connecting...)Downloading (0%)           Downloading (85%)Downloading (100%)
29-Aug-2019 08:17:54   - Installing symfony/http-foundation (v3.4.30): Downloading (connecting...)Downloading (0%)           Downloading (5%)Downloading (10%)Downloading (15%)Downloading (20%)Downloading (25%)Downloading (30%)Downloading (35%)Downloading (40%)Downloading (45%)Downloading (50%)Downloading (55%)Downloading (60%)Downloading (65%)Downloading (70%)Downloading (75%)Downloading (80%)Downloading (85%)Downloading (90%)Downloading (95%)Downloading (100%)
29-Aug-2019 08:17:55   - Installing symfony/event-dispatcher (v3.4.30): Downloading (connecting...)Downloading (0%)           Downloading (5%)Downloading (45%)Downloading (50%)Downloading (65%)Downloading (70%)Downloading (100%)
29-Aug-2019 08:17:56   - Installing symfony/http-kernel (v3.4.30): Downloading (connecting...)Downloading (0%)           Downloading (5%)Downloading (10%)Downloading (15%)Downloading (20%)Downloading (25%)Downloading (30%)Downloading (35%)Downloading (40%)Downloading (45%)Downloading (50%)Downloading (55%)Downloading (60%)Downloading (65%)Downloading (70%)Downloading (75%)Downloading (80%)Downloading (85%)Downloading (90%)Downloading (95%)Downloading (100%)
29-Aug-2019 08:17:57   - Installing symfony/dependency-injection (v3.4.30): Downloading (connecting...)Downloading (100%)         
29-Aug-2019 08:17:57   - Installing zendframework/zend-eventmanager (3.2.1): Downloading (connecting...)Downloading (0%)           Downloading (15%)Downloading (20%)Downloading (35%)Downloading (45%)Downloading (70%)Downloading (85%)Downloading (90%)Downloading (100%)
29-Aug-2019 08:17:58   - Installing zendframework/zend-code (3.3.1): Downloading (connecting...)Downloading (0%)           Downloading (5%)Downloading (10%)Downloading (15%)Downloading (20%)Downloading (25%)Downloading (30%)Downloading (35%)Downloading (40%)Downloading (45%)Downloading (50%)Downloading (65%)Downloading (70%)Downloading (75%)Downloading (80%)Downloading (85%)Downloading (90%)Downloading (95%)Downloading (100%)
29-Aug-2019 08:17:58   - Installing ocramius/proxy-manager (2.1.1): Downloading (connecting...)Downloading (100%)         
29-Aug-2019 08:17:59   - Installing symfony/proxy-manager-bridge (v3.4.30): Downloading (connecting...)Downloading (0%)           Downloading (25%)Downloading (50%)Downloading (100%)
29-Aug-2019 08:17:59   - Installing symfony/routing (v3.4.30): Downloading (connecting...)Downloading (0%)           Downloading (5%)Downloading (10%)Downloading (15%)Downloading (20%)Downloading (25%)Downloading (30%)Downloading (35%)Downloading (40%)Downloading (45%)Downloading (50%)Downloading (55%)Downloading (60%)Downloading (65%)Downloading (70%)Downloading (75%)Downloading (80%)Downloading (85%)Downloading (90%)Downloading (95%)Downloading (100%)
29-Aug-2019 08:18:00   - Installing twig/twig (v2.11.3): Downloading (connecting...)Downloading (0%)           Downloading (5%)Downloading (10%)Downloading (15%)Downloading (20%)Downloading (25%)Downloading (30%)Downloading (35%)Downloading (40%)Downloading (45%)Downloading (50%)Downloading (55%)Downloading (60%)Downloading (65%)Downloading (70%)Downloading (75%)Downloading (80%)Downloading (85%)Downloading (95%)Downloading (100%)
29-Aug-2019 08:18:01   - Installing symfony/twig-bridge (v3.4.30): Downloading (connecting...)Downloading (0%)           Downloading (5%)Downloading (15%)Downloading (20%)Downloading (25%)Downloading (30%)Downloading (35%)Downloading (40%)Downloading (45%)Downloading (50%)Downloading (55%)Downloading (60%)Downloading (65%)Downloading (70%)Downloading (75%)Downloading (80%)Downloading (85%)Downloading (90%)Downloading (100%)
29-Aug-2019 08:18:01   - Installing symfony/dom-crawler (v3.4.30): Downloading (connecting...)Downloading (0%)           Downloading (5%)Downloading (25%)Downloading (30%)Downloading (65%)Downloading (70%)Downloading (80%)Downloading (85%)Downloading (100%)
29-Aug-2019 08:18:02   - Installing symfony/css-selector (v3.4.30): Downloading (connecting...)Downloading (0%)           Downloading (5%)Downloading (10%)Downloading (45%)Downloading (50%)Downloading (55%)Downloading (60%)Downloading (65%)Downloading (70%)Downloading (100%)
29-Aug-2019 08:18:03   - Installing symfony/browser-kit (v3.4.30): Downloading (connecting...)Downloading (0%)           Downloading (5%)Downloading (70%)Downloading (100%)
29-Aug-2019 08:18:03   - Installing guzzlehttp/guzzle (6.3.3): Downloading (connecting...)Downloading (0%)           Downloading (5%)Downloading (15%)Downloading (20%)Downloading (30%)Downloading (35%)Downloading (40%)Downloading (45%)Downloading (60%)Downloading (65%)Downloading (70%)Downloading (80%)Downloading (85%)Downloading (95%)Downloading (100%)
29-Aug-2019 08:18:04   - Installing fabpot/goutte (v3.2.3): Downloading (connecting...)Downloading (100%)         
29-Aug-2019 08:18:04   - Installing facebook/webdriver (1.7.1): Downloading (connecting...)Downloading (0%)           Downloading (5%)Downloading (10%)Downloading (15%)Downloading (20%)Downloading (25%)Downloading (30%)Downloading (35%)Downloading (40%)Downloading (45%)Downloading (50%)Downloading (55%)Downloading (60%)Downloading (65%)Downloading (70%)Downloading (75%)Downloading (80%)Downloading (85%)Downloading (90%)Downloading (95%)Downloading (100%)
29-Aug-2019 08:18:05   - Installing symfony/yaml (v3.4.30): Downloading (connecting...)Downloading (0%)           Downloading (5%)Downloading (10%)Downloading (15%)Downloading (50%)Downloading (55%)Downloading (85%)Downloading (90%)Downloading (95%)Downloading (100%)
29-Aug-2019 08:18:05   - Installing laravel/homestead (v7.20.0): Downloading (connecting...)Downloading (0%)           Downloading (10%)Downloading (20%)Downloading (35%)Downloading (45%)Downloading (55%)Downloading (65%)Downloading (75%)Downloading (85%)Downloading (95%)Downloading (100%)
29-Aug-2019 08:18:06   - Installing phing/phing (2.16.1): Downloading (connecting...)Downloading (0%)           Downloading (5%)Downloading (10%)Downloading (15%)Downloading (20%)Downloading (25%)Downloading (30%)Downloading (35%)Downloading (40%)Downloading (45%)Downloading (50%)Downloading (55%)Downloading (60%)Downloading (65%)Downloading (70%)Downloading (75%)Downloading (80%)Downloading (85%)Downloading (90%)Downloading (95%)Downloading (100%)
29-Aug-2019 08:18:07   - Installing webmozart/assert (1.4.0): Downloading (connecting...)Downloading (0%)           Downloading (65%)Downloading (85%)Downloading (100%)
29-Aug-2019 08:18:07   - Installing phpdocumentor/reflection-common (1.0.1): Downloading (connecting...)Downloading (0%)           Downloading (100%)
29-Aug-2019 08:18:08   - Installing phpdocumentor/type-resolver (0.4.0): Downloading (connecting...)Downloading (0%)           Downloading (5%)Downloading (100%)
29-Aug-2019 08:18:08   - Installing phpdocumentor/reflection-docblock (4.3.1): Downloading (connecting...)Downloading (0%)           Downloading (5%)Downloading (10%)Downloading (15%)Downloading (20%)Downloading (25%)Downloading (30%)Downloading (35%)Downloading (40%)Downloading (45%)Downloading (55%)Downloading (60%)Downloading (65%)Downloading (70%)Downloading (75%)Downloading (80%)Downloading (85%)Downloading (90%)Downloading (95%)Downloading (100%)
29-Aug-2019 08:18:08   - Installing sebastian/version (2.0.1): Downloading (connecting...)Downloading (0%)           Downloading (100%)
29-Aug-2019 08:18:09   - Installing sebastian/resource-operations (2.0.1): Downloading (connecting...)Downloading (0%)           Downloading (25%)Downloading (45%)Downloading (70%)Downloading (85%)Downloading (100%)
29-Aug-2019 08:18:09   - Installing sebastian/recursion-context (3.0.0): Downloading (connecting...)Downloading (0%)           Downloading (35%)Downloading (70%)Downloading (100%)
29-Aug-2019 08:18:10   - Installing sebastian/object-reflector (1.1.1): Downloading (connecting...)Downloading (0%)           Downloading (65%)Downloading (100%)
29-Aug-2019 08:18:10   - Installing sebastian/object-enumerator (3.0.3): Downloading (connecting...)Downloading (0%)           Downloading (100%)
29-Aug-2019 08:18:11   - Installing sebastian/global-state (2.0.0): Downloading (connecting...)Downloading (0%)           Downloading (20%)Downloading (75%)Downloading (95%)Downloading (100%)
29-Aug-2019 08:18:11   - Installing sebastian/exporter (3.1.0): Downloading (connecting...)Downloading (0%)           Downloading (100%)
29-Aug-2019 08:18:12   - Installing sebastian/environment (4.2.2): Downloading (connecting...)Downloading (0%)           Downloading (35%)Downloading (75%)Downloading (100%)
29-Aug-2019 08:18:12   - Installing sebastian/diff (3.0.2): Downloading (connecting...)Downloading (0%)           Downloading (15%)Downloading (30%)Downloading (50%)Downloading (55%)Downloading (70%)Downloading (75%)Downloading (100%)
29-Aug-2019 08:18:13   - Installing sebastian/comparator (3.0.2): Downloading (connecting...)Downloading (0%)           Downloading (25%)Downloading (50%)Downloading (60%)Downloading (80%)Downloading (90%)Downloading (100%)
29-Aug-2019 08:18:13   - Installing phpunit/php-timer (2.1.2): Downloading (connecting...)Downloading (0%)           Downloading (35%)Downloading (70%)Downloading (90%)Downloading (100%)
29-Aug-2019 08:18:13   - Installing phpunit/php-text-template (1.2.1): Downloading (connecting...)Downloading (0%)           Downloading (35%)Downloading (100%)
29-Aug-2019 08:18:14   - Installing phpunit/php-file-iterator (2.0.2): Downloading (connecting...)Downloading (0%)           Downloading (35%)Downloading (70%)Downloading (100%)
29-Aug-2019 08:18:15   - Installing theseer/tokenizer (1.1.3): Downloading (connecting...)Downloading (0%)           Downloading (15%)Downloading (30%)Downloading (100%)
29-Aug-2019 08:18:15   - Installing sebastian/code-unit-reverse-lookup (1.0.1): Downloading (connecting...)Downloading (0%)           Downloading (55%)Downloading (100%)
29-Aug-2019 08:18:15   - Installing phpunit/php-token-stream (3.1.0): Downloading (connecting...)Downloading (0%)           Downloading (5%)Downloading (35%)Downloading (40%)Downloading (45%)Downloading (100%)
29-Aug-2019 08:18:16   - Installing phpunit/php-code-coverage (6.1.4): Downloading (connecting...)Downloading (0%)           Downloading (5%)Downloading (10%)Downloading (15%)Downloading (20%)Downloading (25%)Downloading (30%)Downloading (35%)Downloading (40%)Downloading (45%)Downloading (50%)Downloading (55%)Downloading (60%)Downloading (65%)Downloading (70%)Downloading (75%)Downloading (80%)Downloading (85%)Downloading (90%)Downloading (95%)Downloading (100%)
29-Aug-2019 08:18:17   - Installing doctrine/instantiator (1.2.0): Downloading (connecting...)Downloading (0%)           Downloading (100%)
29-Aug-2019 08:18:17   - Installing phpspec/prophecy (1.8.1): Downloading (connecting...)Downloading (0%)           Downloading (10%)Downloading (20%)Downloading (35%)Downloading (45%)Downloading (55%)Downloading (60%)Downloading (65%)Downloading (70%)Downloading (75%)Downloading (80%)Downloading (85%)Downloading (90%)Downloading (95%)Downloading (100%)
29-Aug-2019 08:18:18   - Installing phar-io/version (2.0.1): Downloading (connecting...)Downloading (0%)           Downloading (5%)Downloading (10%)Downloading (100%)
29-Aug-2019 08:18:18   - Installing phar-io/manifest (1.0.3): Downloading (connecting...)Downloading (0%)           Downloading (10%)Downloading (15%)Downloading (25%)Downloading (35%)Downloading (40%)Downloading (50%)Downloading (60%)Downloading (70%)Downloading (80%)Downloading (85%)Downloading (95%)Downloading (100%)
29-Aug-2019 08:18:19   - Installing myclabs/deep-copy (1.9.1): Downloading (connecting...)Downloading (0%)           Downloading (25%)Downloading (30%)Downloading (45%)Downloading (50%)Downloading (60%)Downloading (70%)Downloading (75%)Downloading (90%)Downloading (95%)Downloading (100%)
29-Aug-2019 08:18:20   - Installing phpunit/phpunit (7.5.14): Downloading (connecting...)Downloading (0%)           Downloading (5%)Downloading (10%)Downloading (15%)Downloading (20%)Downloading (25%)Downloading (30%)Downloading (35%)Downloading (40%)Downloading (45%)Downloading (50%)Downloading (55%)Downloading (60%)Downloading (65%)Downloading (70%)Downloading (80%)Downloading (85%)Downloading (90%)Downloading (95%)Downloading (100%)
29-Aug-2019 08:18:20   - Installing phpunit/dbunit (4.0.0): Downloading (connecting...)Downloading (100%)         
29-Aug-2019 08:18:21   - Installing squizlabs/php_codesniffer (3.4.2): Downloading (connecting...)Downloading (0%)           Downloading (5%)Downloading (10%)Downloading (15%)Downloading (20%)Downloading (25%)Downloading (30%)Downloading (35%)Downloading (40%)Downloading (45%)Downloading (50%)Downloading (55%)Downloading (60%)Downloading (65%)Downloading (70%)Downloading (75%)Downloading (80%)Downloading (85%)Downloading (90%)Downloading (95%)Downloading (100%)
29-Aug-2019 08:18:22 symfony/console suggests installing symfony/lock
29-Aug-2019 08:18:22 guzzlehttp/psr7 suggests installing zendframework/zend-httphandlerrunner (Emit PSR-7 responses)
29-Aug-2019 08:18:22 lusitanian/oauth suggests installing predis/predis (Allows using the Redis storage backend.)
29-Aug-2019 08:18:22 patchwork/utf8 suggests installing ext-intl (Use Intl for best performance)
29-Aug-2019 08:18:22 patchwork/utf8 suggests installing ext-wfio (Use WFIO for UTF-8 filesystem access on Windows)
29-Aug-2019 08:18:22 s9e/text-formatter suggests installing ext-intl (Allows international URLs to be accepted by the URL filter)
29-Aug-2019 08:18:22 s9e/text-formatter suggests installing ext-xsl (Enables the XSLT renderer)
29-Aug-2019 08:18:22 paragonie/random_compat suggests installing ext-libsodium (Provides a modern crypto API that can be used to generate random bytes.)
29-Aug-2019 08:18:22 symfony/http-kernel suggests installing symfony/var-dumper
29-Aug-2019 08:18:22 symfony/dependency-injection suggests installing symfony/expression-language (For using expressions in service container configuration)
29-Aug-2019 08:18:22 zendframework/zend-eventmanager suggests installing container-interop/container-interop (^1.1.0, to use the lazy listeners feature)
29-Aug-2019 08:18:22 zendframework/zend-eventmanager suggests installing zendframework/zend-stdlib (^2.7.3 || ^3.0, to use the FilterChain feature)
29-Aug-2019 08:18:22 zendframework/zend-code suggests installing doctrine/annotations (Doctrine\Common\Annotations >=1.0 for annotation features)
29-Aug-2019 08:18:22 zendframework/zend-code suggests installing zendframework/zend-stdlib (Zend\Stdlib component)
29-Aug-2019 08:18:22 ocramius/proxy-manager suggests installing ocramius/generated-hydrator (To have very fast object to array to object conversion for ghost objects)
29-Aug-2019 08:18:22 ocramius/proxy-manager suggests installing zendframework/zend-json (To have the JsonRpc adapter (Remote Object feature))
29-Aug-2019 08:18:22 ocramius/proxy-manager suggests installing zendframework/zend-soap (To have the Soap adapter (Remote Object feature))
29-Aug-2019 08:18:22 ocramius/proxy-manager suggests installing zendframework/zend-xmlrpc (To have the XmlRpc adapter (Remote Object feature))
29-Aug-2019 08:18:22 symfony/routing suggests installing doctrine/annotations (For using the annotation loader)
29-Aug-2019 08:18:22 symfony/routing suggests installing symfony/expression-language (For using expression matching)
29-Aug-2019 08:18:22 symfony/twig-bridge suggests installing symfony/asset (For using the AssetExtension)
29-Aug-2019 08:18:22 symfony/twig-bridge suggests installing symfony/expression-language (For using the ExpressionExtension)
29-Aug-2019 08:18:22 symfony/twig-bridge suggests installing symfony/form (For using the FormExtension)
29-Aug-2019 08:18:22 symfony/twig-bridge suggests installing symfony/security (For using the SecurityExtension)
29-Aug-2019 08:18:22 symfony/twig-bridge suggests installing symfony/stopwatch (For using the StopwatchExtension)
29-Aug-2019 08:18:22 symfony/twig-bridge suggests installing symfony/templating (For using the TwigEngine)
29-Aug-2019 08:18:22 symfony/twig-bridge suggests installing symfony/translation (For using the TranslationExtension)
29-Aug-2019 08:18:22 symfony/twig-bridge suggests installing symfony/var-dumper (For using the DumpExtension)
29-Aug-2019 08:18:22 symfony/twig-bridge suggests installing symfony/web-link (For using the WebLinkExtension)
29-Aug-2019 08:18:22 facebook/webdriver suggests installing ext-SimpleXML (For Firefox profile creation)
29-Aug-2019 08:18:22 phing/phing suggests installing pdepend/pdepend (PHP version of JDepend)
29-Aug-2019 08:18:22 phing/phing suggests installing pear/archive_tar (Tar file management class)
29-Aug-2019 08:18:22 phing/phing suggests installing pear/versioncontrol_git (A library that provides OO interface to handle Git repository)
29-Aug-2019 08:18:22 phing/phing suggests installing pear/versioncontrol_svn (A simple OO-style interface for Subversion, the free/open-source version control system)
29-Aug-2019 08:18:22 phing/phing suggests installing phpdocumentor/phpdocumentor (Documentation Generator for PHP)
29-Aug-2019 08:18:22 phing/phing suggests installing phploc/phploc (A tool for quickly measuring the size of a PHP project)
29-Aug-2019 08:18:22 phing/phing suggests installing phpmd/phpmd (PHP version of PMD tool)
29-Aug-2019 08:18:22 phing/phing suggests installing sebastian/phpcpd (Copy/Paste Detector (CPD) for PHP code)
29-Aug-2019 08:18:22 phing/phing suggests installing siad007/versioncontrol_hg (A library for interfacing with Mercurial repositories.)
29-Aug-2019 08:18:22 phing/phing suggests installing tedivm/jshrink (Javascript Minifier built in PHP)
29-Aug-2019 08:18:22 sebastian/global-state suggests installing ext-uopz (*)
29-Aug-2019 08:18:22 phpunit/phpunit suggests installing ext-soap (*)
29-Aug-2019 08:18:22 phpunit/phpunit suggests installing phpunit/php-invoker (^2.0)
29-Aug-2019 08:18:22 Package phpunit/dbunit is abandoned, you should avoid using it. No replacement was suggested.
29-Aug-2019 08:18:22 Generating autoload files
29-Aug-2019 08:18:22 ocramius/package-versions:  Generating version class...
29-Aug-2019 08:18:22 ocramius/package-versions: ...done generating version class
29-Aug-2019 08:18:22 Buildfile: /data/build/build.xml
29-Aug-2019 08:18:22
29-Aug-2019 08:18:22 phpBB > clean:
29-Aug-2019 08:18:22
29-Aug-2019 08:18:22    [delete] Directory /data/build/logs does not exist or is not a directory.
29-Aug-2019 08:18:22    [delete] Directory /data/build/api does not exist or is not a directory.
29-Aug-2019 08:18:22    [delete] Directory /data/build/codebrowser does not exist or is not a directory.
29-Aug-2019 08:18:22    [delete] Directory /data/build/coverage does not exist or is not a directory.
29-Aug-2019 08:18:22    [delete] Directory /data/build/cpd does not exist or is not a directory.
29-Aug-2019 08:18:22    [delete] Directory /data/build/dependencies does not exist or is not a directory.
29-Aug-2019 08:18:22    [delete] Directory /data/build/new_version does not exist or is not a directory.
29-Aug-2019 08:18:22    [delete] Directory /data/build/old_versions does not exist or is not a directory.
29-Aug-2019 08:18:22    [delete] Directory /data/build/save does not exist or is not a directory.
29-Aug-2019 08:18:22
29-Aug-2019 08:18:22 phpBB > prepare:
29-Aug-2019 08:18:22
29-Aug-2019 08:18:22     [mkdir] Created dir: /data/build/logs
29-Aug-2019 08:18:22     [mkdir] Created dir: /data/build/api
29-Aug-2019 08:18:22     [mkdir] Created dir: /data/build/codebrowser
29-Aug-2019 08:18:22     [mkdir] Created dir: /data/build/coverage
29-Aug-2019 08:18:22     [mkdir] Created dir: /data/build/cpd
29-Aug-2019 08:18:22     [mkdir] Created dir: /data/build/dependencies
29-Aug-2019 08:18:22     [mkdir] Created dir: /data/build/new_version
29-Aug-2019 08:18:22     [mkdir] Created dir: /data/build/new_version/files
29-Aug-2019 08:18:22     [mkdir] Created dir: /data/build/new_version/patches
29-Aug-2019 08:18:22     [mkdir] Created dir: /data/build/new_version/release_files
29-Aug-2019 08:18:22     [mkdir] Created dir: /data/build/new_version/update
29-Aug-2019 08:18:22     [mkdir] Created dir: /data/build/old_versions
29-Aug-2019 08:18:22     [mkdir] Created dir: /data/build/save
29-Aug-2019 08:18:22
29-Aug-2019 08:18:22 BUILD FINISHED
29-Aug-2019 08:18:22
29-Aug-2019 08:18:22 Total time: 0.0904 seconds
29-Aug-2019 08:18:22
29-Aug-2019 08:18:22 Finished task 'Prepare directory' with result: Success
29-Aug-2019 08:18:22 Skipping execution of task 'Run sniffs' as it is disabled
29-Aug-2019 08:18:22
Substituting variable: ${bamboo.working.directory} with /home/bamboo/xml-data/build-dir/PHPBB3-PR-JOB1
29-Aug-2019 08:18:22 Starting task 'Run sniffs' of type 'com.atlassian.bamboo.plugins.bamboo-docker-plugin:task.docker.cli'
29-Aug-2019 08:18:22 Running image name (phpbb:php-7.1)
29-Aug-2019 08:18:22
Beginning to execute external process for build 'phpBB3 - Pull Requests - Build and Test Job #9529 (PHPBB3-PR-JOB1-9529)'
... running command line:
/usr/bin/docker run --volume /home/bamboo/xml-data/build-dir/PHPBB3-PR-JOB1:/data --workdir /data/build --rm -u=991 phpbb:php-7.1 ../phpBB/vendor/bin/phing sniff
... in: /home/bamboo/xml-data/build-dir/PHPBB3-PR-JOB1
... using extra environment variables:
bamboo_planRepository_1_branch=3.1.x
bamboo_planRepository_1_branchDisplayName=3.1.x
bamboo_repository_revision_number=dc8ff9da28b8ab4ad11c7ea94cca526f17c87fe5
bamboo_PRref=master
bamboo_resultsUrl=https://bamboo.phpbb.com/browse/PHPBB3-PR-JOB1-9529
bamboo_capability_system_builder_command_Git=/usr/bin/git
bamboo_repository_75956235_git_username=bantu
bamboo_build_working_directory=/home/bamboo/xml-data/build-dir/PHPBB3-PR-JOB1
bamboo_planRepository_1_name=phpBB Ascraeus
bamboo_buildKey=PHPBB3-PR-JOB1
bamboo_capability_phpbb_tests=true
bamboo_shortPlanName=Pull Requests
bamboo_capability_system_builder_command_fop=/usr/bin/fop
bamboo_capability_dbms_sqlite_2=true
bamboo_planRepository_name=phpBB Ascraeus
bamboo_PRnumber=5668
bamboo_buildNumber=9529
bamboo_repository_75956235_git_repositoryUrl=https://github.com/phpbb/phpbb.git
bamboo_capability_system_builder_phpunit_PHPUnit=/usr/bin/phpunit
bamboo_shortJobName=Build and Test Job
bamboo_buildResultsUrl=https://bamboo.phpbb.com/browse/PHPBB3-PR-JOB1-9529
bamboo_repository_75956235_branch_name=3.1.x
bamboo_planRepository_repositoryUrl=https://github.com/phpbb/phpbb.git
bamboo_agentId=131073
bamboo_planName=phpBB3 - Pull Requests
bamboo_build_commandline_com_atlassian_bamboo_plugins_scripttask_task_builder_script_7=/bin/sh /home/bamboo/temp/PHPBB3-PR-JOB1-9529-ScriptBuildTask-1210241705812720932.sh
bamboo_shortPlanKey=PR
bamboo_shortJobKey=JOB1
bamboo_capability_dbms_mysql_55=true
bamboo_capability_system_jdk_JDK_1_7_0_65=/usr/lib/jvm/java-7-openjdk-amd64
bamboo_planRepository_revision=dc8ff9da28b8ab4ad11c7ea94cca526f17c87fe5
bamboo_buildTimeStamp=2019-08-29T08:17:26.532Z
bamboo_repository_previous_revision_number=dc8ff9da28b8ab4ad11c7ea94cca526f17c87fe5
bamboo_capability_system_jdk_JDK_1_6_0_16=/usr/lib/jvm/java-6-sun-1.6.0.16
bamboo_capability_system_builder_mvn2_Maven_2=/usr/share/maven2
bamboo_planRepository_previousRevision=dc8ff9da28b8ab4ad11c7ea94cca526f17c87fe5
bamboo_build_commandline_com_atlassian_bamboo_plugins_scripttask_task_builder_script_4=/bin/sh /home/bamboo/temp/PHPBB3-PR-JOB1-9529-ScriptBuildTask-1378036433883455437.sh
bamboo_repository_git_branch=3.1.x
bamboo_buildResultKey=PHPBB3-PR-JOB1-9529
bamboo_repository_branch_name=3.1.x
bamboo_buildPlanName=phpBB3 - Pull Requests - Build and Test Job
bamboo_planRepository_1_revision=dc8ff9da28b8ab4ad11c7ea94cca526f17c87fe5
bamboo_repository_name=phpBB Ascraeus
bamboo_buildFailed=false
bamboo_capability_system_docker_executable=/usr/bin/docker
bamboo_build_commandline_com_atlassian_bamboo_plugins_bamboo_docker_plugin_task_docker_cli_12=/usr/bin/docker run --volume /home/bamboo/xml-data/build-dir/PHPBB3-PR-JOB1:/data --workdir /data/phpBB --rm -e HOME=/home/bamboo -u=991 phpbb:php-7.1 /bin/bash -c php ../composer.phar install --dev; cd ../build; ../phpBB/vendor/bin/phing clean prepare
bamboo_build_commandline_com_atlassian_bamboo_plugins_bamboo_docker_plugin_task_docker_cli_13=/usr/bin/docker build --force-rm=true --tag=phpbb:php-7.1 /home/bamboo/xml-data/build-dir/PHPBB3-PR-JOB1
bamboo_planRepository_branch=3.1.x
bamboo_agentWorkingDirectory=/home/bamboo/xml-data/build-dir
bamboo_capability_system_git_executable=/usr/bin/git
bamboo_capability_system_builder_phpunit_PHPUnit_3_4=/usr/bin/phpunit
bamboo_repository_git_username=bantu
bamboo_planRepository_1_previousRevision=dc8ff9da28b8ab4ad11c7ea94cca526f17c87fe5
bamboo_repository_75956235_revision_number=dc8ff9da28b8ab4ad11c7ea94cca526f17c87fe5
bamboo_planRepository_branchDisplayName=3.1.x
bamboo_planRepository_1_type=gitv2
bamboo_planRepository_branchName=3.1.x
bamboo_repository_75956235_previous_revision_number=dc8ff9da28b8ab4ad11c7ea94cca526f17c87fe5
bamboo_capability_system_jdk_JDK=/usr/lib/jvm/java-6-sun
bamboo_plan_storageTag=PHPBB3-PR
bamboo_hg_cache_directory=/home/bamboo/xml-data/build-dir/_hg-repositories-cache
bamboo_planRepository_1_username=bantu
bamboo_planRepository_type=gitv2
bamboo_git_cache_directory=/home/bamboo/xml-data/build-dir/_git-repositories-cache
bamboo_ManualBuildTriggerReason_userName=Build Robot
bamboo_repository_git_repositoryUrl=https://github.com/phpbb/phpbb.git
bamboo_repository_75956235_git_branch=3.1.x
bamboo_capability_system_builder_ant_Ant=/usr/share/ant
bamboo_repository_75956235_name=phpBB Ascraeus
bamboo_tmp_directory=/home/bamboo/temp
bamboo_working_directory=/home/bamboo/xml-data/build-dir/PHPBB3-PR-JOB1
bamboo_planKey=PHPBB3-PR
bamboo_capability_local=true
bamboo_planRepository_1_repositoryUrl=https://github.com/phpbb/phpbb.git
bamboo_planRepository_username=bantu
bamboo_capability_system_jdk_JDK_1_6=/usr/lib/jvm/java-6-sun
bamboo_capability_system_jdk_JDK_1_7=/usr/lib/jvm/java-7-openjdk-amd64
bamboo_planRepository_1_branchName=3.1.x
29-Aug-2019 08:18:23 Buildfile: /data/build/build.xml
29-Aug-2019 08:18:23
29-Aug-2019 08:18:23 phpBB > sniff:
29-Aug-2019 08:18:23
29-Aug-2019 08:18:29 ............................................................  60 / 774 (8%)
29-Aug-2019 08:18:30 ............................................................ 120 / 774 (16%)
29-Aug-2019 08:18:30 ............................................................ 180 / 774 (23%)
29-Aug-2019 08:18:31 ............................................................ 240 / 774 (31%)
29-Aug-2019 08:18:33 ............................................................ 300 / 774 (39%)
29-Aug-2019 08:18:37 ............................................................ 360 / 774 (47%)
29-Aug-2019 08:18:40 ............................................................ 420 / 774 (54%)
29-Aug-2019 08:18:44 ............................................................ 480 / 774 (62%)
29-Aug-2019 08:18:48 ............................................................ 540 / 774 (70%)
29-Aug-2019 08:18:51 ............................................................ 600 / 774 (78%)
29-Aug-2019 08:18:54 ............................................................ 660 / 774 (85%)
29-Aug-2019 08:18:57 ............................................................ 720 / 774 (93%)
29-Aug-2019 08:18:59 ......................................................       774 / 774 (100%)
29-Aug-2019 08:18:59
29-Aug-2019 08:18:59
29-Aug-2019 08:18:59 Time: 35.87 secs; Memory: 50.01MB
29-Aug-2019 08:18:59
29-Aug-2019 08:18:59       [php] Calling PHP function: preg_replace()
29-Aug-2019 08:19:04 ............................................................  60 / 209 (29%)
29-Aug-2019 08:19:16 ............................................................ 120 / 209 (57%)
29-Aug-2019 08:19:25 ............................................................ 180 / 209 (86%)
29-Aug-2019 08:19:30 .............................                                209 / 209 (100%)
29-Aug-2019 08:19:30
29-Aug-2019 08:19:30
29-Aug-2019 08:19:30 Time: 31.11 secs; Memory: 40.01MB
29-Aug-2019 08:19:30
29-Aug-2019 08:19:30
29-Aug-2019 08:19:30
29-Aug-2019 08:19:30 Time: 30ms; Memory: 4MB
29-Aug-2019 08:19:30
29-Aug-2019 08:19:30
29-Aug-2019 08:19:30 BUILD FINISHED
29-Aug-2019 08:19:30
29-Aug-2019 08:19:30 Total time: 1 minute  7.35 seconds
29-Aug-2019 08:19:30
29-Aug-2019 08:19:31 Finished task 'Run sniffs' with result: Success
29-Aug-2019 08:19:31 Skipping execution of task 'Run tests' as it is disabled
29-Aug-2019 08:19:31
Substituting variable: ${bamboo.working.directory} with /home/bamboo/xml-data/build-dir/PHPBB3-PR-JOB1
29-Aug-2019 08:19:31 Starting task 'Run tests' of type 'com.atlassian.bamboo.plugins.bamboo-docker-plugin:task.docker.cli'
29-Aug-2019 08:19:31 Running image name (phpbb:php-7.1)
29-Aug-2019 08:19:31
Beginning to execute external process for build 'phpBB3 - Pull Requests - Build and Test Job #9529 (PHPBB3-PR-JOB1-9529)'
... running command line:
/usr/bin/docker run --volume /home/bamboo/xml-data/build-dir/PHPBB3-PR-JOB1:/data --workdir /data --rm -u=991 -t phpbb:php-7.1 /bin/bash -c phpBB/vendor/bin/phpunit --log-junit build/logs/phpunit.xml
... in: /home/bamboo/xml-data/build-dir/PHPBB3-PR-JOB1
... using extra environment variables:
bamboo_planRepository_1_branch=3.1.x
bamboo_planRepository_1_branchDisplayName=3.1.x
bamboo_repository_revision_number=dc8ff9da28b8ab4ad11c7ea94cca526f17c87fe5
bamboo_PRref=master
bamboo_resultsUrl=https://bamboo.phpbb.com/browse/PHPBB3-PR-JOB1-9529
bamboo_capability_system_builder_command_Git=/usr/bin/git
bamboo_repository_75956235_git_username=bantu
bamboo_build_working_directory=/home/bamboo/xml-data/build-dir/PHPBB3-PR-JOB1
bamboo_planRepository_1_name=phpBB Ascraeus
bamboo_buildKey=PHPBB3-PR-JOB1
bamboo_capability_phpbb_tests=true
bamboo_shortPlanName=Pull Requests
bamboo_capability_system_builder_command_fop=/usr/bin/fop
bamboo_capability_dbms_sqlite_2=true
bamboo_planRepository_name=phpBB Ascraeus
bamboo_PRnumber=5668
bamboo_buildNumber=9529
bamboo_repository_75956235_git_repositoryUrl=https://github.com/phpbb/phpbb.git
bamboo_capability_system_builder_phpunit_PHPUnit=/usr/bin/phpunit
bamboo_shortJobName=Build and Test Job
bamboo_buildResultsUrl=https://bamboo.phpbb.com/browse/PHPBB3-PR-JOB1-9529
bamboo_repository_75956235_branch_name=3.1.x
bamboo_planRepository_repositoryUrl=https://github.com/phpbb/phpbb.git
bamboo_agentId=131073
bamboo_planName=phpBB3 - Pull Requests
bamboo_build_commandline_com_atlassian_bamboo_plugins_scripttask_task_builder_script_7=/bin/sh /home/bamboo/temp/PHPBB3-PR-JOB1-9529-ScriptBuildTask-1210241705812720932.sh
bamboo_shortPlanKey=PR
bamboo_shortJobKey=JOB1
bamboo_capability_dbms_mysql_55=true
bamboo_capability_system_jdk_JDK_1_7_0_65=/usr/lib/jvm/java-7-openjdk-amd64
bamboo_planRepository_revision=dc8ff9da28b8ab4ad11c7ea94cca526f17c87fe5
bamboo_buildTimeStamp=2019-08-29T08:17:26.532Z
bamboo_repository_previous_revision_number=dc8ff9da28b8ab4ad11c7ea94cca526f17c87fe5
bamboo_capability_system_jdk_JDK_1_6_0_16=/usr/lib/jvm/java-6-sun-1.6.0.16
bamboo_capability_system_builder_mvn2_Maven_2=/usr/share/maven2
bamboo_planRepository_previousRevision=dc8ff9da28b8ab4ad11c7ea94cca526f17c87fe5
bamboo_build_commandline_com_atlassian_bamboo_plugins_scripttask_task_builder_script_4=/bin/sh /home/bamboo/temp/PHPBB3-PR-JOB1-9529-ScriptBuildTask-1378036433883455437.sh
bamboo_repository_git_branch=3.1.x
bamboo_buildResultKey=PHPBB3-PR-JOB1-9529
bamboo_repository_branch_name=3.1.x
bamboo_buildPlanName=phpBB3 - Pull Requests - Build and Test Job
bamboo_planRepository_1_revision=dc8ff9da28b8ab4ad11c7ea94cca526f17c87fe5
bamboo_repository_name=phpBB Ascraeus
bamboo_buildFailed=false
bamboo_capability_system_docker_executable=/usr/bin/docker
bamboo_build_commandline_com_atlassian_bamboo_plugins_bamboo_docker_plugin_task_docker_cli_11=/usr/bin/docker run --volume /home/bamboo/xml-data/build-dir/PHPBB3-PR-JOB1:/data --workdir /data/build --rm -u=991 phpbb:php-7.1 ../phpBB/vendor/bin/phing sniff
bamboo_build_commandline_com_atlassian_bamboo_plugins_bamboo_docker_plugin_task_docker_cli_12=/usr/bin/docker run --volume /home/bamboo/xml-data/build-dir/PHPBB3-PR-JOB1:/data --workdir /data/phpBB --rm -e HOME=/home/bamboo -u=991 phpbb:php-7.1 /bin/bash -c php ../composer.phar install --dev; cd ../build; ../phpBB/vendor/bin/phing clean prepare
bamboo_build_commandline_com_atlassian_bamboo_plugins_bamboo_docker_plugin_task_docker_cli_13=/usr/bin/docker build --force-rm=true --tag=phpbb:php-7.1 /home/bamboo/xml-data/build-dir/PHPBB3-PR-JOB1
bamboo_planRepository_branch=3.1.x
bamboo_agentWorkingDirectory=/home/bamboo/xml-data/build-dir
bamboo_capability_system_git_executable=/usr/bin/git
bamboo_capability_system_builder_phpunit_PHPUnit_3_4=/usr/bin/phpunit
bamboo_repository_git_username=bantu
bamboo_planRepository_1_previousRevision=dc8ff9da28b8ab4ad11c7ea94cca526f17c87fe5
bamboo_repository_75956235_revision_number=dc8ff9da28b8ab4ad11c7ea94cca526f17c87fe5
bamboo_planRepository_branchDisplayName=3.1.x
bamboo_planRepository_1_type=gitv2
bamboo_planRepository_branchName=3.1.x
bamboo_repository_75956235_previous_revision_number=dc8ff9da28b8ab4ad11c7ea94cca526f17c87fe5
bamboo_capability_system_jdk_JDK=/usr/lib/jvm/java-6-sun
bamboo_plan_storageTag=PHPBB3-PR
bamboo_hg_cache_directory=/home/bamboo/xml-data/build-dir/_hg-repositories-cache
bamboo_planRepository_1_username=bantu
bamboo_planRepository_type=gitv2
bamboo_git_cache_directory=/home/bamboo/xml-data/build-dir/_git-repositories-cache
bamboo_ManualBuildTriggerReason_userName=Build Robot
bamboo_repository_git_repositoryUrl=https://github.com/phpbb/phpbb.git
bamboo_repository_75956235_git_branch=3.1.x
bamboo_capability_system_builder_ant_Ant=/usr/share/ant
bamboo_repository_75956235_name=phpBB Ascraeus
bamboo_tmp_directory=/home/bamboo/temp
bamboo_working_directory=/home/bamboo/xml-data/build-dir/PHPBB3-PR-JOB1
bamboo_planKey=PHPBB3-PR
bamboo_capability_local=true
bamboo_planRepository_1_repositoryUrl=https://github.com/phpbb/phpbb.git
bamboo_planRepository_username=bantu
bamboo_capability_system_jdk_JDK_1_6=/usr/lib/jvm/java-6-sun
bamboo_capability_system_jdk_JDK_1_7=/usr/lib/jvm/java-7-openjdk-amd64
bamboo_planRepository_1_branchName=3.1.x
29-Aug-2019 08:19:33 PHPUnit 7.5.14 by Sebastian Bergmann and contributors.
29-Aug-2019 08:19:33
29-Aug-2019 08:19:39 .............................................................   61 / 7231 (  0%)
29-Aug-2019 08:19:39 .............................................................  122 / 7231 (  1%)
29-Aug-2019 08:19:40 .............I.....SSSSSSSS............SSSS.........S...S....  183 / 7231 (  2%)
29-Aug-2019 08:19:41 .............................................................  244 / 7231 (  3%)
29-Aug-2019 08:19:48 .....S.......................................................  305 / 7231 (  4%)
29-Aug-2019 08:19:48 .............................................................  366 / 7231 (  5%)
29-Aug-2019 08:19:49 .............................................................  427 / 7231 (  5%)
29-Aug-2019 08:19:49 .............................................................  488 / 7231 (  6%)
29-Aug-2019 08:19:49 .............................................................  549 / 7231 (  7%)
29-Aug-2019 08:19:49 .............................................................  610 / 7231 (  8%)
29-Aug-2019 08:19:50 .............................................................  671 / 7231 (  9%)
29-Aug-2019 08:19:50 .............................................................  732 / 7231 ( 10%)
29-Aug-2019 08:19:50 .............................................................  793 / 7231 ( 10%)
29-Aug-2019 08:19:51 .............................................................  854 / 7231 ( 11%)
29-Aug-2019 08:19:51 .............................................................  915 / 7231 ( 12%)
29-Aug-2019 08:19:51 .............................................................  976 / 7231 ( 13%)
29-Aug-2019 08:19:52 ............................................................. 1037 / 7231 ( 14%)
29-Aug-2019 08:19:56 ................................................I............ 1098 / 7231 ( 15%)
29-Aug-2019 08:20:00 ............................................................. 1159 / 7231 ( 16%)
29-Aug-2019 08:20:06 ............................................................. 1220 / 7231 ( 16%)
29-Aug-2019 08:20:09 .......................................S.S.S................. 1281 / 7231 ( 17%)
29-Aug-2019 08:20:09 ............................................................. 1342 / 7231 ( 18%)
29-Aug-2019 08:20:09 ............................................................. 1403 / 7231 ( 19%)
29-Aug-2019 08:20:09 ..............................................E.............. 1464 / 7231 ( 20%)
29-Aug-2019 08:20:09 ............................................................. 1525 / 7231 ( 21%)
29-Aug-2019 08:20:09 ............................................................. 1586 / 7231 ( 21%)
29-Aug-2019 08:20:09 ............................................................. 1647 / 7231 ( 22%)
29-Aug-2019 08:20:09 ............................................................. 1708 / 7231 ( 23%)
29-Aug-2019 08:20:10 ............................................................. 1769 / 7231 ( 24%)
29-Aug-2019 08:20:10 ............................................................. 1830 / 7231 ( 25%)
29-Aug-2019 08:20:10 ............................................................. 1891 / 7231 ( 26%)
29-Aug-2019 08:20:10 ............................................................. 1952 / 7231 ( 26%)
29-Aug-2019 08:20:10 ............................................................. 2013 / 7231 ( 27%)
29-Aug-2019 08:20:10 ............................................................. 2074 / 7231 ( 28%)
29-Aug-2019 08:20:10 ............................................................. 2135 / 7231 ( 29%)
29-Aug-2019 08:20:11 ............................................................. 2196 / 7231 ( 30%)
29-Aug-2019 08:20:12 ............................................................. 2257 / 7231 ( 31%)
29-Aug-2019 08:20:12 ............................................................. 2318 / 7231 ( 32%)
29-Aug-2019 08:20:13 ............................................................. 2379 / 7231 ( 32%)
29-Aug-2019 08:20:16 ..............I.II........................................... 2440 / 7231 ( 33%)
29-Aug-2019 08:20:16 ............................................................. 2501 / 7231 ( 34%)
29-Aug-2019 08:20:16 ............................................................. 2562 / 7231 ( 35%)
29-Aug-2019 08:20:17 ............................................................. 2623 / 7231 ( 36%)
29-Aug-2019 08:20:17 ............................................................. 2684 / 7231 ( 37%)
29-Aug-2019 08:20:20 ............................................................. 2745 / 7231 ( 37%)
29-Aug-2019 08:20:20 ............................................................. 2806 / 7231 ( 38%)
29-Aug-2019 08:20:20 ............................................................. 2867 / 7231 ( 39%)
29-Aug-2019 08:20:22 ............................................................. 2928 / 7231 ( 40%)
29-Aug-2019 08:20:32 ............................................................. 2989 / 7231 ( 41%)
29-Aug-2019 08:20:37 ............................................................. 3050 / 7231 ( 42%)
29-Aug-2019 08:20:41 ......................S...................................... 3111 / 7231 ( 43%)
29-Aug-2019 08:20:42 ............................................................. 3172 / 7231 ( 43%)
29-Aug-2019 08:20:48 ............................................................. 3233 / 7231 ( 44%)
29-Aug-2019 08:20:54 ..................................................SSSSSSS.... 3294 / 7231 ( 45%)
29-Aug-2019 08:21:05 ............................................................. 3355 / 7231 ( 46%)
29-Aug-2019 08:21:05 ............................................................. 3416 / 7231 ( 47%)
29-Aug-2019 08:21:06 ............................................................. 3477 / 7231 ( 48%)
29-Aug-2019 08:21:06 ............................................................. 3538 / 7231 ( 48%)
29-Aug-2019 08:21:06 ............................................................. 3599 / 7231 ( 49%)
29-Aug-2019 08:21:07 ............................................................. 3660 / 7231 ( 50%)
29-Aug-2019 08:21:07 ............................................................. 3721 / 7231 ( 51%)
29-Aug-2019 08:21:07 ............................................................. 3782 / 7231 ( 52%)
29-Aug-2019 08:21:07 ............................................................. 3843 / 7231 ( 53%)
29-Aug-2019 08:21:09 ............................................................. 3904 / 7231 ( 53%)
29-Aug-2019 08:21:09 ............................................................. 3965 / 7231 ( 54%)
29-Aug-2019 08:21:12 ............................................................. 4026 / 7231 ( 55%)
29-Aug-2019 08:21:13 ............................................................. 4087 / 7231 ( 56%)
29-Aug-2019 08:21:13 ............................................................. 4148 / 7231 ( 57%)
29-Aug-2019 08:21:15 ............................................................. 4209 / 7231 ( 58%)
29-Aug-2019 08:21:22 ............................................................. 4270 / 7231 ( 59%)
29-Aug-2019 08:21:26 ............................................................. 4331 / 7231 ( 59%)
29-Aug-2019 08:21:26 ............................................................. 4392 / 7231 ( 60%)
29-Aug-2019 08:21:27 ............................................................. 4453 / 7231 ( 61%)
29-Aug-2019 08:21:27 ............................................................. 4514 / 7231 ( 62%)
29-Aug-2019 08:21:27 ............................................................. 4575 / 7231 ( 63%)
29-Aug-2019 08:21:27 ............................................................. 4636 / 7231 ( 64%)
29-Aug-2019 08:21:27 ............................................................. 4697 / 7231 ( 64%)
29-Aug-2019 08:21:27 ............................................................. 4758 / 7231 ( 65%)
29-Aug-2019 08:21:27 ............................................................. 4819 / 7231 ( 66%)
29-Aug-2019 08:21:27 ............................................................. 4880 / 7231 ( 67%)
29-Aug-2019 08:21:29 ............................................................. 4941 / 7231 ( 68%)
29-Aug-2019 08:21:38 ..................................................S.......... 5002 / 7231 ( 69%)
29-Aug-2019 08:21:45 ............................................................. 5063 / 7231 ( 70%)
29-Aug-2019 08:22:02 ............................................................. 5124 / 7231 ( 70%)
29-Aug-2019 08:22:06 ............................................................. 5185 / 7231 ( 71%)
29-Aug-2019 08:22:06 ............................................................. 5246 / 7231 ( 72%)
29-Aug-2019 08:22:07 ............................................................. 5307 / 7231 ( 73%)
29-Aug-2019 08:22:07 ............................................................. 5368 / 7231 ( 74%)
29-Aug-2019 08:22:07 ......SSSSSSSSSSSSSSSSSSSSSSSSSSSSSSSSSSSSSSSSSSSSSSSSSSSSSSS 5429 / 7231 ( 75%)
29-Aug-2019 08:22:07 SSSSSSSSSSSSSSSSSSSSSSSSSSSSSSSSSSSSSSSSSSSSSSSSSSSSSSSSSSSSS 5490 / 7231 ( 75%)
29-Aug-2019 08:22:07 SSSSSSSSSSSSSSSSSSSSSSSSSSSSSSSSSSSSSSSSSSSSSSSSSSSSSSSSSSSSS 5551 / 7231 ( 76%)
29-Aug-2019 08:22:08 SSSSSSSSSSSSSSSSSSSSSSSSSSSSSSS.............................. 5612 / 7231 ( 77%)
29-Aug-2019 08:22:10 ............................................................. 5673 / 7231 ( 78%)
29-Aug-2019 08:22:12 ............................................................. 5734 / 7231 ( 79%)
29-Aug-2019 08:22:14 ............................................................. 5795 / 7231 ( 80%)
29-Aug-2019 08:22:17 ............................................................. 5856 / 7231 ( 80%)
29-Aug-2019 08:22:19 ............................................................. 5917 / 7231 ( 81%)
29-Aug-2019 08:22:21 ............................................................. 5978 / 7231 ( 82%)
29-Aug-2019 08:22:23 ............................................................. 6039 / 7231 ( 83%)
29-Aug-2019 08:22:25 ............................................................. 6100 / 7231 ( 84%)
29-Aug-2019 08:22:27 ............................................................. 6161 / 7231 ( 85%)
29-Aug-2019 08:22:29 ............................................................. 6222 / 7231 ( 86%)
29-Aug-2019 08:22:31 ............................................................. 6283 / 7231 ( 86%)
29-Aug-2019 08:22:33 ............................................................. 6344 / 7231 ( 87%)
29-Aug-2019 08:22:35 ............................................................. 6405 / 7231 ( 88%)
29-Aug-2019 08:22:37 ............................................................. 6466 / 7231 ( 89%)
29-Aug-2019 08:22:39 ............................................................. 6527 / 7231 ( 90%)
29-Aug-2019 08:22:41 ............................................................. 6588 / 7231 ( 91%)
29-Aug-2019 08:22:43 ............................................................. 6649 / 7231 ( 91%)
29-Aug-2019 08:22:45 ............................................................. 6710 / 7231 ( 92%)
29-Aug-2019 08:22:47 ............................................................. 6771 / 7231 ( 93%)
29-Aug-2019 08:22:49 ............................................................. 6832 / 7231 ( 94%)
29-Aug-2019 08:22:52 ............................................................. 6893 / 7231 ( 95%)
29-Aug-2019 08:22:54 ............................................................. 6954 / 7231 ( 96%)
29-Aug-2019 08:22:56 ............................................................. 7015 / 7231 ( 97%)
29-Aug-2019 08:22:58 ............................................................. 7076 / 7231 ( 97%)
29-Aug-2019 08:23:00 ............................................................. 7137 / 7231 ( 98%)
29-Aug-2019 08:23:01 ............................................SS
29-Aug-2019 08:23:01
29-Aug-2019 08:23:01 Time: 3.5 minutes, Memory: 258.00 MB
29-Aug-2019 08:23:01
29-Aug-2019 08:23:01 There was 1 error:
29-Aug-2019 08:23:01
29-Aug-2019 08:23:01 1) phpbb_event_export_php_test::test_crawl_php_file with data set #128 ('includes/functions_admin.php')
29-Aug-2019 08:23:01 LogicException: Invalid '@since' information for event 'core.move_topics_before' in file 'includes/functions_admin.php:557'
29-Aug-2019 08:23:01
29-Aug-2019 08:23:01 /data/phpBB/phpbb/event/php_exporter.php:666
29-Aug-2019 08:23:01 /data/phpBB/phpbb/event/php_exporter.php:235
29-Aug-2019 08:23:01 /data/tests/event/export_php_test.php:47
29-Aug-2019 08:23:01
29-Aug-2019 08:23:01 ERRORS!
29-Aug-2019 08:23:01 Tests: 7231, Assertions: 121113, Errors: 1, Skipped: 237, Incomplete: 5.
29-Aug-2019 08:23:02 Error occurred while running Task 'Run tests(10)' of type com.atlassian.bamboo.plugins.bamboo-docker-plugin:task.docker.cli.
29-Aug-2019 08:23:02 com.atlassian.bamboo.task.TaskException: Failed to execute task
29-Aug-2019 08:23:02         at com.atlassian.bamboo.plugins.docker.service.RunService.execute(RunService.java:75)
29-Aug-2019 08:23:02         at com.atlassian.bamboo.plugins.docker.tasks.cli.DockerCliTask.execute(DockerCliTask.java:70)
29-Aug-2019 08:23:02         at com.atlassian.bamboo.task.TaskExecutorImpl.lambda$executeTasks$3(TaskExecutorImpl.java:285)
29-Aug-2019 08:23:02         at com.atlassian.bamboo.task.TaskExecutorImpl.executeTaskWithPrePostActions(TaskExecutorImpl.java:224)
29-Aug-2019 08:23:02         at com.atlassian.bamboo.task.TaskExecutorImpl.executeTasks(TaskExecutorImpl.java:285)
29-Aug-2019 08:23:02         at com.atlassian.bamboo.task.TaskExecutorImpl.execute(TaskExecutorImpl.java:112)
29-Aug-2019 08:23:02         at com.atlassian.bamboo.build.pipeline.tasks.ExecuteBuildTask.call(ExecuteBuildTask.java:71)
29-Aug-2019 08:23:02         at com.atlassian.bamboo.v2.build.agent.DefaultBuildAgent.executeBuildPhase(DefaultBuildAgent.java:203)
29-Aug-2019 08:23:02         at com.atlassian.bamboo.v2.build.agent.DefaultBuildAgent.build(DefaultBuildAgent.java:175)
29-Aug-2019 08:23:02         at com.atlassian.bamboo.v2.build.agent.BuildAgentControllerImpl.lambda$waitAndPerformBuild$0(BuildAgentControllerImpl.java:122)
29-Aug-2019 08:23:02         at com.atlassian.bamboo.variable.CustomVariableContextImpl.withVariableSubstitutor(CustomVariableContextImpl.java:185)
29-Aug-2019 08:23:02         at com.atlassian.bamboo.v2.build.agent.BuildAgentControllerImpl.waitAndPerformBuild(BuildAgentControllerImpl.java:117)
29-Aug-2019 08:23:02         at com.atlassian.bamboo.v2.build.agent.DefaultBuildAgent$1.run(DefaultBuildAgent.java:126)
29-Aug-2019 08:23:02         at com.atlassian.bamboo.utils.BambooRunnables$1.run(BambooRunnables.java:48)
29-Aug-2019 08:23:02         at com.atlassian.bamboo.security.ImpersonationHelper.runWith(ImpersonationHelper.java:26)
29-Aug-2019 08:23:02         at com.atlassian.bamboo.security.ImpersonationHelper.runWithSystemAuthority(ImpersonationHelper.java:17)
29-Aug-2019 08:23:02         at com.atlassian.bamboo.security.ImpersonationHelper$1.run(ImpersonationHelper.java:41)
29-Aug-2019 08:23:02         at java.lang.Thread.run(Thread.java:748)
29-Aug-2019 08:23:02 Caused by: com.atlassian.bamboo.docker.DockerException: Error running Docker run command
29-Aug-2019 08:23:02         at com.atlassian.bamboo.docker.DockerContainerServiceImpl.run(DockerContainerServiceImpl.java:118)
29-Aug-2019 08:23:02         at sun.reflect.GeneratedMethodAccessor2260.invoke(Unknown Source)
29-Aug-2019 08:23:02         at sun.reflect.DelegatingMethodAccessorImpl.invoke(DelegatingMethodAccessorImpl.java:43)
29-Aug-2019 08:23:02         at java.lang.reflect.Method.invoke(Method.java:498)
29-Aug-2019 08:23:02         at com.atlassian.plugin.util.ContextClassLoaderSettingInvocationHandler.invoke(ContextClassLoaderSettingInvocationHandler.java:26)
29-Aug-2019 08:23:02         at com.sun.proxy.$Proxy401.run(Unknown Source)
29-Aug-2019 08:23:02         at sun.reflect.GeneratedMethodAccessor2260.invoke(Unknown Source)
29-Aug-2019 08:23:02         at sun.reflect.DelegatingMethodAccessorImpl.invoke(DelegatingMethodAccessorImpl.java:43)
29-Aug-2019 08:23:02         at java.lang.reflect.Method.invoke(Method.java:498)
29-Aug-2019 08:23:02         at org.springframework.aop.support.AopUtils.invokeJoinpointUsingReflection(AopUtils.java:302)
29-Aug-2019 08:23:02         at org.eclipse.gemini.blueprint.service.importer.support.internal.aop.ServiceInvoker.doInvoke(ServiceInvoker.java:56)
29-Aug-2019 08:23:02         at org.eclipse.gemini.blueprint.service.importer.support.internal.aop.ServiceInvoker.invoke(ServiceInvoker.java:60)
29-Aug-2019 08:23:02         at org.springframework.aop.framework.ReflectiveMethodInvocation.proceed(ReflectiveMethodInvocation.java:179)
29-Aug-2019 08:23:02         at org.springframework.aop.support.DelegatingIntroductionInterceptor.doProceed(DelegatingIntroductionInterceptor.java:133)
29-Aug-2019 08:23:02         at org.springframework.aop.support.DelegatingIntroductionInterceptor.invoke(DelegatingIntroductionInterceptor.java:121)
29-Aug-2019 08:23:02         at org.springframework.aop.framework.ReflectiveMethodInvocation.proceed(ReflectiveMethodInvocation.java:179)
29-Aug-2019 08:23:02         at org.eclipse.gemini.blueprint.service.util.internal.aop.ServiceTCCLInterceptor.invokeUnprivileged(ServiceTCCLInterceptor.java:70)
29-Aug-2019 08:23:02         at org.eclipse.gemini.blueprint.service.util.internal.aop.ServiceTCCLInterceptor.invoke(ServiceTCCLInterceptor.java:53)
29-Aug-2019 08:23:02         at org.springframework.aop.framework.ReflectiveMethodInvocation.proceed(ReflectiveMethodInvocation.java:179)
29-Aug-2019 08:23:02         at org.eclipse.gemini.blueprint.service.importer.support.LocalBundleContextAdvice.invoke(LocalBundleContextAdvice.java:57)
29-Aug-2019 08:23:02         at org.springframework.aop.framework.ReflectiveMethodInvocation.proceed(ReflectiveMethodInvocation.java:179)
29-Aug-2019 08:23:02         at org.springframework.aop.support.DelegatingIntroductionInterceptor.doProceed(DelegatingIntroductionInterceptor.java:133)
29-Aug-2019 08:23:02         at org.springframework.aop.support.DelegatingIntroductionInterceptor.invoke(DelegatingIntroductionInterceptor.java:121)
29-Aug-2019 08:23:02         at org.springframework.aop.framework.ReflectiveMethodInvocation.proceed(ReflectiveMethodInvocation.java:179)
29-Aug-2019 08:23:02         at org.springframework.aop.framework.JdkDynamicAopProxy.invoke(JdkDynamicAopProxy.java:207)
29-Aug-2019 08:23:02         at com.sun.proxy.$Proxy662.run(Unknown Source)
29-Aug-2019 08:23:02         at com.atlassian.bamboo.plugins.docker.client.DockerCmd.run(DockerCmd.java:51)
29-Aug-2019 08:23:02         at com.atlassian.bamboo.plugins.docker.service.RunService.execute(RunService.java:64)
29-Aug-2019 08:23:02         ... 17 more
29-Aug-2019 08:23:02 Caused by: com.atlassian.utils.process.ProcessException: Error executing /usr/bin/docker run --volume /home/bamboo/xml-data/build-dir/PHPBB3-PR-JOB1:/data --workdir /data --rm -u=991 -t phpbb:php-7.1 /bin/bash -c "phpBB/vendor/bin/phpunit --log-junit build/logs/phpunit.xml"
29-Aug-2019 08:23:02         at com.atlassian.bamboo.docker.DockerContainerServiceImpl.execute(DockerContainerServiceImpl.java:252)
29-Aug-2019 08:23:02         at com.atlassian.bamboo.docker.DockerContainerServiceImpl.run(DockerContainerServiceImpl.java:106)
29-Aug-2019 08:23:02         ... 44 more
29-Aug-2019 08:23:02 Starting task 'Parsing test results produced by script' of type 'com.atlassian.bamboo.plugins.testresultparser:task.testresultparser.junit'
29-Aug-2019 08:23:02 Parsing test results under /home/bamboo/xml-data/build-dir/PHPBB3-PR-JOB1...
29-Aug-2019 08:23:02 Failing task since 1 failing test cases were found.
29-Aug-2019 08:23:02 Finished task 'Parsing test results produced by script' with result: Failed
29-Aug-2019 08:23:02
Substituting variable: ${bamboo.PRnumber} with 5668
29-Aug-2019 08:23:02
Substituting variable: ${bamboo.buildResultsUrl} with https://bamboo.phpbb.com/browse/PHPBB3-PR-JOB1-9529
29-Aug-2019 08:23:02
Substituting variable: ${bamboo.buildResultsUrl} with https://bamboo.phpbb.com/browse/PHPBB3-PR-JOB1-9529
29-Aug-2019 08:23:02 Starting task 'Set result build status' of type 'com.atlassian.bamboo.plugins.scripttask:task.builder.script'
29-Aug-2019 08:23:02
Beginning to execute external process for build 'phpBB3 - Pull Requests - Build and Test Job #9529 (PHPBB3-PR-JOB1-9529)'
... running command line:
/bin/sh /home/bamboo/temp/PHPBB3-PR-JOB1-9529-ScriptBuildTask-1355646770068467810.sh
... in: /home/bamboo/xml-data/build-dir/PHPBB3-PR-JOB1
... using extra environment variables:
bamboo_planRepository_1_branch=3.1.x
bamboo_planRepository_1_branchDisplayName=3.1.x
bamboo_repository_revision_number=dc8ff9da28b8ab4ad11c7ea94cca526f17c87fe5
bamboo_PRref=master
bamboo_resultsUrl=https://bamboo.phpbb.com/browse/PHPBB3-PR-JOB1-9529
bamboo_capability_system_builder_command_Git=/usr/bin/git
bamboo_repository_75956235_git_username=bantu
bamboo_build_working_directory=/home/bamboo/xml-data/build-dir/PHPBB3-PR-JOB1
bamboo_planRepository_1_name=phpBB Ascraeus
bamboo_buildKey=PHPBB3-PR-JOB1
bamboo_capability_phpbb_tests=true
bamboo_shortPlanName=Pull Requests
bamboo_capability_system_builder_command_fop=/usr/bin/fop
bamboo_capability_dbms_sqlite_2=true
bamboo_planRepository_name=phpBB Ascraeus
bamboo_PRnumber=5668
bamboo_buildNumber=9529
bamboo_repository_75956235_git_repositoryUrl=https://github.com/phpbb/phpbb.git
bamboo_capability_system_builder_phpunit_PHPUnit=/usr/bin/phpunit
bamboo_shortJobName=Build and Test Job
bamboo_buildResultsUrl=https://bamboo.phpbb.com/browse/PHPBB3-PR-JOB1-9529
bamboo_repository_75956235_branch_name=3.1.x
bamboo_planRepository_repositoryUrl=https://github.com/phpbb/phpbb.git
bamboo_agentId=131073
bamboo_planName=phpBB3 - Pull Requests
bamboo_build_commandline_com_atlassian_bamboo_plugins_scripttask_task_builder_script_7=/bin/sh /home/bamboo/temp/PHPBB3-PR-JOB1-9529-ScriptBuildTask-1210241705812720932.sh
bamboo_shortPlanKey=PR
bamboo_shortJobKey=JOB1
bamboo_capability_dbms_mysql_55=true
bamboo_capability_system_jdk_JDK_1_7_0_65=/usr/lib/jvm/java-7-openjdk-amd64
bamboo_planRepository_revision=dc8ff9da28b8ab4ad11c7ea94cca526f17c87fe5
bamboo_buildTimeStamp=2019-08-29T08:17:26.532Z
bamboo_repository_previous_revision_number=dc8ff9da28b8ab4ad11c7ea94cca526f17c87fe5
bamboo_capability_system_jdk_JDK_1_6_0_16=/usr/lib/jvm/java-6-sun-1.6.0.16
bamboo_capability_system_builder_mvn2_Maven_2=/usr/share/maven2
bamboo_planRepository_previousRevision=dc8ff9da28b8ab4ad11c7ea94cca526f17c87fe5
bamboo_build_commandline_com_atlassian_bamboo_plugins_scripttask_task_builder_script_4=/bin/sh /home/bamboo/temp/PHPBB3-PR-JOB1-9529-ScriptBuildTask-1378036433883455437.sh
bamboo_repository_git_branch=3.1.x
bamboo_buildResultKey=PHPBB3-PR-JOB1-9529
bamboo_repository_branch_name=3.1.x
bamboo_buildPlanName=phpBB3 - Pull Requests - Build and Test Job
bamboo_planRepository_1_revision=dc8ff9da28b8ab4ad11c7ea94cca526f17c87fe5
bamboo_repository_name=phpBB Ascraeus
bamboo_buildFailed=true
bamboo_build_commandline_com_atlassian_bamboo_plugins_bamboo_docker_plugin_task_docker_cli_10=/usr/bin/docker run --volume /home/bamboo/xml-data/build-dir/PHPBB3-PR-JOB1:/data --workdir /data --rm -u=991 -t phpbb:php-7.1 /bin/bash -c phpBB/vendor/bin/phpunit --log-junit build/logs/phpunit.xml
bamboo_capability_system_docker_executable=/usr/bin/docker
bamboo_build_commandline_com_atlassian_bamboo_plugins_bamboo_docker_plugin_task_docker_cli_11=/usr/bin/docker run --volume /home/bamboo/xml-data/build-dir/PHPBB3-PR-JOB1:/data --workdir /data/build --rm -u=991 phpbb:php-7.1 ../phpBB/vendor/bin/phing sniff
bamboo_build_commandline_com_atlassian_bamboo_plugins_bamboo_docker_plugin_task_docker_cli_12=/usr/bin/docker run --volume /home/bamboo/xml-data/build-dir/PHPBB3-PR-JOB1:/data --workdir /data/phpBB --rm -e HOME=/home/bamboo -u=991 phpbb:php-7.1 /bin/bash -c php ../composer.phar install --dev; cd ../build; ../phpBB/vendor/bin/phing clean prepare
bamboo_build_commandline_com_atlassian_bamboo_plugins_bamboo_docker_plugin_task_docker_cli_13=/usr/bin/docker build --force-rm=true --tag=phpbb:php-7.1 /home/bamboo/xml-data/build-dir/PHPBB3-PR-JOB1
bamboo_planRepository_branch=3.1.x
bamboo_agentWorkingDirectory=/home/bamboo/xml-data/build-dir
bamboo_jobFailed=true
bamboo_capability_system_git_executable=/usr/bin/git
bamboo_capability_system_builder_phpunit_PHPUnit_3_4=/usr/bin/phpunit
bamboo_repository_git_username=bantu
bamboo_planRepository_1_previousRevision=dc8ff9da28b8ab4ad11c7ea94cca526f17c87fe5
bamboo_repository_75956235_revision_number=dc8ff9da28b8ab4ad11c7ea94cca526f17c87fe5
bamboo_planRepository_branchDisplayName=3.1.x
bamboo_planRepository_1_type=gitv2
bamboo_planRepository_branchName=3.1.x
bamboo_repository_75956235_previous_revision_number=dc8ff9da28b8ab4ad11c7ea94cca526f17c87fe5
bamboo_capability_system_jdk_JDK=/usr/lib/jvm/java-6-sun
bamboo_plan_storageTag=PHPBB3-PR
bamboo_hg_cache_directory=/home/bamboo/xml-data/build-dir/_hg-repositories-cache
bamboo_planRepository_1_username=bantu
bamboo_planRepository_type=gitv2
bamboo_git_cache_directory=/home/bamboo/xml-data/build-dir/_git-repositories-cache
bamboo_ManualBuildTriggerReason_userName=Build Robot
bamboo_repository_git_repositoryUrl=https://github.com/phpbb/phpbb.git
bamboo_repository_75956235_git_branch=3.1.x
bamboo_capability_system_builder_ant_Ant=/usr/share/ant
bamboo_repository_75956235_name=phpBB Ascraeus
bamboo_tmp_directory=/home/bamboo/temp
bamboo_working_directory=/home/bamboo/xml-data/build-dir/PHPBB3-PR-JOB1
bamboo_planKey=PHPBB3-PR
bamboo_capability_local=true
bamboo_planRepository_1_repositoryUrl=https://github.com/phpbb/phpbb.git
bamboo_planRepository_username=bantu
bamboo_capability_system_jdk_JDK_1_6=/usr/lib/jvm/java-6-sun
bamboo_capability_system_jdk_JDK_1_7=/usr/lib/jvm/java-7-openjdk-amd64
bamboo_planRepository_1_branchName=3.1.x
29-Aug-2019 08:23:02 From https://github.com/phpbb/phpbb
29-Aug-2019 08:23:02 * branch            refs/pull/5668/head -> FETCH_HEAD
29-Aug-2019 08:23:02   <testsuite name="" tests="7183" assertions="121113" errors="1" failures="0" skipped="242" time="204.260615">
29-Aug-2019 08:23:02     <testsuite name="phpBB Test Suite" tests="5374" assertions="119514" errors="1" failures="0" skipped="32" time="150.931911">
29-Aug-2019 08:23:02       <testsuite name="phpbb_event_export_php_test" file="/data/tests/event/export_php_test.php" tests="732" assertions="1462" errors="1" failures="0" skipped="0" time="0.827132">
29-Aug-2019 08:23:02         <testsuite name="phpbb_event_export_php_test::test_crawl_php_file" tests="732" assertions="1462" errors="1" failures="0" skipped="0" time="0.827132">
29-Aug-2019 08:23:02   % Total    % Received % Xferd  Average Speed   Time    Time     Time  Current
29-Aug-2019 08:23:02                                  Dload  Upload   Total   Spent    Left  Speed
29-Aug-2019 08:23:02
29-Aug-2019 08:23:02   0     0    0     0    0     0      0      0 --:--:-- --:--:-- --:--:--     0
29-Aug-2019 08:23:02 100   267  100    93  100   174    287    537 --:--:-- --:--:-- --:--:--   538
29-Aug-2019 08:23:02 Finished task 'Set result build status' with result: Success
29-Aug-2019 08:23:02 Running post build plugin 'NCover Results Collector'
29-Aug-2019 08:23:02 Running post build plugin 'Artifact Copier'
29-Aug-2019 08:23:02 Running post build plugin 'npm Cache Cleanup'
29-Aug-2019 08:23:02 Running post build plugin 'Clover Results Collector'
29-Aug-2019 08:23:02 Running post build plugin 'Docker Container Cleanup'
29-Aug-2019 08:23:03 Successfully removed working directory at '/home/bamboo/xml-data/build-dir/PHPBB3-PR-JOB1'
29-Aug-2019 08:23:03 Finalising the build...
29-Aug-2019 08:23:03 Stopping timer.
29-Aug-2019 08:23:03 Build PHPBB3-PR-JOB1-9529 completed.
29-Aug-2019 08:23:03 Running on server: post build plugin 'NCover Results Collector'
29-Aug-2019 08:23:03 Running on server: post build plugin 'Build Hanging Detection Configuration'
29-Aug-2019 08:23:03 Running on server: post build plugin 'Clover Delta Calculator'
29-Aug-2019 08:23:03 Running on server: post build plugin 'Maven Dependencies Postprocessor'
29-Aug-2019 08:23:03 All post build plugins have finished
29-Aug-2019 08:23:03 Generating build results summary...
29-Aug-2019 08:23:09 Saving build results to disk...
29-Aug-2019 08:23:09 Logging substituted variables...
29-Aug-2019 08:23:10 Indexing build results...
29-Aug-2019 08:23:10 Finished building PHPBB3-PR-JOB1-9529.
29-Aug-2019 08:23:10
Substituting variable: ${bamboo.PRnumber} with 5668