Tests pending pull requests

Build: #9556 failed

Job: Build and Test Job failed

Stages & jobs

  1. Build and Test

Build log

The build generated 472 lines of output. Download or view full build log

06-Sep-2019 15:46:23 Build phpBB3 - Pull Requests - Build and Test Job #9556 (PHPBB3-PR-JOB1-9556) started building on agent Default Agent
06-Sep-2019 15:46:23
06-Sep-2019 15:46:23 Build working directory is /home/bamboo/xml-data/build-dir/PHPBB3-PR-JOB1
06-Sep-2019 15:46:23 Executing build phpBB3 - Pull Requests - Build and Test Job #9556 (PHPBB3-PR-JOB1-9556)
06-Sep-2019 15:46:23 Starting task 'Checkout develop branch' of type 'com.atlassian.bamboo.plugins.vcs:task.vcs.checkout'
06-Sep-2019 15:46:23 Build always requires a clean checkout
06-Sep-2019 15:46:23 Cleaning build directory '/home/bamboo/xml-data/build-dir/PHPBB3-PR-JOB1'
06-Sep-2019 15:46:23 Checking out into /home/bamboo/xml-data/build-dir/PHPBB3-PR-JOB1
06-Sep-2019 15:46:23 Updating source code to revision: dc8ff9da28b8ab4ad11c7ea94cca526f17c87fe5
06-Sep-2019 15:46:23 Fetching 'refs/heads/3.1.x' from 'https://github.com/phpbb/phpbb.git'.
06-Sep-2019 15:46:26 Checking out revision dc8ff9da28b8ab4ad11c7ea94cca526f17c87fe5.
06-Sep-2019 15:46:26 Creating local git repository in '/home/bamboo/xml-data/build-dir/PHPBB3-PR-JOB1/.git'.
06-Sep-2019 15:46:26 Cloning into '/home/bamboo/xml-data/build-dir/PHPBB3-PR-JOB1'...
06-Sep-2019 15:46:26 done.
06-Sep-2019 15:46:32 Switched to a new branch '3.1.x'
06-Sep-2019 15:46:32 Branch 3.1.x set up to track remote branch 3.1.x from origin.
06-Sep-2019 15:46:32 Updated source code to revision: dc8ff9da28b8ab4ad11c7ea94cca526f17c87fe5
06-Sep-2019 15:46:32 Finished task 'Checkout develop branch' with result: Success
06-Sep-2019 15:46:32 Running pre-build action: VCS Version Collector
06-Sep-2019 15:46:32
Substituting variable: ${bamboo.PRnumber} with 5663
06-Sep-2019 15:46:32
Substituting variable: ${bamboo.buildResultsUrl} with https://bamboo.phpbb.com/browse/PHPBB3-PR-JOB1-9556
06-Sep-2019 15:46:32 Starting task 'Set pending build status' of type 'com.atlassian.bamboo.plugins.scripttask:task.builder.script'
06-Sep-2019 15:46:32
Beginning to execute external process for build 'phpBB3 - Pull Requests - Build and Test Job #9556 (PHPBB3-PR-JOB1-9556)'
... running command line:
/bin/sh /home/bamboo/temp/PHPBB3-PR-JOB1-9556-ScriptBuildTask-6366138697716156340.sh
... in: /home/bamboo/xml-data/build-dir/PHPBB3-PR-JOB1
... using extra environment variables:
bamboo_planRepository_1_branch=3.1.x
bamboo_planRepository_1_branchDisplayName=3.1.x
bamboo_repository_revision_number=dc8ff9da28b8ab4ad11c7ea94cca526f17c87fe5
bamboo_PRref=master
bamboo_resultsUrl=https://bamboo.phpbb.com/browse/PHPBB3-PR-JOB1-9556
bamboo_capability_system_builder_command_Git=/usr/bin/git
bamboo_repository_75956235_git_username=bantu
bamboo_build_working_directory=/home/bamboo/xml-data/build-dir/PHPBB3-PR-JOB1
bamboo_planRepository_1_name=phpBB Ascraeus
bamboo_buildKey=PHPBB3-PR-JOB1
bamboo_capability_phpbb_tests=true
bamboo_shortPlanName=Pull Requests
bamboo_capability_system_builder_command_fop=/usr/bin/fop
bamboo_capability_dbms_sqlite_2=true
bamboo_planRepository_name=phpBB Ascraeus
bamboo_PRnumber=5663
bamboo_buildNumber=9556
bamboo_repository_75956235_git_repositoryUrl=https://github.com/phpbb/phpbb.git
bamboo_capability_system_builder_phpunit_PHPUnit=/usr/bin/phpunit
bamboo_shortJobName=Build and Test Job
bamboo_buildResultsUrl=https://bamboo.phpbb.com/browse/PHPBB3-PR-JOB1-9556
bamboo_repository_75956235_branch_name=3.1.x
bamboo_planRepository_repositoryUrl=https://github.com/phpbb/phpbb.git
bamboo_agentId=131073
bamboo_planName=phpBB3 - Pull Requests
bamboo_shortPlanKey=PR
bamboo_shortJobKey=JOB1
bamboo_capability_dbms_mysql_55=true
bamboo_capability_system_jdk_JDK_1_7_0_65=/usr/lib/jvm/java-7-openjdk-amd64
bamboo_planRepository_revision=dc8ff9da28b8ab4ad11c7ea94cca526f17c87fe5
bamboo_buildTimeStamp=2019-09-06T15:46:23.784Z
bamboo_repository_previous_revision_number=dc8ff9da28b8ab4ad11c7ea94cca526f17c87fe5
bamboo_capability_system_jdk_JDK_1_6_0_16=/usr/lib/jvm/java-6-sun-1.6.0.16
bamboo_capability_system_builder_mvn2_Maven_2=/usr/share/maven2
bamboo_planRepository_previousRevision=dc8ff9da28b8ab4ad11c7ea94cca526f17c87fe5
bamboo_repository_git_branch=3.1.x
bamboo_buildResultKey=PHPBB3-PR-JOB1-9556
bamboo_repository_branch_name=3.1.x
bamboo_buildPlanName=phpBB3 - Pull Requests - Build and Test Job
bamboo_planRepository_1_revision=dc8ff9da28b8ab4ad11c7ea94cca526f17c87fe5
bamboo_repository_name=phpBB Ascraeus
bamboo_buildFailed=false
bamboo_capability_system_docker_executable=/usr/bin/docker
bamboo_planRepository_branch=3.1.x
bamboo_agentWorkingDirectory=/home/bamboo/xml-data/build-dir
bamboo_capability_system_git_executable=/usr/bin/git
bamboo_capability_system_builder_phpunit_PHPUnit_3_4=/usr/bin/phpunit
bamboo_repository_git_username=bantu
bamboo_planRepository_1_previousRevision=dc8ff9da28b8ab4ad11c7ea94cca526f17c87fe5
bamboo_repository_75956235_revision_number=dc8ff9da28b8ab4ad11c7ea94cca526f17c87fe5
bamboo_planRepository_branchDisplayName=3.1.x
bamboo_planRepository_1_type=gitv2
bamboo_planRepository_branchName=3.1.x
bamboo_repository_75956235_previous_revision_number=dc8ff9da28b8ab4ad11c7ea94cca526f17c87fe5
bamboo_capability_system_jdk_JDK=/usr/lib/jvm/java-6-sun
bamboo_plan_storageTag=PHPBB3-PR
bamboo_hg_cache_directory=/home/bamboo/xml-data/build-dir/_hg-repositories-cache
bamboo_planRepository_1_username=bantu
bamboo_planRepository_type=gitv2
bamboo_git_cache_directory=/home/bamboo/xml-data/build-dir/_git-repositories-cache
bamboo_ManualBuildTriggerReason_userName=Build Robot
bamboo_repository_git_repositoryUrl=https://github.com/phpbb/phpbb.git
bamboo_repository_75956235_git_branch=3.1.x
bamboo_capability_system_builder_ant_Ant=/usr/share/ant
bamboo_repository_75956235_name=phpBB Ascraeus
bamboo_tmp_directory=/home/bamboo/temp
bamboo_working_directory=/home/bamboo/xml-data/build-dir/PHPBB3-PR-JOB1
bamboo_planKey=PHPBB3-PR
bamboo_capability_local=true
bamboo_planRepository_1_repositoryUrl=https://github.com/phpbb/phpbb.git
bamboo_planRepository_username=bantu
bamboo_capability_system_jdk_JDK_1_6=/usr/lib/jvm/java-6-sun
bamboo_capability_system_jdk_JDK_1_7=/usr/lib/jvm/java-7-openjdk-amd64
bamboo_planRepository_1_branchName=3.1.x
06-Sep-2019 15:46:36 From https://github.com/phpbb/phpbb
06-Sep-2019 15:46:36 * branch            refs/pull/5663/head -> FETCH_HEAD
06-Sep-2019 15:46:36   % Total    % Received % Xferd  Average Speed   Time    Time     Time  Current
06-Sep-2019 15:46:36                                  Dload  Upload   Total   Spent    Left  Speed
06-Sep-2019 15:46:36
06-Sep-2019 15:46:36   0     0    0     0    0     0      0      0 --:--:-- --:--:-- --:--:--     0
06-Sep-2019 15:46:36 100   275  100    93  100   182    149    293 --:--:-- --:--:-- --:--:--   293
06-Sep-2019 15:46:36 Finished task 'Set pending build status' with result: Success
06-Sep-2019 15:46:36
Substituting variable: ${bamboo.PRnumber} with 5663
06-Sep-2019 15:46:36 Starting task 'Fetch PR' of type 'com.atlassian.bamboo.plugins.scripttask:task.builder.script'
06-Sep-2019 15:46:36
Beginning to execute external process for build 'phpBB3 - Pull Requests - Build and Test Job #9556 (PHPBB3-PR-JOB1-9556)'
... running command line:
/bin/sh /home/bamboo/temp/PHPBB3-PR-JOB1-9556-ScriptBuildTask-5226517578466165961.sh
... in: /home/bamboo/xml-data/build-dir/PHPBB3-PR-JOB1
... using extra environment variables:
bamboo_planRepository_1_branch=3.1.x
bamboo_planRepository_1_branchDisplayName=3.1.x
bamboo_repository_revision_number=dc8ff9da28b8ab4ad11c7ea94cca526f17c87fe5
bamboo_PRref=master
bamboo_resultsUrl=https://bamboo.phpbb.com/browse/PHPBB3-PR-JOB1-9556
bamboo_capability_system_builder_command_Git=/usr/bin/git
bamboo_repository_75956235_git_username=bantu
bamboo_build_working_directory=/home/bamboo/xml-data/build-dir/PHPBB3-PR-JOB1
bamboo_planRepository_1_name=phpBB Ascraeus
bamboo_buildKey=PHPBB3-PR-JOB1
bamboo_capability_phpbb_tests=true
bamboo_shortPlanName=Pull Requests
bamboo_capability_system_builder_command_fop=/usr/bin/fop
bamboo_capability_dbms_sqlite_2=true
bamboo_planRepository_name=phpBB Ascraeus
bamboo_PRnumber=5663
bamboo_buildNumber=9556
bamboo_repository_75956235_git_repositoryUrl=https://github.com/phpbb/phpbb.git
bamboo_capability_system_builder_phpunit_PHPUnit=/usr/bin/phpunit
bamboo_shortJobName=Build and Test Job
bamboo_buildResultsUrl=https://bamboo.phpbb.com/browse/PHPBB3-PR-JOB1-9556
bamboo_repository_75956235_branch_name=3.1.x
bamboo_planRepository_repositoryUrl=https://github.com/phpbb/phpbb.git
bamboo_agentId=131073
bamboo_planName=phpBB3 - Pull Requests
bamboo_build_commandline_com_atlassian_bamboo_plugins_scripttask_task_builder_script_7=/bin/sh /home/bamboo/temp/PHPBB3-PR-JOB1-9556-ScriptBuildTask-6366138697716156340.sh
bamboo_shortPlanKey=PR
bamboo_shortJobKey=JOB1
bamboo_capability_dbms_mysql_55=true
bamboo_capability_system_jdk_JDK_1_7_0_65=/usr/lib/jvm/java-7-openjdk-amd64
bamboo_planRepository_revision=dc8ff9da28b8ab4ad11c7ea94cca526f17c87fe5
bamboo_buildTimeStamp=2019-09-06T15:46:23.784Z
bamboo_repository_previous_revision_number=dc8ff9da28b8ab4ad11c7ea94cca526f17c87fe5
bamboo_capability_system_jdk_JDK_1_6_0_16=/usr/lib/jvm/java-6-sun-1.6.0.16
bamboo_capability_system_builder_mvn2_Maven_2=/usr/share/maven2
bamboo_planRepository_previousRevision=dc8ff9da28b8ab4ad11c7ea94cca526f17c87fe5
bamboo_repository_git_branch=3.1.x
bamboo_buildResultKey=PHPBB3-PR-JOB1-9556
bamboo_repository_branch_name=3.1.x
bamboo_buildPlanName=phpBB3 - Pull Requests - Build and Test Job
bamboo_planRepository_1_revision=dc8ff9da28b8ab4ad11c7ea94cca526f17c87fe5
bamboo_repository_name=phpBB Ascraeus
bamboo_buildFailed=false
bamboo_capability_system_docker_executable=/usr/bin/docker
bamboo_planRepository_branch=3.1.x
bamboo_agentWorkingDirectory=/home/bamboo/xml-data/build-dir
bamboo_capability_system_git_executable=/usr/bin/git
bamboo_capability_system_builder_phpunit_PHPUnit_3_4=/usr/bin/phpunit
bamboo_repository_git_username=bantu
bamboo_planRepository_1_previousRevision=dc8ff9da28b8ab4ad11c7ea94cca526f17c87fe5
bamboo_repository_75956235_revision_number=dc8ff9da28b8ab4ad11c7ea94cca526f17c87fe5
bamboo_planRepository_branchDisplayName=3.1.x
bamboo_planRepository_1_type=gitv2
bamboo_planRepository_branchName=3.1.x
bamboo_repository_75956235_previous_revision_number=dc8ff9da28b8ab4ad11c7ea94cca526f17c87fe5
bamboo_capability_system_jdk_JDK=/usr/lib/jvm/java-6-sun
bamboo_plan_storageTag=PHPBB3-PR
bamboo_hg_cache_directory=/home/bamboo/xml-data/build-dir/_hg-repositories-cache
bamboo_planRepository_1_username=bantu
bamboo_planRepository_type=gitv2
bamboo_git_cache_directory=/home/bamboo/xml-data/build-dir/_git-repositories-cache
bamboo_ManualBuildTriggerReason_userName=Build Robot
bamboo_repository_git_repositoryUrl=https://github.com/phpbb/phpbb.git
bamboo_repository_75956235_git_branch=3.1.x
bamboo_capability_system_builder_ant_Ant=/usr/share/ant
bamboo_repository_75956235_name=phpBB Ascraeus
bamboo_tmp_directory=/home/bamboo/temp
bamboo_working_directory=/home/bamboo/xml-data/build-dir/PHPBB3-PR-JOB1
bamboo_planKey=PHPBB3-PR
bamboo_capability_local=true
bamboo_planRepository_1_repositoryUrl=https://github.com/phpbb/phpbb.git
bamboo_planRepository_username=bantu
bamboo_capability_system_jdk_JDK_1_6=/usr/lib/jvm/java-6-sun
bamboo_capability_system_jdk_JDK_1_7=/usr/lib/jvm/java-7-openjdk-amd64
bamboo_planRepository_1_branchName=3.1.x
06-Sep-2019 15:46:39 From https://github.com/phpbb/phpbb
06-Sep-2019 15:46:39 * branch            refs/pull/5663/merge -> FETCH_HEAD
06-Sep-2019 15:46:40 Note: checking out 'FETCH_HEAD'.
06-Sep-2019 15:46:40
06-Sep-2019 15:46:40 You are in 'detached HEAD' state. You can look around, make experimental
06-Sep-2019 15:46:40 changes and commit them, and you can discard any commits you make in this
06-Sep-2019 15:46:40 state without impacting any branches by performing another checkout.
06-Sep-2019 15:46:40
06-Sep-2019 15:46:40 If you want to create a new branch to retain commits you create, you may
06-Sep-2019 15:46:40 do so (now or later) by using -b with the checkout command again. Example:
06-Sep-2019 15:46:40
06-Sep-2019 15:46:40   git checkout -b new_branch_name
06-Sep-2019 15:46:40
06-Sep-2019 15:46:40 HEAD is now at 8092510... Merge 851082a840cc24f9c393c869762626613ba67096 into e123ca826c843765383e13cfbb412ac14e4bd2a3
06-Sep-2019 15:46:40 Finished task 'Fetch PR' with result: Success
06-Sep-2019 15:46:40 Skipping execution of task 'Prepare directory' as it is disabled
06-Sep-2019 15:46:40
Substituting variable: ${bamboo.working.directory} with /home/bamboo/xml-data/build-dir/PHPBB3-PR-JOB1
06-Sep-2019 15:46:40 Starting task 'Build image' of type 'com.atlassian.bamboo.plugins.bamboo-docker-plugin:task.docker.cli'
06-Sep-2019 15:46:40
Beginning to execute external process for build 'phpBB3 - Pull Requests - Build and Test Job #9556 (PHPBB3-PR-JOB1-9556)'
... running command line:
/usr/bin/docker build --force-rm=true --tag=phpbb:php-7.1 /home/bamboo/xml-data/build-dir/PHPBB3-PR-JOB1
... in: /home/bamboo/xml-data/build-dir/PHPBB3-PR-JOB1
... using extra environment variables:
bamboo_planRepository_1_branch=3.1.x
bamboo_planRepository_1_branchDisplayName=3.1.x
bamboo_repository_revision_number=dc8ff9da28b8ab4ad11c7ea94cca526f17c87fe5
bamboo_PRref=master
bamboo_resultsUrl=https://bamboo.phpbb.com/browse/PHPBB3-PR-JOB1-9556
bamboo_capability_system_builder_command_Git=/usr/bin/git
bamboo_repository_75956235_git_username=bantu
bamboo_build_working_directory=/home/bamboo/xml-data/build-dir/PHPBB3-PR-JOB1
bamboo_planRepository_1_name=phpBB Ascraeus
bamboo_buildKey=PHPBB3-PR-JOB1
bamboo_capability_phpbb_tests=true
bamboo_shortPlanName=Pull Requests
bamboo_capability_system_builder_command_fop=/usr/bin/fop
bamboo_capability_dbms_sqlite_2=true
bamboo_planRepository_name=phpBB Ascraeus
bamboo_PRnumber=5663
bamboo_buildNumber=9556
bamboo_repository_75956235_git_repositoryUrl=https://github.com/phpbb/phpbb.git
bamboo_capability_system_builder_phpunit_PHPUnit=/usr/bin/phpunit
bamboo_shortJobName=Build and Test Job
bamboo_buildResultsUrl=https://bamboo.phpbb.com/browse/PHPBB3-PR-JOB1-9556
bamboo_repository_75956235_branch_name=3.1.x
bamboo_planRepository_repositoryUrl=https://github.com/phpbb/phpbb.git
bamboo_agentId=131073
bamboo_planName=phpBB3 - Pull Requests
bamboo_build_commandline_com_atlassian_bamboo_plugins_scripttask_task_builder_script_7=/bin/sh /home/bamboo/temp/PHPBB3-PR-JOB1-9556-ScriptBuildTask-6366138697716156340.sh
bamboo_shortPlanKey=PR
bamboo_shortJobKey=JOB1
bamboo_capability_dbms_mysql_55=true
bamboo_capability_system_jdk_JDK_1_7_0_65=/usr/lib/jvm/java-7-openjdk-amd64
bamboo_planRepository_revision=dc8ff9da28b8ab4ad11c7ea94cca526f17c87fe5
bamboo_buildTimeStamp=2019-09-06T15:46:23.784Z
bamboo_repository_previous_revision_number=dc8ff9da28b8ab4ad11c7ea94cca526f17c87fe5
bamboo_capability_system_jdk_JDK_1_6_0_16=/usr/lib/jvm/java-6-sun-1.6.0.16
bamboo_capability_system_builder_mvn2_Maven_2=/usr/share/maven2
bamboo_planRepository_previousRevision=dc8ff9da28b8ab4ad11c7ea94cca526f17c87fe5
bamboo_build_commandline_com_atlassian_bamboo_plugins_scripttask_task_builder_script_4=/bin/sh /home/bamboo/temp/PHPBB3-PR-JOB1-9556-ScriptBuildTask-5226517578466165961.sh
bamboo_repository_git_branch=3.1.x
bamboo_buildResultKey=PHPBB3-PR-JOB1-9556
bamboo_repository_branch_name=3.1.x
bamboo_buildPlanName=phpBB3 - Pull Requests - Build and Test Job
bamboo_planRepository_1_revision=dc8ff9da28b8ab4ad11c7ea94cca526f17c87fe5
bamboo_repository_name=phpBB Ascraeus
bamboo_buildFailed=false
bamboo_capability_system_docker_executable=/usr/bin/docker
bamboo_planRepository_branch=3.1.x
bamboo_agentWorkingDirectory=/home/bamboo/xml-data/build-dir
bamboo_capability_system_git_executable=/usr/bin/git
bamboo_capability_system_builder_phpunit_PHPUnit_3_4=/usr/bin/phpunit
bamboo_repository_git_username=bantu
bamboo_planRepository_1_previousRevision=dc8ff9da28b8ab4ad11c7ea94cca526f17c87fe5
bamboo_repository_75956235_revision_number=dc8ff9da28b8ab4ad11c7ea94cca526f17c87fe5
bamboo_planRepository_branchDisplayName=3.1.x
bamboo_planRepository_1_type=gitv2
bamboo_planRepository_branchName=3.1.x
bamboo_repository_75956235_previous_revision_number=dc8ff9da28b8ab4ad11c7ea94cca526f17c87fe5
bamboo_capability_system_jdk_JDK=/usr/lib/jvm/java-6-sun
bamboo_plan_storageTag=PHPBB3-PR
bamboo_hg_cache_directory=/home/bamboo/xml-data/build-dir/_hg-repositories-cache
bamboo_planRepository_1_username=bantu
bamboo_planRepository_type=gitv2
bamboo_git_cache_directory=/home/bamboo/xml-data/build-dir/_git-repositories-cache
bamboo_ManualBuildTriggerReason_userName=Build Robot
bamboo_repository_git_repositoryUrl=https://github.com/phpbb/phpbb.git
bamboo_repository_75956235_git_branch=3.1.x
bamboo_capability_system_builder_ant_Ant=/usr/share/ant
bamboo_repository_75956235_name=phpBB Ascraeus
bamboo_tmp_directory=/home/bamboo/temp
bamboo_working_directory=/home/bamboo/xml-data/build-dir/PHPBB3-PR-JOB1
bamboo_planKey=PHPBB3-PR
bamboo_capability_local=true
bamboo_planRepository_1_repositoryUrl=https://github.com/phpbb/phpbb.git
bamboo_planRepository_username=bantu
bamboo_capability_system_jdk_JDK_1_6=/usr/lib/jvm/java-6-sun
bamboo_capability_system_jdk_JDK_1_7=/usr/lib/jvm/java-7-openjdk-amd64
bamboo_planRepository_1_branchName=3.1.x
06-Sep-2019 15:46:41 Sending build context to Docker daemon  43.04MB
06-Sep-2019 15:46:41
06-Sep-2019 15:46:41 Step 1/5 : FROM php:7.1
06-Sep-2019 15:46:41 ---> 6b94137690a5
06-Sep-2019 15:46:41 Step 2/5 : RUN apt-get update && apt-get install -y         git         zlib1g-dev         bzip2         zip         && docker-php-ext-install -j$(nproc) zip
06-Sep-2019 15:46:41 ---> Using cache
06-Sep-2019 15:46:41 ---> f6a0a124b579
06-Sep-2019 15:46:41 Step 3/5 : RUN pecl install xdebug-2.6.1
06-Sep-2019 15:46:41 ---> Using cache
06-Sep-2019 15:46:41 ---> 15c4b93552b7
06-Sep-2019 15:46:41 Step 4/5 : RUN docker-php-ext-enable xdebug
06-Sep-2019 15:46:41 ---> Using cache
06-Sep-2019 15:46:41 ---> ef1b69ae4ef0
06-Sep-2019 15:46:41 Step 5/5 : RUN echo "memory_limit = 1536M" >> /usr/local/etc/php/conf.d/memory.ini
06-Sep-2019 15:46:41 ---> Using cache
06-Sep-2019 15:46:41 ---> b85b0bd595b2
06-Sep-2019 15:46:41 Successfully built b85b0bd595b2
06-Sep-2019 15:46:41 Successfully tagged phpbb:php-7.1
06-Sep-2019 15:46:41 Built Docker image 'phpbb:php-7.1'
06-Sep-2019 15:46:41 Finished task 'Build image' with result: Success
06-Sep-2019 15:46:41
Substituting variable: ${bamboo.working.directory} with /home/bamboo/xml-data/build-dir/PHPBB3-PR-JOB1
06-Sep-2019 15:46:41 Starting task 'Prepare directory' of type 'com.atlassian.bamboo.plugins.bamboo-docker-plugin:task.docker.cli'
06-Sep-2019 15:46:41 Running image name (phpbb:php-7.1)
06-Sep-2019 15:46:41
Beginning to execute external process for build 'phpBB3 - Pull Requests - Build and Test Job #9556 (PHPBB3-PR-JOB1-9556)'
... running command line:
/usr/bin/docker run --volume /home/bamboo/xml-data/build-dir/PHPBB3-PR-JOB1:/data --workdir /data/phpBB --rm -e HOME=/home/bamboo -u=991 phpbb:php-7.1 /bin/bash -c php ../composer.phar install --dev; cd ../build; ../phpBB/vendor/bin/phing clean prepare
... in: /home/bamboo/xml-data/build-dir/PHPBB3-PR-JOB1
... using extra environment variables:
bamboo_planRepository_1_branch=3.1.x
bamboo_planRepository_1_branchDisplayName=3.1.x
bamboo_repository_revision_number=dc8ff9da28b8ab4ad11c7ea94cca526f17c87fe5
bamboo_PRref=master
bamboo_resultsUrl=https://bamboo.phpbb.com/browse/PHPBB3-PR-JOB1-9556
bamboo_capability_system_builder_command_Git=/usr/bin/git
bamboo_repository_75956235_git_username=bantu
bamboo_build_working_directory=/home/bamboo/xml-data/build-dir/PHPBB3-PR-JOB1
bamboo_planRepository_1_name=phpBB Ascraeus
bamboo_buildKey=PHPBB3-PR-JOB1
bamboo_capability_phpbb_tests=true
bamboo_shortPlanName=Pull Requests
bamboo_capability_system_builder_command_fop=/usr/bin/fop
bamboo_capability_dbms_sqlite_2=true
bamboo_planRepository_name=phpBB Ascraeus
bamboo_PRnumber=5663
bamboo_buildNumber=9556
bamboo_repository_75956235_git_repositoryUrl=https://github.com/phpbb/phpbb.git
bamboo_capability_system_builder_phpunit_PHPUnit=/usr/bin/phpunit
bamboo_shortJobName=Build and Test Job
bamboo_buildResultsUrl=https://bamboo.phpbb.com/browse/PHPBB3-PR-JOB1-9556
bamboo_repository_75956235_branch_name=3.1.x
bamboo_planRepository_repositoryUrl=https://github.com/phpbb/phpbb.git
bamboo_agentId=131073
bamboo_planName=phpBB3 - Pull Requests
bamboo_build_commandline_com_atlassian_bamboo_plugins_scripttask_task_builder_script_7=/bin/sh /home/bamboo/temp/PHPBB3-PR-JOB1-9556-ScriptBuildTask-6366138697716156340.sh
bamboo_shortPlanKey=PR
bamboo_shortJobKey=JOB1
bamboo_capability_dbms_mysql_55=true
bamboo_capability_system_jdk_JDK_1_7_0_65=/usr/lib/jvm/java-7-openjdk-amd64
bamboo_planRepository_revision=dc8ff9da28b8ab4ad11c7ea94cca526f17c87fe5
bamboo_buildTimeStamp=2019-09-06T15:46:23.784Z
bamboo_repository_previous_revision_number=dc8ff9da28b8ab4ad11c7ea94cca526f17c87fe5
bamboo_capability_system_jdk_JDK_1_6_0_16=/usr/lib/jvm/java-6-sun-1.6.0.16
bamboo_capability_system_builder_mvn2_Maven_2=/usr/share/maven2
bamboo_planRepository_previousRevision=dc8ff9da28b8ab4ad11c7ea94cca526f17c87fe5
bamboo_build_commandline_com_atlassian_bamboo_plugins_scripttask_task_builder_script_4=/bin/sh /home/bamboo/temp/PHPBB3-PR-JOB1-9556-ScriptBuildTask-5226517578466165961.sh
bamboo_repository_git_branch=3.1.x
bamboo_buildResultKey=PHPBB3-PR-JOB1-9556
bamboo_repository_branch_name=3.1.x
bamboo_buildPlanName=phpBB3 - Pull Requests - Build and Test Job
bamboo_planRepository_1_revision=dc8ff9da28b8ab4ad11c7ea94cca526f17c87fe5
bamboo_repository_name=phpBB Ascraeus
bamboo_buildFailed=false
bamboo_capability_system_docker_executable=/usr/bin/docker
bamboo_build_commandline_com_atlassian_bamboo_plugins_bamboo_docker_plugin_task_docker_cli_13=/usr/bin/docker build --force-rm=true --tag=phpbb:php-7.1 /home/bamboo/xml-data/build-dir/PHPBB3-PR-JOB1
bamboo_planRepository_branch=3.1.x
bamboo_agentWorkingDirectory=/home/bamboo/xml-data/build-dir
bamboo_capability_system_git_executable=/usr/bin/git
bamboo_capability_system_builder_phpunit_PHPUnit_3_4=/usr/bin/phpunit
bamboo_repository_git_username=bantu
bamboo_planRepository_1_previousRevision=dc8ff9da28b8ab4ad11c7ea94cca526f17c87fe5
bamboo_repository_75956235_revision_number=dc8ff9da28b8ab4ad11c7ea94cca526f17c87fe5
bamboo_planRepository_branchDisplayName=3.1.x
bamboo_planRepository_1_type=gitv2
bamboo_planRepository_branchName=3.1.x
bamboo_repository_75956235_previous_revision_number=dc8ff9da28b8ab4ad11c7ea94cca526f17c87fe5
bamboo_capability_system_jdk_JDK=/usr/lib/jvm/java-6-sun
bamboo_plan_storageTag=PHPBB3-PR
bamboo_hg_cache_directory=/home/bamboo/xml-data/build-dir/_hg-repositories-cache
bamboo_planRepository_1_username=bantu
bamboo_planRepository_type=gitv2
bamboo_git_cache_directory=/home/bamboo/xml-data/build-dir/_git-repositories-cache
bamboo_ManualBuildTriggerReason_userName=Build Robot
bamboo_repository_git_repositoryUrl=https://github.com/phpbb/phpbb.git
bamboo_repository_75956235_git_branch=3.1.x
bamboo_capability_system_builder_ant_Ant=/usr/share/ant
bamboo_repository_75956235_name=phpBB Ascraeus
bamboo_tmp_directory=/home/bamboo/temp
bamboo_working_directory=/home/bamboo/xml-data/build-dir/PHPBB3-PR-JOB1
bamboo_planKey=PHPBB3-PR
bamboo_capability_local=true
bamboo_planRepository_1_repositoryUrl=https://github.com/phpbb/phpbb.git
bamboo_planRepository_username=bantu
bamboo_capability_system_jdk_JDK_1_6=/usr/lib/jvm/java-6-sun
bamboo_capability_system_jdk_JDK_1_7=/usr/lib/jvm/java-7-openjdk-amd64
bamboo_planRepository_1_branchName=3.1.x
06-Sep-2019 15:46:43 Cannot create cache directory /home/bamboo/.composer/cache/repo/https---repo.packagist.org/, or directory is not writable. Proceeding without cache
06-Sep-2019 15:46:43 Cannot create cache directory /home/bamboo/.composer/cache/files/, or directory is not writable. Proceeding without cache
06-Sep-2019 15:46:43 You are using the deprecated option "dev". Dev packages are installed by default now.
06-Sep-2019 15:46:43 Loading composer repositories with package information
06-Sep-2019 15:46:43 Installing dependencies (including require-dev) from lock file
06-Sep-2019 15:46:43 Package operations: 82 installs, 0 updates, 0 removals
06-Sep-2019 15:46:43   - Installing composer/installers (v1.6.0): Downloading (connecting...)Downloading (0%)           Downloading (5%)Downloading (40%)Downloading (45%)Downloading (50%)Downloading (55%)Downloading (60%)Downloading (65%)Downloading (80%)Downloading (85%)Downloading (90%)Downloading (100%)
06-Sep-2019 15:46:44   - Installing ocramius/package-versions (1.4.0): Downloading (connecting...)Downloading (0%)           Downloading (30%)Downloading (40%)Downloading (70%)Downloading (100%)
06-Sep-2019 15:46:44   - Installing bantu/ini-get-wrapper (v1.0.1): Downloading (connecting...)Downloading (100%)         
06-Sep-2019 15:46:45   - Installing symfony/process (v3.4.30): Downloading (connecting...)Downloading (0%)           Downloading (5%)Downloading (20%)Downloading (25%)Downloading (35%)Downloading (40%)Downloading (45%)Downloading (55%)Downloading (60%)Downloading (65%)Downloading (75%)Downloading (80%)Downloading (85%)Downloading (100%)
06-Sep-2019 15:46:46   - Installing symfony/finder (v3.4.30): Downloading (connecting...)Downloading (0%)           Downloading (5%)Downloading (35%)Downloading (40%)Downloading (45%)Downloading (50%)Downloading (75%)Downloading (80%)Downloading (85%)Downloading (90%)Downloading (100%)
06-Sep-2019 15:46:46   - Installing symfony/polyfill-ctype (v1.11.0): Downloading (connecting...)Downloading (0%)           Downloading (100%)
06-Sep-2019 15:46:46   - Installing symfony/filesystem (v3.4.30): Downloading (connecting...)Downloading (0%)           Downloading (5%)Downloading (10%)Downloading (100%)
06-Sep-2019 15:46:47   - Installing symfony/polyfill-mbstring (v1.11.0): Downloading (connecting...)Downloading (0%)           Downloading (30%)Downloading (55%)Downloading (90%)Downloading (100%)
06-Sep-2019 15:46:47   - Installing psr/log (1.1.0): Downloading (connecting...)Downloading (0%)           Downloading (65%)Downloading (100%)
06-Sep-2019 15:46:48   - Installing symfony/debug (v3.4.30): Downloading (connecting...)Downloading (0%)           Downloading (5%)Downloading (15%)Downloading (20%)Downloading (35%)Downloading (45%)Downloading (50%)Downloading (55%)Downloading (60%)Downloading (65%)Downloading (80%)Downloading (85%)Downloading (100%)
06-Sep-2019 15:46:48   - Installing symfony/console (v3.4.30): Downloading (connecting...)Downloading (0%)           Downloading (5%)Downloading (10%)Downloading (15%)Downloading (20%)Downloading (25%)Downloading (30%)Downloading (35%)Downloading (40%)Downloading (45%)Downloading (50%)Downloading (55%)Downloading (60%)Downloading (65%)Downloading (70%)Downloading (75%)Downloading (80%)Downloading (85%)Downloading (90%)Downloading (95%)Downloading (100%)
06-Sep-2019 15:46:49   - Installing seld/phar-utils (1.0.1): Downloading (connecting...)Downloading (0%)           Downloading (30%)Downloading (60%)Downloading (90%)Downloading (100%)
06-Sep-2019 15:46:49   - Installing seld/jsonlint (1.7.1): Downloading (connecting...)Downloading (0%)           Downloading (15%)Downloading (50%)Downloading (100%)
06-Sep-2019 15:46:50   - Installing justinrainbow/json-schema (5.2.8): Downloading (connecting...)Downloading (0%)           Downloading (5%)Downloading (15%)Downloading (20%)Downloading (35%)Downloading (40%)Downloading (45%)Downloading (50%)Downloading (70%)Downloading (75%)Downloading (90%)Downloading (95%)Downloading (100%)
06-Sep-2019 15:46:50   - Installing composer/xdebug-handler (1.3.3): Downloading (connecting...)Downloading (0%)           Downloading (85%)Downloading (100%)
06-Sep-2019 15:46:50   - Installing composer/spdx-licenses (1.5.2): Downloading (connecting...)Downloading (0%)           Downloading (10%)Downloading (20%)Downloading (30%)Downloading (40%)Downloading (50%)Downloading (60%)Downloading (65%)Downloading (75%)Downloading (85%)Downloading (95%)Downloading (100%)
06-Sep-2019 15:46:51   - Installing composer/semver (1.5.0): Downloading (connecting...)Downloading (0%)           Downloading (35%)Downloading (85%)Downloading (100%)
06-Sep-2019 15:46:51   - Installing composer/ca-bundle (1.1.4): Downloading (connecting...)Downloading (0%)           Downloading (5%)Downloading (10%)Downloading (15%)Downloading (20%)Downloading (25%)Downloading (30%)Downloading (35%)Downloading (40%)Downloading (45%)Downloading (50%)Downloading (55%)Downloading (60%)Downloading (65%)Downloading (70%)Downloading (75%)Downloading (80%)Downloading (85%)Downloading (90%)Downloading (95%)Downloading (100%)
06-Sep-2019 15:46:52   - Installing composer/composer (1.8.6): Downloading (connecting...)Downloading (100%)         
06-Sep-2019 15:46:53   - Installing google/recaptcha (1.2.2): Downloading (connecting...)Downloading (0%)           Downloading (5%)Downloading (10%)Downloading (40%)Downloading (45%)Downloading (50%)Downloading (55%)Downloading (60%)Downloading (90%)Downloading (95%)Downloading (100%)
06-Sep-2019 15:46:53   - Installing guzzlehttp/promises (v1.3.1): Downloading (connecting...)Downloading (0%)           Downloading (30%)Downloading (45%)Downloading (75%)Downloading (100%)
06-Sep-2019 15:46:53   - Installing ralouphie/getallheaders (3.0.3): Downloading (connecting...)Downloading (0%)           Downloading (100%)
06-Sep-2019 15:46:54   - Installing psr/http-message (1.0.1): Downloading (connecting...)Downloading (0%)           Downloading (95%)Downloading (100%)
06-Sep-2019 15:46:54   - Installing guzzlehttp/psr7 (1.6.1): Downloading (connecting...)Downloading (0%)           Downloading (5%)Downloading (10%)Downloading (20%)Downloading (25%)Downloading (30%)Downloading (35%)Downloading (40%)Downloading (50%)Downloading (55%)Downloading (60%)Downloading (100%)
06-Sep-2019 15:46:55   - Installing lusitanian/oauth (v0.8.11): Downloading (connecting...)Downloading (100%)         
06-Sep-2019 15:46:55   - Installing marc1706/fast-image-size (v1.1.4): Downloading (connecting...)Downloading (0%)           Downloading (45%)Downloading (100%)
06-Sep-2019 15:46:56   - Installing patchwork/utf8 (v1.3.1): Downloading (connecting...)Downloading (0%)           Downloading (5%)Downloading (10%)Downloading (15%)Downloading (20%)Downloading (25%)Downloading (30%)Downloading (35%)Downloading (40%)Downloading (45%)Downloading (50%)Downloading (55%)Downloading (60%)Downloading (65%)Downloading (70%)Downloading (75%)Downloading (80%)Downloading (85%)Downloading (90%)Downloading (95%)Downloading (100%)
06-Sep-2019 15:46:56   - Installing psr/container (1.0.0): Downloading (connecting...)Downloading (0%)           Downloading (75%)Downloading (100%)
06-Sep-2019 15:46:57   - Installing s9e/regexp-builder (1.4.3): Downloading (connecting...)Downloading (100%)         
06-Sep-2019 15:46:58   - Installing s9e/text-formatter (2.1.0): Downloading (connecting...)Downloading (100%)         
06-Sep-2019 15:46:58   - Installing symfony/config (v3.4.30): Downloading (connecting...)Downloading (0%)           Downloading (5%)Downloading (10%)Downloading (15%)Downloading (20%)Downloading (25%)Downloading (30%)Downloading (35%)Downloading (40%)Downloading (45%)Downloading (50%)Downloading (55%)Downloading (60%)Downloading (65%)Downloading (70%)Downloading (75%)Downloading (80%)Downloading (85%)Downloading (90%)Downloading (95%)Downloading (100%)
06-Sep-2019 15:46:59   - Installing paragonie/random_compat (v2.0.18): Downloading (connecting...)Downloading (0%)           Downloading (25%)Downloading (50%)Downloading (75%)Downloading (80%)Downloading (100%)
06-Sep-2019 15:46:59   - Installing symfony/polyfill-php70 (v1.11.0): Downloading (connecting...)Downloading (0%)           Downloading (85%)Downloading (100%)
06-Sep-2019 15:47:00   - Installing symfony/http-foundation (v3.4.30): Downloading (connecting...)Downloading (0%)           Downloading (5%)Downloading (10%)Downloading (15%)Downloading (20%)Downloading (25%)Downloading (30%)Downloading (35%)Downloading (40%)Downloading (45%)Downloading (50%)Downloading (55%)Downloading (60%)Downloading (65%)Downloading (70%)Downloading (75%)Downloading (80%)Downloading (85%)Downloading (90%)Downloading (95%)Downloading (100%)
06-Sep-2019 15:47:00   - Installing symfony/event-dispatcher (v3.4.30): Downloading (connecting...)Downloading (0%)           Downloading (5%)Downloading (45%)Downloading (50%)Downloading (65%)Downloading (70%)Downloading (95%)Downloading (100%)
06-Sep-2019 15:47:01   - Installing symfony/http-kernel (v3.4.30): Downloading (connecting...)Downloading (0%)           Downloading (5%)Downloading (10%)Downloading (15%)Downloading (20%)Downloading (25%)Downloading (30%)Downloading (35%)Downloading (40%)Downloading (45%)Downloading (50%)Downloading (55%)Downloading (60%)Downloading (65%)Downloading (70%)Downloading (75%)Downloading (80%)Downloading (85%)Downloading (90%)Downloading (95%)Downloading (100%)
06-Sep-2019 15:47:01   - Installing symfony/dependency-injection (v3.4.30): Downloading (connecting...)Downloading (0%)           Downloading (5%)Downloading (10%)Downloading (15%)Downloading (20%)Downloading (25%)Downloading (30%)Downloading (35%)Downloading (40%)Downloading (45%)Downloading (50%)Downloading (55%)Downloading (60%)Downloading (65%)Downloading (70%)Downloading (75%)Downloading (80%)Downloading (85%)Downloading (100%)
06-Sep-2019 15:47:02   - Installing zendframework/zend-eventmanager (3.2.1): Downloading (connecting...)Downloading (0%)           Downloading (15%)Downloading (20%)Downloading (35%)Downloading (45%)Downloading (65%)Downloading (80%)Downloading (85%)Downloading (100%)
06-Sep-2019 15:47:02   - Installing zendframework/zend-code (3.3.1): Downloading (connecting...)Downloading (0%)           Downloading (5%)Downloading (10%)Downloading (15%)Downloading (20%)Downloading (25%)Downloading (30%)Downloading (35%)Downloading (40%)Downloading (45%)Downloading (50%)Downloading (55%)Downloading (60%)Downloading (65%)Downloading (70%)Downloading (75%)Downloading (80%)Downloading (85%)Downloading (90%)Downloading (95%)Downloading (100%)
06-Sep-2019 15:47:03   - Installing ocramius/proxy-manager (2.1.1): Downloading (connecting...)Downloading (100%)         
06-Sep-2019 15:47:04   - Installing symfony/proxy-manager-bridge (v3.4.30): Downloading (connecting...)Downloading (100%)         
06-Sep-2019 15:47:04   - Installing symfony/routing (v3.4.30): Downloading (connecting...)Downloading (0%)           Downloading (5%)Downloading (10%)Downloading (15%)Downloading (20%)Downloading (25%)Downloading (30%)Downloading (35%)Downloading (40%)Downloading (45%)Downloading (50%)Downloading (55%)Downloading (60%)Downloading (65%)Downloading (70%)Downloading (75%)Downloading (80%)Downloading (85%)Downloading (90%)Downloading (95%)Downloading (100%)
06-Sep-2019 15:47:05   - Installing twig/twig (v2.11.3): Downloading (connecting...)Downloading (0%)           Downloading (5%)Downloading (10%)Downloading (15%)Downloading (20%)Downloading (25%)Downloading (30%)Downloading (35%)Downloading (40%)Downloading (45%)Downloading (50%)Downloading (55%)Downloading (60%)Downloading (65%)Downloading (70%)Downloading (75%)Downloading (80%)Downloading (90%)Downloading (95%)Downloading (100%)
06-Sep-2019 15:47:06   - Installing symfony/twig-bridge (v3.4.30): Downloading (connecting...)Downloading (0%)           Downloading (5%)Downloading (15%)Downloading (20%)Downloading (25%)Downloading (30%)Downloading (35%)Downloading (40%)Downloading (50%)Downloading (55%)Downloading (60%)Downloading (65%)Downloading (70%)Downloading (75%)Downloading (80%)Downloading (85%)Downloading (90%)Downloading (95%)Downloading (100%)
06-Sep-2019 15:47:06   - Installing symfony/dom-crawler (v3.4.30): Downloading (connecting...)Downloading (0%)           Downloading (5%)Downloading (40%)Downloading (45%)Downloading (65%)Downloading (70%)Downloading (95%)Downloading (100%)
06-Sep-2019 15:47:07   - Installing symfony/css-selector (v3.4.30): Downloading (connecting...)Downloading (0%)           Downloading (5%)Downloading (10%)Downloading (45%)Downloading (50%)Downloading (55%)Downloading (60%)Downloading (65%)Downloading (70%)Downloading (75%)Downloading (80%)Downloading (85%)Downloading (90%)Downloading (95%)Downloading (100%)
06-Sep-2019 15:47:07   - Installing symfony/browser-kit (v3.4.30): Downloading (connecting...)Downloading (0%)           Downloading (5%)Downloading (70%)Downloading (100%)
06-Sep-2019 15:47:07   - Installing guzzlehttp/guzzle (6.3.3): Downloading (connecting...)Downloading (0%)           Downloading (5%)Downloading (15%)Downloading (20%)Downloading (30%)Downloading (40%)Downloading (45%)Downloading (55%)Downloading (60%)Downloading (65%)Downloading (80%)Downloading (85%)Downloading (95%)Downloading (100%)
06-Sep-2019 15:47:08   - Installing fabpot/goutte (v3.2.3): Downloading (connecting...)Downloading (0%)           Downloading (40%)Downloading (100%)
06-Sep-2019 15:47:09   - Installing facebook/webdriver (1.7.1): Downloading (connecting...)Downloading (0%)           Downloading (5%)Downloading (10%)Downloading (15%)Downloading (20%)Downloading (25%)Downloading (30%)Downloading (35%)Downloading (40%)Downloading (45%)Downloading (50%)Downloading (55%)Downloading (60%)Downloading (65%)Downloading (70%)Downloading (75%)Downloading (80%)Downloading (85%)Downloading (90%)Downloading (95%)Downloading (100%)
06-Sep-2019 15:47:09   - Installing symfony/yaml (v3.4.30): Downloading (connecting...)Downloading (0%)           Downloading (5%)Downloading (10%)Downloading (15%)Downloading (35%)Downloading (40%)Downloading (50%)Downloading (55%)Downloading (60%)Downloading (65%)Downloading (70%)Downloading (75%)Downloading (80%)Downloading (100%)
06-Sep-2019 15:47:10   - Installing laravel/homestead (v7.20.0): Downloading (connecting...)Downloading (100%)         
06-Sep-2019 15:47:11   - Installing phing/phing (2.16.1): Downloading (connecting...)Downloading (0%)           Downloading (5%)Downloading (10%)Downloading (15%)Downloading (20%)Downloading (25%)Downloading (30%)Downloading (35%)Downloading (40%)Downloading (45%)Downloading (50%)Downloading (55%)Downloading (60%)Downloading (65%)Downloading (70%)Downloading (75%)Downloading (80%)Downloading (85%)Downloading (90%)Downloading (95%)Downloading (100%)
06-Sep-2019 15:47:11   - Installing webmozart/assert (1.4.0): Downloading (connecting...)Downloading (0%)           Downloading (65%)Downloading (85%)Downloading (100%)
06-Sep-2019 15:47:12   - Installing phpdocumentor/reflection-common (1.0.1): Downloading (connecting...)Downloading (0%)           Downloading (100%)
06-Sep-2019 15:47:12   - Installing phpdocumentor/type-resolver (0.4.0): Downloading (connecting...)Downloading (0%)           Downloading (5%)Downloading (100%)
06-Sep-2019 15:47:12   - Installing phpdocumentor/reflection-docblock (4.3.1): Downloading (connecting...)Downloading (0%)           Downloading (5%)Downloading (10%)Downloading (15%)Downloading (20%)Downloading (25%)Downloading (30%)Downloading (35%)Downloading (40%)Downloading (45%)Downloading (100%)
06-Sep-2019 15:47:13   - Installing sebastian/version (2.0.1): Downloading (connecting...)Downloading (0%)           Downloading (100%)
06-Sep-2019 15:47:14   - Installing sebastian/resource-operations (2.0.1): Downloading (connecting...)Downloading (0%)           Downloading (25%)Downloading (55%)Downloading (100%)
06-Sep-2019 15:47:14   - Installing sebastian/recursion-context (3.0.0): Downloading (connecting...)Downloading (0%)           Downloading (35%)Downloading (70%)Downloading (100%)
06-Sep-2019 15:47:14   - Installing sebastian/object-reflector (1.1.1): Downloading (connecting...)Downloading (0%)           Downloading (65%)Downloading (85%)Downloading (100%)
06-Sep-2019 15:47:15   - Installing sebastian/object-enumerator (3.0.3): Downloading (connecting...)Downloading (0%)           Downloading (100%)
06-Sep-2019 15:47:15   - Installing sebastian/global-state (2.0.0): Downloading (connecting...)Downloading (0%)           Downloading (20%)Downloading (75%)Downloading (95%)Downloading (100%)
06-Sep-2019 15:47:15   - Installing sebastian/exporter (3.1.0): Downloading (connecting...)Downloading (0%)           Downloading (100%)
06-Sep-2019 15:47:16   - Installing sebastian/environment (4.2.2): Downloading (connecting...)Downloading (0%)           Downloading (35%)Downloading (75%)Downloading (100%)
06-Sep-2019 15:47:16   - Installing sebastian/diff (3.0.2): Downloading (connecting...)Downloading (0%)           Downloading (20%)Downloading (40%)Downloading (50%)Downloading (55%)Downloading (70%)Downloading (75%)Downloading (90%)Downloading (95%)Downloading (100%)
06-Sep-2019 15:47:17   - Installing sebastian/comparator (3.0.2): Downloading (connecting...)Downloading (0%)           Downloading (25%)Downloading (50%)Downloading (60%)Downloading (80%)Downloading (90%)Downloading (100%)
06-Sep-2019 15:47:17   - Installing phpunit/php-timer (2.1.2): Downloading (connecting...)Downloading (0%)           Downloading (35%)Downloading (70%)Downloading (90%)Downloading (100%)
06-Sep-2019 15:47:17   - Installing phpunit/php-text-template (1.2.1): Downloading (connecting...)Downloading (0%)           Downloading (35%)Downloading (100%)
06-Sep-2019 15:47:18   - Installing phpunit/php-file-iterator (2.0.2): Downloading (connecting...)Downloading (0%)           Downloading (35%)Downloading (70%)Downloading (100%)
06-Sep-2019 15:47:18   - Installing theseer/tokenizer (1.1.3): Downloading (connecting...)Downloading (0%)           Downloading (15%)Downloading (30%)Downloading (100%)
06-Sep-2019 15:47:19   - Installing sebastian/code-unit-reverse-lookup (1.0.1): Downloading (connecting...)Downloading (0%)           Downloading (55%)Downloading (100%)
06-Sep-2019 15:47:19   - Installing phpunit/php-token-stream (3.1.0): Downloading (connecting...)Downloading (0%)           Downloading (5%)Downloading (35%)Downloading (40%)Downloading (45%)Downloading (100%)
06-Sep-2019 15:47:20   - Installing phpunit/php-code-coverage (6.1.4): Downloading (connecting...)Downloading (0%)           Downloading (5%)Downloading (10%)Downloading (15%)Downloading (20%)Downloading (25%)Downloading (30%)Downloading (35%)Downloading (40%)Downloading (45%)Downloading (50%)Downloading (55%)Downloading (60%)Downloading (65%)Downloading (70%)Downloading (75%)Downloading (80%)Downloading (85%)Downloading (90%)Downloading (95%)Downloading (100%)
06-Sep-2019 15:47:20   - Installing doctrine/instantiator (1.2.0): Downloading (connecting...)Downloading (0%)           Downloading (100%)
06-Sep-2019 15:47:21   - Installing phpspec/prophecy (1.8.1): Downloading (connecting...)Downloading (0%)           Downloading (15%)Downloading (25%)Downloading (35%)Downloading (40%)Downloading (50%)Downloading (60%)Downloading (65%)Downloading (70%)Downloading (75%)Downloading (80%)Downloading (85%)Downloading (90%)Downloading (95%)Downloading (100%)
06-Sep-2019 15:47:21   - Installing phar-io/version (2.0.1): Downloading (connecting...)Downloading (0%)           Downloading (5%)Downloading (10%)Downloading (85%)Downloading (90%)Downloading (95%)Downloading (100%)
06-Sep-2019 15:47:21   - Installing phar-io/manifest (1.0.3): Downloading (connecting...)Downloading (0%)           Downloading (10%)Downloading (15%)Downloading (25%)Downloading (35%)Downloading (40%)Downloading (55%)Downloading (65%)Downloading (75%)Downloading (80%)Downloading (90%)Downloading (100%)
06-Sep-2019 15:47:22   - Installing myclabs/deep-copy (1.9.1): Downloading (connecting...)Downloading (0%)           Downloading (25%)Downloading (30%)Downloading (45%)Downloading (50%)Downloading (65%)Downloading (80%)Downloading (85%)Downloading (90%)Downloading (95%)Downloading (100%)
06-Sep-2019 15:47:23   - Installing phpunit/phpunit (7.5.14): Downloading (connecting...)Downloading (0%)           Downloading (5%)Downloading (10%)Downloading (15%)Downloading (20%)Downloading (25%)Downloading (30%)Downloading (35%)Downloading (45%)Downloading (50%)Downloading (55%)Downloading (60%)Downloading (65%)Downloading (70%)Downloading (75%)Downloading (80%)Downloading (85%)Downloading (90%)Downloading (95%)Downloading (100%)
06-Sep-2019 15:47:23   - Installing phpunit/dbunit (4.0.0): Downloading (connecting...)Downloading (100%)         
06-Sep-2019 15:47:24   - Installing squizlabs/php_codesniffer (3.4.2): Downloading (connecting...)Downloading (0%)           Downloading (5%)Downloading (10%)Downloading (15%)Downloading (20%)Downloading (25%)Downloading (30%)Downloading (35%)Downloading (40%)Downloading (45%)Downloading (50%)Downloading (55%)Downloading (60%)Downloading (65%)Downloading (70%)Downloading (75%)Downloading (80%)Downloading (85%)Downloading (90%)Downloading (95%)Downloading (100%)
06-Sep-2019 15:47:25 symfony/console suggests installing symfony/lock
06-Sep-2019 15:47:25 guzzlehttp/psr7 suggests installing zendframework/zend-httphandlerrunner (Emit PSR-7 responses)
06-Sep-2019 15:47:25 lusitanian/oauth suggests installing predis/predis (Allows using the Redis storage backend.)
06-Sep-2019 15:47:25 patchwork/utf8 suggests installing ext-intl (Use Intl for best performance)
06-Sep-2019 15:47:25 patchwork/utf8 suggests installing ext-wfio (Use WFIO for UTF-8 filesystem access on Windows)
06-Sep-2019 15:47:25 s9e/text-formatter suggests installing ext-intl (Allows international URLs to be accepted by the URL filter)
06-Sep-2019 15:47:25 s9e/text-formatter suggests installing ext-xsl (Enables the XSLT renderer)
06-Sep-2019 15:47:25 paragonie/random_compat suggests installing ext-libsodium (Provides a modern crypto API that can be used to generate random bytes.)
06-Sep-2019 15:47:25 symfony/http-kernel suggests installing symfony/var-dumper
06-Sep-2019 15:47:25 symfony/dependency-injection suggests installing symfony/expression-language (For using expressions in service container configuration)
06-Sep-2019 15:47:25 zendframework/zend-eventmanager suggests installing container-interop/container-interop (^1.1.0, to use the lazy listeners feature)
06-Sep-2019 15:47:25 zendframework/zend-eventmanager suggests installing zendframework/zend-stdlib (^2.7.3 || ^3.0, to use the FilterChain feature)
06-Sep-2019 15:47:25 zendframework/zend-code suggests installing doctrine/annotations (Doctrine\Common\Annotations >=1.0 for annotation features)
06-Sep-2019 15:47:25 zendframework/zend-code suggests installing zendframework/zend-stdlib (Zend\Stdlib component)
06-Sep-2019 15:47:25 ocramius/proxy-manager suggests installing ocramius/generated-hydrator (To have very fast object to array to object conversion for ghost objects)
06-Sep-2019 15:47:25 ocramius/proxy-manager suggests installing zendframework/zend-json (To have the JsonRpc adapter (Remote Object feature))
06-Sep-2019 15:47:25 ocramius/proxy-manager suggests installing zendframework/zend-soap (To have the Soap adapter (Remote Object feature))
06-Sep-2019 15:47:25 ocramius/proxy-manager suggests installing zendframework/zend-xmlrpc (To have the XmlRpc adapter (Remote Object feature))
06-Sep-2019 15:47:25 symfony/routing suggests installing doctrine/annotations (For using the annotation loader)
06-Sep-2019 15:47:25 symfony/routing suggests installing symfony/expression-language (For using expression matching)
06-Sep-2019 15:47:25 symfony/twig-bridge suggests installing symfony/asset (For using the AssetExtension)
06-Sep-2019 15:47:25 symfony/twig-bridge suggests installing symfony/expression-language (For using the ExpressionExtension)
06-Sep-2019 15:47:25 symfony/twig-bridge suggests installing symfony/form (For using the FormExtension)
06-Sep-2019 15:47:25 symfony/twig-bridge suggests installing symfony/security (For using the SecurityExtension)
06-Sep-2019 15:47:25 symfony/twig-bridge suggests installing symfony/stopwatch (For using the StopwatchExtension)
06-Sep-2019 15:47:25 symfony/twig-bridge suggests installing symfony/templating (For using the TwigEngine)
06-Sep-2019 15:47:25 symfony/twig-bridge suggests installing symfony/translation (For using the TranslationExtension)
06-Sep-2019 15:47:25 symfony/twig-bridge suggests installing symfony/var-dumper (For using the DumpExtension)
06-Sep-2019 15:47:25 symfony/twig-bridge suggests installing symfony/web-link (For using the WebLinkExtension)
06-Sep-2019 15:47:25 facebook/webdriver suggests installing ext-SimpleXML (For Firefox profile creation)
06-Sep-2019 15:47:25 phing/phing suggests installing pdepend/pdepend (PHP version of JDepend)
06-Sep-2019 15:47:25 phing/phing suggests installing pear/archive_tar (Tar file management class)
06-Sep-2019 15:47:25 phing/phing suggests installing pear/versioncontrol_git (A library that provides OO interface to handle Git repository)
06-Sep-2019 15:47:25 phing/phing suggests installing pear/versioncontrol_svn (A simple OO-style interface for Subversion, the free/open-source version control system)
06-Sep-2019 15:47:25 phing/phing suggests installing phpdocumentor/phpdocumentor (Documentation Generator for PHP)
06-Sep-2019 15:47:25 phing/phing suggests installing phploc/phploc (A tool for quickly measuring the size of a PHP project)
06-Sep-2019 15:47:25 phing/phing suggests installing phpmd/phpmd (PHP version of PMD tool)
06-Sep-2019 15:47:25 phing/phing suggests installing sebastian/phpcpd (Copy/Paste Detector (CPD) for PHP code)
06-Sep-2019 15:47:25 phing/phing suggests installing siad007/versioncontrol_hg (A library for interfacing with Mercurial repositories.)
06-Sep-2019 15:47:25 phing/phing suggests installing tedivm/jshrink (Javascript Minifier built in PHP)
06-Sep-2019 15:47:25 sebastian/global-state suggests installing ext-uopz (*)
06-Sep-2019 15:47:25 phpunit/phpunit suggests installing ext-soap (*)
06-Sep-2019 15:47:25 phpunit/phpunit suggests installing phpunit/php-invoker (^2.0)
06-Sep-2019 15:47:25 Package phpunit/dbunit is abandoned, you should avoid using it. No replacement was suggested.
06-Sep-2019 15:47:25 Generating autoload files
06-Sep-2019 15:47:25 ocramius/package-versions:  Generating version class...
06-Sep-2019 15:47:25 ocramius/package-versions: ...done generating version class
06-Sep-2019 15:47:25 Buildfile: /data/build/build.xml
06-Sep-2019 15:47:25
06-Sep-2019 15:47:25 phpBB > clean:
06-Sep-2019 15:47:25
06-Sep-2019 15:47:25    [delete] Directory /data/build/logs does not exist or is not a directory.
06-Sep-2019 15:47:25    [delete] Directory /data/build/api does not exist or is not a directory.
06-Sep-2019 15:47:25    [delete] Directory /data/build/codebrowser does not exist or is not a directory.
06-Sep-2019 15:47:25    [delete] Directory /data/build/coverage does not exist or is not a directory.
06-Sep-2019 15:47:25    [delete] Directory /data/build/cpd does not exist or is not a directory.
06-Sep-2019 15:47:25    [delete] Directory /data/build/dependencies does not exist or is not a directory.
06-Sep-2019 15:47:25    [delete] Directory /data/build/new_version does not exist or is not a directory.
06-Sep-2019 15:47:25    [delete] Directory /data/build/old_versions does not exist or is not a directory.
06-Sep-2019 15:47:25    [delete] Directory /data/build/save does not exist or is not a directory.
06-Sep-2019 15:47:25
06-Sep-2019 15:47:25 phpBB > prepare:
06-Sep-2019 15:47:25
06-Sep-2019 15:47:25     [mkdir] Created dir: /data/build/logs
06-Sep-2019 15:47:25     [mkdir] Created dir: /data/build/api
06-Sep-2019 15:47:25     [mkdir] Created dir: /data/build/codebrowser
06-Sep-2019 15:47:25     [mkdir] Created dir: /data/build/coverage
06-Sep-2019 15:47:25     [mkdir] Created dir: /data/build/cpd
06-Sep-2019 15:47:25     [mkdir] Created dir: /data/build/dependencies
06-Sep-2019 15:47:25     [mkdir] Created dir: /data/build/new_version
06-Sep-2019 15:47:25     [mkdir] Created dir: /data/build/new_version/files
06-Sep-2019 15:47:25     [mkdir] Created dir: /data/build/new_version/patches
06-Sep-2019 15:47:25     [mkdir] Created dir: /data/build/new_version/release_files
06-Sep-2019 15:47:25     [mkdir] Created dir: /data/build/new_version/update
06-Sep-2019 15:47:25     [mkdir] Created dir: /data/build/old_versions
06-Sep-2019 15:47:25     [mkdir] Created dir: /data/build/save
06-Sep-2019 15:47:25
06-Sep-2019 15:47:25 BUILD FINISHED
06-Sep-2019 15:47:25
06-Sep-2019 15:47:25 Total time: 0.0884 seconds
06-Sep-2019 15:47:25
06-Sep-2019 15:47:26 Finished task 'Prepare directory' with result: Success
06-Sep-2019 15:47:26 Skipping execution of task 'Run sniffs' as it is disabled
06-Sep-2019 15:47:26
Substituting variable: ${bamboo.working.directory} with /home/bamboo/xml-data/build-dir/PHPBB3-PR-JOB1
06-Sep-2019 15:47:26 Starting task 'Run sniffs' of type 'com.atlassian.bamboo.plugins.bamboo-docker-plugin:task.docker.cli'
06-Sep-2019 15:47:26 Running image name (phpbb:php-7.1)
06-Sep-2019 15:47:26
Beginning to execute external process for build 'phpBB3 - Pull Requests - Build and Test Job #9556 (PHPBB3-PR-JOB1-9556)'
... running command line:
/usr/bin/docker run --volume /home/bamboo/xml-data/build-dir/PHPBB3-PR-JOB1:/data --workdir /data/build --rm -u=991 phpbb:php-7.1 ../phpBB/vendor/bin/phing sniff
... in: /home/bamboo/xml-data/build-dir/PHPBB3-PR-JOB1
... using extra environment variables:
bamboo_planRepository_1_branch=3.1.x
bamboo_planRepository_1_branchDisplayName=3.1.x
bamboo_repository_revision_number=dc8ff9da28b8ab4ad11c7ea94cca526f17c87fe5
bamboo_PRref=master
bamboo_resultsUrl=https://bamboo.phpbb.com/browse/PHPBB3-PR-JOB1-9556
bamboo_capability_system_builder_command_Git=/usr/bin/git
bamboo_repository_75956235_git_username=bantu
bamboo_build_working_directory=/home/bamboo/xml-data/build-dir/PHPBB3-PR-JOB1
bamboo_planRepository_1_name=phpBB Ascraeus
bamboo_buildKey=PHPBB3-PR-JOB1
bamboo_capability_phpbb_tests=true
bamboo_shortPlanName=Pull Requests
bamboo_capability_system_builder_command_fop=/usr/bin/fop
bamboo_capability_dbms_sqlite_2=true
bamboo_planRepository_name=phpBB Ascraeus
bamboo_PRnumber=5663
bamboo_buildNumber=9556
bamboo_repository_75956235_git_repositoryUrl=https://github.com/phpbb/phpbb.git
bamboo_capability_system_builder_phpunit_PHPUnit=/usr/bin/phpunit
bamboo_shortJobName=Build and Test Job
bamboo_buildResultsUrl=https://bamboo.phpbb.com/browse/PHPBB3-PR-JOB1-9556
bamboo_repository_75956235_branch_name=3.1.x
bamboo_planRepository_repositoryUrl=https://github.com/phpbb/phpbb.git
bamboo_agentId=131073
bamboo_planName=phpBB3 - Pull Requests
bamboo_build_commandline_com_atlassian_bamboo_plugins_scripttask_task_builder_script_7=/bin/sh /home/bamboo/temp/PHPBB3-PR-JOB1-9556-ScriptBuildTask-6366138697716156340.sh
bamboo_shortPlanKey=PR
bamboo_shortJobKey=JOB1
bamboo_capability_dbms_mysql_55=true
bamboo_capability_system_jdk_JDK_1_7_0_65=/usr/lib/jvm/java-7-openjdk-amd64
bamboo_planRepository_revision=dc8ff9da28b8ab4ad11c7ea94cca526f17c87fe5
bamboo_buildTimeStamp=2019-09-06T15:46:23.784Z
bamboo_repository_previous_revision_number=dc8ff9da28b8ab4ad11c7ea94cca526f17c87fe5
bamboo_capability_system_jdk_JDK_1_6_0_16=/usr/lib/jvm/java-6-sun-1.6.0.16
bamboo_capability_system_builder_mvn2_Maven_2=/usr/share/maven2
bamboo_planRepository_previousRevision=dc8ff9da28b8ab4ad11c7ea94cca526f17c87fe5
bamboo_build_commandline_com_atlassian_bamboo_plugins_scripttask_task_builder_script_4=/bin/sh /home/bamboo/temp/PHPBB3-PR-JOB1-9556-ScriptBuildTask-5226517578466165961.sh
bamboo_repository_git_branch=3.1.x
bamboo_buildResultKey=PHPBB3-PR-JOB1-9556
bamboo_repository_branch_name=3.1.x
bamboo_buildPlanName=phpBB3 - Pull Requests - Build and Test Job
bamboo_planRepository_1_revision=dc8ff9da28b8ab4ad11c7ea94cca526f17c87fe5
bamboo_repository_name=phpBB Ascraeus
bamboo_buildFailed=false
bamboo_capability_system_docker_executable=/usr/bin/docker
bamboo_build_commandline_com_atlassian_bamboo_plugins_bamboo_docker_plugin_task_docker_cli_12=/usr/bin/docker run --volume /home/bamboo/xml-data/build-dir/PHPBB3-PR-JOB1:/data --workdir /data/phpBB --rm -e HOME=/home/bamboo -u=991 phpbb:php-7.1 /bin/bash -c php ../composer.phar install --dev; cd ../build; ../phpBB/vendor/bin/phing clean prepare
bamboo_build_commandline_com_atlassian_bamboo_plugins_bamboo_docker_plugin_task_docker_cli_13=/usr/bin/docker build --force-rm=true --tag=phpbb:php-7.1 /home/bamboo/xml-data/build-dir/PHPBB3-PR-JOB1
bamboo_planRepository_branch=3.1.x
bamboo_agentWorkingDirectory=/home/bamboo/xml-data/build-dir
bamboo_capability_system_git_executable=/usr/bin/git
bamboo_capability_system_builder_phpunit_PHPUnit_3_4=/usr/bin/phpunit
bamboo_repository_git_username=bantu
bamboo_planRepository_1_previousRevision=dc8ff9da28b8ab4ad11c7ea94cca526f17c87fe5
bamboo_repository_75956235_revision_number=dc8ff9da28b8ab4ad11c7ea94cca526f17c87fe5
bamboo_planRepository_branchDisplayName=3.1.x
bamboo_planRepository_1_type=gitv2
bamboo_planRepository_branchName=3.1.x
bamboo_repository_75956235_previous_revision_number=dc8ff9da28b8ab4ad11c7ea94cca526f17c87fe5
bamboo_capability_system_jdk_JDK=/usr/lib/jvm/java-6-sun
bamboo_plan_storageTag=PHPBB3-PR
bamboo_hg_cache_directory=/home/bamboo/xml-data/build-dir/_hg-repositories-cache
bamboo_planRepository_1_username=bantu
bamboo_planRepository_type=gitv2
bamboo_git_cache_directory=/home/bamboo/xml-data/build-dir/_git-repositories-cache
bamboo_ManualBuildTriggerReason_userName=Build Robot
bamboo_repository_git_repositoryUrl=https://github.com/phpbb/phpbb.git
bamboo_repository_75956235_git_branch=3.1.x
bamboo_capability_system_builder_ant_Ant=/usr/share/ant
bamboo_repository_75956235_name=phpBB Ascraeus
bamboo_tmp_directory=/home/bamboo/temp
bamboo_working_directory=/home/bamboo/xml-data/build-dir/PHPBB3-PR-JOB1
bamboo_planKey=PHPBB3-PR
bamboo_capability_local=true
bamboo_planRepository_1_repositoryUrl=https://github.com/phpbb/phpbb.git
bamboo_planRepository_username=bantu
bamboo_capability_system_jdk_JDK_1_6=/usr/lib/jvm/java-6-sun
bamboo_capability_system_jdk_JDK_1_7=/usr/lib/jvm/java-7-openjdk-amd64
bamboo_planRepository_1_branchName=3.1.x
06-Sep-2019 15:47:26 Buildfile: /data/build/build.xml
06-Sep-2019 15:47:26
06-Sep-2019 15:47:26 phpBB > sniff:
06-Sep-2019 15:47:26
06-Sep-2019 15:47:32 ............................................................  60 / 774 (8%)
06-Sep-2019 15:47:33 ............................................................ 120 / 774 (16%)
06-Sep-2019 15:47:33 ............................................................ 180 / 774 (23%)
06-Sep-2019 15:47:34 ............................................................ 240 / 774 (31%)
06-Sep-2019 15:47:36 ............................................................ 300 / 774 (39%)
06-Sep-2019 15:47:40 ............................................................ 360 / 774 (47%)
06-Sep-2019 15:47:43 ............................................................ 420 / 774 (54%)
06-Sep-2019 15:47:47 ............................................................ 480 / 774 (62%)
06-Sep-2019 15:47:51 ............................................................ 540 / 774 (70%)
06-Sep-2019 15:47:53 ............................................................ 600 / 774 (78%)
06-Sep-2019 15:47:57 ............................................................ 660 / 774 (85%)
06-Sep-2019 15:48:00 ............................................................ 720 / 774 (93%)
06-Sep-2019 15:48:01 ......................................................       774 / 774 (100%)
06-Sep-2019 15:48:01
06-Sep-2019 15:48:01
06-Sep-2019 15:48:01 Time: 35.13 secs; Memory: 50.01MB
06-Sep-2019 15:48:01
06-Sep-2019 15:48:01       [php] Calling PHP function: preg_replace()
06-Sep-2019 15:48:06 ............................................................  60 / 209 (29%)
06-Sep-2019 15:48:18 ........E........E.E...E.E.................................. 120 / 209 (57%)
06-Sep-2019 15:48:26 ............................................................ 180 / 209 (86%)
06-Sep-2019 15:48:31 .............................                                209 / 209 (100%)
06-Sep-2019 15:48:31
06-Sep-2019 15:48:31
06-Sep-2019 15:48:31
06-Sep-2019 15:48:31 FILE: /data/phpBB/includes/mcp/mcp_post.php
06-Sep-2019 15:48:31 ----------------------------------------------------------------------
06-Sep-2019 15:48:31 FOUND 1 ERROR AFFECTING 1 LINE
06-Sep-2019 15:48:31 ----------------------------------------------------------------------
06-Sep-2019 15:48:31 30 | ERROR | [x] Tabs must be used to indent lines; spaces are not
06-Sep-2019 15:48:31     |       |     allowed
06-Sep-2019 15:48:31     |       |     (Generic.WhiteSpace.DisallowSpaceIndent.SpacesUsed)
06-Sep-2019 15:48:31 ----------------------------------------------------------------------
06-Sep-2019 15:48:31 PHPCBF CAN FIX THE 1 MARKED SNIFF VIOLATIONS AUTOMATICALLY
06-Sep-2019 15:48:31 ----------------------------------------------------------------------
06-Sep-2019 15:48:31
06-Sep-2019 15:48:31
06-Sep-2019 15:48:31 FILE: /data/phpBB/includes/mcp/mcp_topic.php
06-Sep-2019 15:48:31 ----------------------------------------------------------------------
06-Sep-2019 15:48:31 FOUND 1 ERROR AFFECTING 1 LINE
06-Sep-2019 15:48:31 ----------------------------------------------------------------------
06-Sep-2019 15:48:31 29 | ERROR | [x] Tabs must be used to indent lines; spaces are not
06-Sep-2019 15:48:31     |       |     allowed
06-Sep-2019 15:48:31     |       |     (Generic.WhiteSpace.DisallowSpaceIndent.SpacesUsed)
06-Sep-2019 15:48:31 ----------------------------------------------------------------------
06-Sep-2019 15:48:31 PHPCBF CAN FIX THE 1 MARKED SNIFF VIOLATIONS AUTOMATICALLY
06-Sep-2019 15:48:31 ----------------------------------------------------------------------
06-Sep-2019 15:48:31
06-Sep-2019 15:48:31
06-Sep-2019 15:48:31 FILE: /data/phpBB/includes/mcp/mcp_main.php
06-Sep-2019 15:48:31 ----------------------------------------------------------------------
06-Sep-2019 15:48:31 FOUND 5 ERRORS AFFECTING 5 LINES
06-Sep-2019 15:48:31 ----------------------------------------------------------------------
06-Sep-2019 15:48:31    39 | ERROR | [x] Tabs must be used to indent lines; spaces are not
06-Sep-2019 15:48:31       |       |     allowed
06-Sep-2019 15:48:31       |       |     (Generic.WhiteSpace.DisallowSpaceIndent.SpacesUsed)
06-Sep-2019 15:48:31   803 | ERROR | [x] Tabs must be used to indent lines; spaces are not
06-Sep-2019 15:48:31       |       |     allowed
06-Sep-2019 15:48:31       |       |     (Generic.WhiteSpace.DisallowSpaceIndent.SpacesUsed)
06-Sep-2019 15:48:31   881 | ERROR | [x] Tabs must be used to indent lines; spaces are not
06-Sep-2019 15:48:31       |       |     allowed
06-Sep-2019 15:48:31       |       |     (Generic.WhiteSpace.DisallowSpaceIndent.SpacesUsed)
06-Sep-2019 15:48:31 1038 | ERROR | [x] Tabs must be used to indent lines; spaces are not
06-Sep-2019 15:48:31       |       |     allowed
06-Sep-2019 15:48:31       |       |     (Generic.WhiteSpace.DisallowSpaceIndent.SpacesUsed)
06-Sep-2019 15:48:31 1282 | ERROR | [x] Tabs must be used to indent lines; spaces are not
06-Sep-2019 15:48:31       |       |     allowed
06-Sep-2019 15:48:31       |       |     (Generic.WhiteSpace.DisallowSpaceIndent.SpacesUsed)
06-Sep-2019 15:48:31 ----------------------------------------------------------------------
06-Sep-2019 15:48:31 PHPCBF CAN FIX THE 5 MARKED SNIFF VIOLATIONS AUTOMATICALLY
06-Sep-2019 15:48:31 ----------------------------------------------------------------------
06-Sep-2019 15:48:31
06-Sep-2019 15:48:31
06-Sep-2019 15:48:31 FILE: /data/phpBB/includes/mcp/mcp_front.php
06-Sep-2019 15:48:31 ----------------------------------------------------------------------
06-Sep-2019 15:48:31 FOUND 1 ERROR AFFECTING 1 LINE
06-Sep-2019 15:48:31 ----------------------------------------------------------------------
06-Sep-2019 15:48:31 30 | ERROR | [x] Tabs must be used to indent lines; spaces are not
06-Sep-2019 15:48:31     |       |     allowed
06-Sep-2019 15:48:31     |       |     (Generic.WhiteSpace.DisallowSpaceIndent.SpacesUsed)
06-Sep-2019 15:48:31 ----------------------------------------------------------------------
06-Sep-2019 15:48:31 PHPCBF CAN FIX THE 1 MARKED SNIFF VIOLATIONS AUTOMATICALLY
06-Sep-2019 15:48:31 ----------------------------------------------------------------------
06-Sep-2019 15:48:31
06-Sep-2019 15:48:31
06-Sep-2019 15:48:31 FILE: /data/phpBB/includes/mcp/mcp_forum.php
06-Sep-2019 15:48:31 ----------------------------------------------------------------------
06-Sep-2019 15:48:31 FOUND 6 ERRORS AFFECTING 6 LINES
06-Sep-2019 15:48:31 ----------------------------------------------------------------------
06-Sep-2019 15:48:31 46 | ERROR | [x] Tabs must be used to indent lines; spaces are not
06-Sep-2019 15:48:31     |       |     allowed
06-Sep-2019 15:48:31     |       |     (Generic.WhiteSpace.DisallowSpaceIndent.SpacesUsed)
06-Sep-2019 15:48:31 47 | ERROR | [ ] Opening brace indented incorrectly; expected 4
06-Sep-2019 15:48:31     |       |     spaces, found 1
06-Sep-2019 15:48:31     |       |     (..phpbb_Sniffs_ControlStructures_OpeningBraceBsdAllman.BraceIndent)
06-Sep-2019 15:48:31 50 | ERROR | [x] Tabs must be used to indent lines; spaces are not
06-Sep-2019 15:48:31     |       |     allowed
06-Sep-2019 15:48:31     |       |     (Generic.WhiteSpace.DisallowSpaceIndent.SpacesUsed)
06-Sep-2019 15:48:31 51 | ERROR | [ ] Opening brace indented incorrectly; expected 4
06-Sep-2019 15:48:31     |       |     spaces, found 1
06-Sep-2019 15:48:31     |       |     (..phpbb_Sniffs_ControlStructures_OpeningBraceBsdAllman.BraceIndent)
06-Sep-2019 15:48:31 54 | ERROR | [x] Tabs must be used to indent lines; spaces are not
06-Sep-2019 15:48:31     |       |     allowed
06-Sep-2019 15:48:31     |       |     (Generic.WhiteSpace.DisallowSpaceIndent.SpacesUsed)
06-Sep-2019 15:48:31 55 | ERROR | [ ] Opening brace indented incorrectly; expected 4
06-Sep-2019 15:48:31     |       |     spaces, found 1
06-Sep-2019 15:48:31     |       |     (..phpbb_Sniffs_ControlStructures_OpeningBraceBsdAllman.BraceIndent)
06-Sep-2019 15:48:31 ----------------------------------------------------------------------
06-Sep-2019 15:48:31 PHPCBF CAN FIX THE 3 MARKED SNIFF VIOLATIONS AUTOMATICALLY
06-Sep-2019 15:48:31 ----------------------------------------------------------------------
06-Sep-2019 15:48:31
06-Sep-2019 15:48:31 Time: 30.08 secs; Memory: 40.01MB
06-Sep-2019 15:48:31
06-Sep-2019 15:48:32
06-Sep-2019 15:48:32
06-Sep-2019 15:48:32 Time: 29ms; Memory: 4MB
06-Sep-2019 15:48:32
06-Sep-2019 15:48:32
06-Sep-2019 15:48:32 BUILD FAILED
06-Sep-2019 15:48:32 /data/build/build.xml:116:6: /data/build/build.xml:123:46: PHP Code Sniffer failed.
06-Sep-2019 15:48:32
06-Sep-2019 15:48:32 Total time: 1 minute  5.44 seconds
06-Sep-2019 15:48:32
06-Sep-2019 15:48:32 Error occurred while running Task 'Run sniffs(11)' of type com.atlassian.bamboo.plugins.bamboo-docker-plugin:task.docker.cli.
06-Sep-2019 15:48:32 com.atlassian.bamboo.task.TaskException: Failed to execute task
06-Sep-2019 15:48:32         at com.atlassian.bamboo.plugins.docker.service.RunService.execute(RunService.java:75)
06-Sep-2019 15:48:32         at com.atlassian.bamboo.plugins.docker.tasks.cli.DockerCliTask.execute(DockerCliTask.java:70)
06-Sep-2019 15:48:32         at com.atlassian.bamboo.task.TaskExecutorImpl.lambda$executeTasks$3(TaskExecutorImpl.java:285)
06-Sep-2019 15:48:32         at com.atlassian.bamboo.task.TaskExecutorImpl.executeTaskWithPrePostActions(TaskExecutorImpl.java:224)
06-Sep-2019 15:48:32         at com.atlassian.bamboo.task.TaskExecutorImpl.executeTasks(TaskExecutorImpl.java:285)
06-Sep-2019 15:48:32         at com.atlassian.bamboo.task.TaskExecutorImpl.execute(TaskExecutorImpl.java:112)
06-Sep-2019 15:48:32         at com.atlassian.bamboo.build.pipeline.tasks.ExecuteBuildTask.call(ExecuteBuildTask.java:71)
06-Sep-2019 15:48:32         at com.atlassian.bamboo.v2.build.agent.DefaultBuildAgent.executeBuildPhase(DefaultBuildAgent.java:203)
06-Sep-2019 15:48:32         at com.atlassian.bamboo.v2.build.agent.DefaultBuildAgent.build(DefaultBuildAgent.java:175)
06-Sep-2019 15:48:32         at com.atlassian.bamboo.v2.build.agent.BuildAgentControllerImpl.lambda$waitAndPerformBuild$0(BuildAgentControllerImpl.java:122)
06-Sep-2019 15:48:32         at com.atlassian.bamboo.variable.CustomVariableContextImpl.withVariableSubstitutor(CustomVariableContextImpl.java:185)
06-Sep-2019 15:48:32         at com.atlassian.bamboo.v2.build.agent.BuildAgentControllerImpl.waitAndPerformBuild(BuildAgentControllerImpl.java:117)
06-Sep-2019 15:48:32         at com.atlassian.bamboo.v2.build.agent.DefaultBuildAgent$1.run(DefaultBuildAgent.java:126)
06-Sep-2019 15:48:32         at com.atlassian.bamboo.utils.BambooRunnables$1.run(BambooRunnables.java:48)
06-Sep-2019 15:48:32         at com.atlassian.bamboo.security.ImpersonationHelper.runWith(ImpersonationHelper.java:26)
06-Sep-2019 15:48:32         at com.atlassian.bamboo.security.ImpersonationHelper.runWithSystemAuthority(ImpersonationHelper.java:17)
06-Sep-2019 15:48:32         at com.atlassian.bamboo.security.ImpersonationHelper$1.run(ImpersonationHelper.java:41)
06-Sep-2019 15:48:32         at java.lang.Thread.run(Thread.java:748)
06-Sep-2019 15:48:32 Caused by: com.atlassian.bamboo.docker.DockerException: Error running Docker run command
06-Sep-2019 15:48:32         at com.atlassian.bamboo.docker.DockerContainerServiceImpl.run(DockerContainerServiceImpl.java:118)
06-Sep-2019 15:48:32         at sun.reflect.GeneratedMethodAccessor2260.invoke(Unknown Source)
06-Sep-2019 15:48:32         at sun.reflect.DelegatingMethodAccessorImpl.invoke(DelegatingMethodAccessorImpl.java:43)
06-Sep-2019 15:48:32         at java.lang.reflect.Method.invoke(Method.java:498)
06-Sep-2019 15:48:32         at com.atlassian.plugin.util.ContextClassLoaderSettingInvocationHandler.invoke(ContextClassLoaderSettingInvocationHandler.java:26)
06-Sep-2019 15:48:32         at com.sun.proxy.$Proxy401.run(Unknown Source)
06-Sep-2019 15:48:32         at sun.reflect.GeneratedMethodAccessor2260.invoke(Unknown Source)
06-Sep-2019 15:48:32         at sun.reflect.DelegatingMethodAccessorImpl.invoke(DelegatingMethodAccessorImpl.java:43)
06-Sep-2019 15:48:32         at java.lang.reflect.Method.invoke(Method.java:498)
06-Sep-2019 15:48:32         at org.springframework.aop.support.AopUtils.invokeJoinpointUsingReflection(AopUtils.java:302)
06-Sep-2019 15:48:32         at org.eclipse.gemini.blueprint.service.importer.support.internal.aop.ServiceInvoker.doInvoke(ServiceInvoker.java:56)
06-Sep-2019 15:48:32         at org.eclipse.gemini.blueprint.service.importer.support.internal.aop.ServiceInvoker.invoke(ServiceInvoker.java:60)
06-Sep-2019 15:48:32         at org.springframework.aop.framework.ReflectiveMethodInvocation.proceed(ReflectiveMethodInvocation.java:179)
06-Sep-2019 15:48:32         at org.springframework.aop.support.DelegatingIntroductionInterceptor.doProceed(DelegatingIntroductionInterceptor.java:133)
06-Sep-2019 15:48:32         at org.springframework.aop.support.DelegatingIntroductionInterceptor.invoke(DelegatingIntroductionInterceptor.java:121)
06-Sep-2019 15:48:32         at org.springframework.aop.framework.ReflectiveMethodInvocation.proceed(ReflectiveMethodInvocation.java:179)
06-Sep-2019 15:48:32         at org.eclipse.gemini.blueprint.service.util.internal.aop.ServiceTCCLInterceptor.invokeUnprivileged(ServiceTCCLInterceptor.java:70)
06-Sep-2019 15:48:32         at org.eclipse.gemini.blueprint.service.util.internal.aop.ServiceTCCLInterceptor.invoke(ServiceTCCLInterceptor.java:53)
06-Sep-2019 15:48:32         at org.springframework.aop.framework.ReflectiveMethodInvocation.proceed(ReflectiveMethodInvocation.java:179)
06-Sep-2019 15:48:32         at org.eclipse.gemini.blueprint.service.importer.support.LocalBundleContextAdvice.invoke(LocalBundleContextAdvice.java:57)
06-Sep-2019 15:48:32         at org.springframework.aop.framework.ReflectiveMethodInvocation.proceed(ReflectiveMethodInvocation.java:179)
06-Sep-2019 15:48:32         at org.springframework.aop.support.DelegatingIntroductionInterceptor.doProceed(DelegatingIntroductionInterceptor.java:133)
06-Sep-2019 15:48:32         at org.springframework.aop.support.DelegatingIntroductionInterceptor.invoke(DelegatingIntroductionInterceptor.java:121)
06-Sep-2019 15:48:32         at org.springframework.aop.framework.ReflectiveMethodInvocation.proceed(ReflectiveMethodInvocation.java:179)
06-Sep-2019 15:48:32         at org.springframework.aop.framework.JdkDynamicAopProxy.invoke(JdkDynamicAopProxy.java:207)
06-Sep-2019 15:48:32         at com.sun.proxy.$Proxy662.run(Unknown Source)
06-Sep-2019 15:48:32         at com.atlassian.bamboo.plugins.docker.client.DockerCmd.run(DockerCmd.java:51)
06-Sep-2019 15:48:32         at com.atlassian.bamboo.plugins.docker.service.RunService.execute(RunService.java:64)
06-Sep-2019 15:48:32         ... 17 more
06-Sep-2019 15:48:32 Caused by: com.atlassian.utils.process.ProcessException: Error executing /usr/bin/docker run --volume /home/bamboo/xml-data/build-dir/PHPBB3-PR-JOB1:/data --workdir /data/build --rm -u=991 phpbb:php-7.1 ../phpBB/vendor/bin/phing sniff
06-Sep-2019 15:48:32         at com.atlassian.bamboo.docker.DockerContainerServiceImpl.execute(DockerContainerServiceImpl.java:252)
06-Sep-2019 15:48:32         at com.atlassian.bamboo.docker.DockerContainerServiceImpl.run(DockerContainerServiceImpl.java:106)
06-Sep-2019 15:48:32         ... 44 more
06-Sep-2019 15:48:32 Starting task 'Parsing test results produced by script' of type 'com.atlassian.bamboo.plugins.testresultparser:task.testresultparser.junit'
06-Sep-2019 15:48:32 Parsing test results under /home/bamboo/xml-data/build-dir/PHPBB3-PR-JOB1...
06-Sep-2019 15:48:32 Failing task since test cases were expected but none were found.
06-Sep-2019 15:48:32 Finished task 'Parsing test results produced by script' with result: Failed
06-Sep-2019 15:48:32
Substituting variable: ${bamboo.PRnumber} with 5663
06-Sep-2019 15:48:32
Substituting variable: ${bamboo.buildResultsUrl} with https://bamboo.phpbb.com/browse/PHPBB3-PR-JOB1-9556
06-Sep-2019 15:48:32
Substituting variable: ${bamboo.buildResultsUrl} with https://bamboo.phpbb.com/browse/PHPBB3-PR-JOB1-9556
06-Sep-2019 15:48:32 Starting task 'Set result build status' of type 'com.atlassian.bamboo.plugins.scripttask:task.builder.script'
06-Sep-2019 15:48:32
Beginning to execute external process for build 'phpBB3 - Pull Requests - Build and Test Job #9556 (PHPBB3-PR-JOB1-9556)'
... running command line:
/bin/sh /home/bamboo/temp/PHPBB3-PR-JOB1-9556-ScriptBuildTask-6091907420205022046.sh
... in: /home/bamboo/xml-data/build-dir/PHPBB3-PR-JOB1
... using extra environment variables:
bamboo_planRepository_1_branch=3.1.x
bamboo_planRepository_1_branchDisplayName=3.1.x
bamboo_repository_revision_number=dc8ff9da28b8ab4ad11c7ea94cca526f17c87fe5
bamboo_PRref=master
bamboo_resultsUrl=https://bamboo.phpbb.com/browse/PHPBB3-PR-JOB1-9556
bamboo_capability_system_builder_command_Git=/usr/bin/git
bamboo_repository_75956235_git_username=bantu
bamboo_build_working_directory=/home/bamboo/xml-data/build-dir/PHPBB3-PR-JOB1
bamboo_planRepository_1_name=phpBB Ascraeus
bamboo_buildKey=PHPBB3-PR-JOB1
bamboo_capability_phpbb_tests=true
bamboo_shortPlanName=Pull Requests
bamboo_capability_system_builder_command_fop=/usr/bin/fop
bamboo_capability_dbms_sqlite_2=true
bamboo_planRepository_name=phpBB Ascraeus
bamboo_PRnumber=5663
bamboo_buildNumber=9556
bamboo_repository_75956235_git_repositoryUrl=https://github.com/phpbb/phpbb.git
bamboo_capability_system_builder_phpunit_PHPUnit=/usr/bin/phpunit
bamboo_shortJobName=Build and Test Job
bamboo_buildResultsUrl=https://bamboo.phpbb.com/browse/PHPBB3-PR-JOB1-9556
bamboo_repository_75956235_branch_name=3.1.x
bamboo_planRepository_repositoryUrl=https://github.com/phpbb/phpbb.git
bamboo_agentId=131073
bamboo_planName=phpBB3 - Pull Requests
bamboo_build_commandline_com_atlassian_bamboo_plugins_scripttask_task_builder_script_7=/bin/sh /home/bamboo/temp/PHPBB3-PR-JOB1-9556-ScriptBuildTask-6366138697716156340.sh
bamboo_shortPlanKey=PR
bamboo_shortJobKey=JOB1
bamboo_capability_dbms_mysql_55=true
bamboo_capability_system_jdk_JDK_1_7_0_65=/usr/lib/jvm/java-7-openjdk-amd64
bamboo_planRepository_revision=dc8ff9da28b8ab4ad11c7ea94cca526f17c87fe5
bamboo_buildTimeStamp=2019-09-06T15:46:23.784Z
bamboo_repository_previous_revision_number=dc8ff9da28b8ab4ad11c7ea94cca526f17c87fe5
bamboo_capability_system_jdk_JDK_1_6_0_16=/usr/lib/jvm/java-6-sun-1.6.0.16
bamboo_capability_system_builder_mvn2_Maven_2=/usr/share/maven2
bamboo_planRepository_previousRevision=dc8ff9da28b8ab4ad11c7ea94cca526f17c87fe5
bamboo_build_commandline_com_atlassian_bamboo_plugins_scripttask_task_builder_script_4=/bin/sh /home/bamboo/temp/PHPBB3-PR-JOB1-9556-ScriptBuildTask-5226517578466165961.sh
bamboo_repository_git_branch=3.1.x
bamboo_buildResultKey=PHPBB3-PR-JOB1-9556
bamboo_repository_branch_name=3.1.x
bamboo_buildPlanName=phpBB3 - Pull Requests - Build and Test Job
bamboo_planRepository_1_revision=dc8ff9da28b8ab4ad11c7ea94cca526f17c87fe5
bamboo_repository_name=phpBB Ascraeus
bamboo_buildFailed=true
bamboo_capability_system_docker_executable=/usr/bin/docker
bamboo_build_commandline_com_atlassian_bamboo_plugins_bamboo_docker_plugin_task_docker_cli_11=/usr/bin/docker run --volume /home/bamboo/xml-data/build-dir/PHPBB3-PR-JOB1:/data --workdir /data/build --rm -u=991 phpbb:php-7.1 ../phpBB/vendor/bin/phing sniff
bamboo_build_commandline_com_atlassian_bamboo_plugins_bamboo_docker_plugin_task_docker_cli_12=/usr/bin/docker run --volume /home/bamboo/xml-data/build-dir/PHPBB3-PR-JOB1:/data --workdir /data/phpBB --rm -e HOME=/home/bamboo -u=991 phpbb:php-7.1 /bin/bash -c php ../composer.phar install --dev; cd ../build; ../phpBB/vendor/bin/phing clean prepare
bamboo_build_commandline_com_atlassian_bamboo_plugins_bamboo_docker_plugin_task_docker_cli_13=/usr/bin/docker build --force-rm=true --tag=phpbb:php-7.1 /home/bamboo/xml-data/build-dir/PHPBB3-PR-JOB1
bamboo_planRepository_branch=3.1.x
bamboo_agentWorkingDirectory=/home/bamboo/xml-data/build-dir
bamboo_jobFailed=true
bamboo_capability_system_git_executable=/usr/bin/git
bamboo_capability_system_builder_phpunit_PHPUnit_3_4=/usr/bin/phpunit
bamboo_repository_git_username=bantu
bamboo_planRepository_1_previousRevision=dc8ff9da28b8ab4ad11c7ea94cca526f17c87fe5
bamboo_repository_75956235_revision_number=dc8ff9da28b8ab4ad11c7ea94cca526f17c87fe5
bamboo_planRepository_branchDisplayName=3.1.x
bamboo_planRepository_1_type=gitv2
bamboo_planRepository_branchName=3.1.x
bamboo_repository_75956235_previous_revision_number=dc8ff9da28b8ab4ad11c7ea94cca526f17c87fe5
bamboo_capability_system_jdk_JDK=/usr/lib/jvm/java-6-sun
bamboo_plan_storageTag=PHPBB3-PR
bamboo_hg_cache_directory=/home/bamboo/xml-data/build-dir/_hg-repositories-cache
bamboo_planRepository_1_username=bantu
bamboo_planRepository_type=gitv2
bamboo_git_cache_directory=/home/bamboo/xml-data/build-dir/_git-repositories-cache
bamboo_ManualBuildTriggerReason_userName=Build Robot
bamboo_repository_git_repositoryUrl=https://github.com/phpbb/phpbb.git
bamboo_repository_75956235_git_branch=3.1.x
bamboo_capability_system_builder_ant_Ant=/usr/share/ant
bamboo_repository_75956235_name=phpBB Ascraeus
bamboo_tmp_directory=/home/bamboo/temp
bamboo_working_directory=/home/bamboo/xml-data/build-dir/PHPBB3-PR-JOB1
bamboo_planKey=PHPBB3-PR
bamboo_capability_local=true
bamboo_planRepository_1_repositoryUrl=https://github.com/phpbb/phpbb.git
bamboo_planRepository_username=bantu
bamboo_capability_system_jdk_JDK_1_6=/usr/lib/jvm/java-6-sun
bamboo_capability_system_jdk_JDK_1_7=/usr/lib/jvm/java-7-openjdk-amd64
bamboo_planRepository_1_branchName=3.1.x
06-Sep-2019 15:48:32 From https://github.com/phpbb/phpbb
06-Sep-2019 15:48:32 * branch            refs/pull/5663/head -> FETCH_HEAD
06-Sep-2019 15:48:32 grep: build/logs/phpunit.xml: No such file or directory
06-Sep-2019 15:48:32 grep: build/logs/phpunit.xml: No such file or directory
06-Sep-2019 15:48:32   % Total    % Received % Xferd  Average Speed   Time    Time     Time  Current
06-Sep-2019 15:48:32                                  Dload  Upload   Total   Spent    Left  Speed
06-Sep-2019 15:48:32
06-Sep-2019 15:48:32   0     0    0     0    0     0      0      0 --:--:-- --:--:-- --:--:--     0
06-Sep-2019 15:48:32 100   273  100    93  100   180    292    566 --:--:-- --:--:-- --:--:--   567
06-Sep-2019 15:48:32 Finished task 'Set result build status' with result: Success
06-Sep-2019 15:48:32 Running post build plugin 'NCover Results Collector'
06-Sep-2019 15:48:32 Running post build plugin 'Artifact Copier'
06-Sep-2019 15:48:32 Running post build plugin 'npm Cache Cleanup'
06-Sep-2019 15:48:32 Running post build plugin 'Clover Results Collector'
06-Sep-2019 15:48:32 Running post build plugin 'Docker Container Cleanup'
06-Sep-2019 15:48:33 Successfully removed working directory at '/home/bamboo/xml-data/build-dir/PHPBB3-PR-JOB1'
06-Sep-2019 15:48:33 Finalising the build...
06-Sep-2019 15:48:33 Stopping timer.
06-Sep-2019 15:48:33 Build PHPBB3-PR-JOB1-9556 completed.
06-Sep-2019 15:48:33 Running on server: post build plugin 'NCover Results Collector'
06-Sep-2019 15:48:33 Running on server: post build plugin 'Build Hanging Detection Configuration'
06-Sep-2019 15:48:33 Running on server: post build plugin 'Clover Delta Calculator'
06-Sep-2019 15:48:33 Running on server: post build plugin 'Maven Dependencies Postprocessor'
06-Sep-2019 15:48:33 All post build plugins have finished
06-Sep-2019 15:48:33 Generating build results summary...
06-Sep-2019 15:48:33 Saving build results to disk...
06-Sep-2019 15:48:33 Logging substituted variables...
06-Sep-2019 15:48:33 Indexing build results...
06-Sep-2019 15:48:33 Finished building PHPBB3-PR-JOB1-9556.
06-Sep-2019 15:48:33
Substituting variable: ${bamboo.PRnumber} with 5663