Tests pending pull requests

Build: #9560 failed

Job: Build and Test Job failed

Stages & jobs

  1. Build and Test

Build log

The build generated 534 lines of output. Download or view full build log

07-Sep-2019 11:26:39 Build phpBB3 - Pull Requests - Build and Test Job #9560 (PHPBB3-PR-JOB1-9560) started building on agent Default Agent
07-Sep-2019 11:26:39
07-Sep-2019 11:26:39 Build working directory is /home/bamboo/xml-data/build-dir/PHPBB3-PR-JOB1
07-Sep-2019 11:26:39 Executing build phpBB3 - Pull Requests - Build and Test Job #9560 (PHPBB3-PR-JOB1-9560)
07-Sep-2019 11:26:39 Starting task 'Checkout develop branch' of type 'com.atlassian.bamboo.plugins.vcs:task.vcs.checkout'
07-Sep-2019 11:26:39 Build always requires a clean checkout
07-Sep-2019 11:26:39 Cleaning build directory '/home/bamboo/xml-data/build-dir/PHPBB3-PR-JOB1'
07-Sep-2019 11:26:39 Checking out into /home/bamboo/xml-data/build-dir/PHPBB3-PR-JOB1
07-Sep-2019 11:26:39 Updating source code to revision: dc8ff9da28b8ab4ad11c7ea94cca526f17c87fe5
07-Sep-2019 11:26:39 Fetching 'refs/heads/3.1.x' from 'https://github.com/phpbb/phpbb.git'.
07-Sep-2019 11:26:40 Checking out revision dc8ff9da28b8ab4ad11c7ea94cca526f17c87fe5.
07-Sep-2019 11:26:40 Creating local git repository in '/home/bamboo/xml-data/build-dir/PHPBB3-PR-JOB1/.git'.
07-Sep-2019 11:26:40 Cloning into '/home/bamboo/xml-data/build-dir/PHPBB3-PR-JOB1'...
07-Sep-2019 11:26:40 done.
07-Sep-2019 11:26:42 Switched to a new branch '3.1.x'
07-Sep-2019 11:26:42 Branch 3.1.x set up to track remote branch 3.1.x from origin.
07-Sep-2019 11:26:42 Updated source code to revision: dc8ff9da28b8ab4ad11c7ea94cca526f17c87fe5
07-Sep-2019 11:26:42 Finished task 'Checkout develop branch' with result: Success
07-Sep-2019 11:26:42 Running pre-build action: VCS Version Collector
07-Sep-2019 11:26:42
Substituting variable: ${bamboo.PRnumber} with 5679
07-Sep-2019 11:26:42
Substituting variable: ${bamboo.buildResultsUrl} with https://bamboo.phpbb.com/browse/PHPBB3-PR-JOB1-9560
07-Sep-2019 11:26:42 Starting task 'Set pending build status' of type 'com.atlassian.bamboo.plugins.scripttask:task.builder.script'
07-Sep-2019 11:26:42
Beginning to execute external process for build 'phpBB3 - Pull Requests - Build and Test Job #9560 (PHPBB3-PR-JOB1-9560)'
... running command line:
/bin/sh /home/bamboo/temp/PHPBB3-PR-JOB1-9560-ScriptBuildTask-3853097279309303132.sh
... in: /home/bamboo/xml-data/build-dir/PHPBB3-PR-JOB1
... using extra environment variables:
bamboo_planRepository_1_branch=3.1.x
bamboo_planRepository_1_branchDisplayName=3.1.x
bamboo_repository_revision_number=dc8ff9da28b8ab4ad11c7ea94cca526f17c87fe5
bamboo_PRref=3.2.x
bamboo_resultsUrl=https://bamboo.phpbb.com/browse/PHPBB3-PR-JOB1-9560
bamboo_capability_system_builder_command_Git=/usr/bin/git
bamboo_repository_75956235_git_username=bantu
bamboo_build_working_directory=/home/bamboo/xml-data/build-dir/PHPBB3-PR-JOB1
bamboo_planRepository_1_name=phpBB Ascraeus
bamboo_buildKey=PHPBB3-PR-JOB1
bamboo_capability_phpbb_tests=true
bamboo_shortPlanName=Pull Requests
bamboo_capability_system_builder_command_fop=/usr/bin/fop
bamboo_capability_dbms_sqlite_2=true
bamboo_planRepository_name=phpBB Ascraeus
bamboo_PRnumber=5679
bamboo_buildNumber=9560
bamboo_repository_75956235_git_repositoryUrl=https://github.com/phpbb/phpbb.git
bamboo_capability_system_builder_phpunit_PHPUnit=/usr/bin/phpunit
bamboo_shortJobName=Build and Test Job
bamboo_buildResultsUrl=https://bamboo.phpbb.com/browse/PHPBB3-PR-JOB1-9560
bamboo_repository_75956235_branch_name=3.1.x
bamboo_planRepository_repositoryUrl=https://github.com/phpbb/phpbb.git
bamboo_agentId=131073
bamboo_planName=phpBB3 - Pull Requests
bamboo_shortPlanKey=PR
bamboo_shortJobKey=JOB1
bamboo_capability_dbms_mysql_55=true
bamboo_capability_system_jdk_JDK_1_7_0_65=/usr/lib/jvm/java-7-openjdk-amd64
bamboo_planRepository_revision=dc8ff9da28b8ab4ad11c7ea94cca526f17c87fe5
bamboo_buildTimeStamp=2019-09-07T11:26:39.721Z
bamboo_repository_previous_revision_number=dc8ff9da28b8ab4ad11c7ea94cca526f17c87fe5
bamboo_capability_system_jdk_JDK_1_6_0_16=/usr/lib/jvm/java-6-sun-1.6.0.16
bamboo_capability_system_builder_mvn2_Maven_2=/usr/share/maven2
bamboo_planRepository_previousRevision=dc8ff9da28b8ab4ad11c7ea94cca526f17c87fe5
bamboo_repository_git_branch=3.1.x
bamboo_buildResultKey=PHPBB3-PR-JOB1-9560
bamboo_repository_branch_name=3.1.x
bamboo_buildPlanName=phpBB3 - Pull Requests - Build and Test Job
bamboo_planRepository_1_revision=dc8ff9da28b8ab4ad11c7ea94cca526f17c87fe5
bamboo_repository_name=phpBB Ascraeus
bamboo_buildFailed=false
bamboo_capability_system_docker_executable=/usr/bin/docker
bamboo_planRepository_branch=3.1.x
bamboo_agentWorkingDirectory=/home/bamboo/xml-data/build-dir
bamboo_capability_system_git_executable=/usr/bin/git
bamboo_capability_system_builder_phpunit_PHPUnit_3_4=/usr/bin/phpunit
bamboo_repository_git_username=bantu
bamboo_planRepository_1_previousRevision=dc8ff9da28b8ab4ad11c7ea94cca526f17c87fe5
bamboo_repository_75956235_revision_number=dc8ff9da28b8ab4ad11c7ea94cca526f17c87fe5
bamboo_planRepository_branchDisplayName=3.1.x
bamboo_planRepository_1_type=gitv2
bamboo_planRepository_branchName=3.1.x
bamboo_repository_75956235_previous_revision_number=dc8ff9da28b8ab4ad11c7ea94cca526f17c87fe5
bamboo_capability_system_jdk_JDK=/usr/lib/jvm/java-6-sun
bamboo_plan_storageTag=PHPBB3-PR
bamboo_hg_cache_directory=/home/bamboo/xml-data/build-dir/_hg-repositories-cache
bamboo_planRepository_1_username=bantu
bamboo_planRepository_type=gitv2
bamboo_git_cache_directory=/home/bamboo/xml-data/build-dir/_git-repositories-cache
bamboo_ManualBuildTriggerReason_userName=Build Robot
bamboo_repository_git_repositoryUrl=https://github.com/phpbb/phpbb.git
bamboo_repository_75956235_git_branch=3.1.x
bamboo_capability_system_builder_ant_Ant=/usr/share/ant
bamboo_repository_75956235_name=phpBB Ascraeus
bamboo_tmp_directory=/home/bamboo/temp
bamboo_working_directory=/home/bamboo/xml-data/build-dir/PHPBB3-PR-JOB1
bamboo_planKey=PHPBB3-PR
bamboo_capability_local=true
bamboo_planRepository_1_repositoryUrl=https://github.com/phpbb/phpbb.git
bamboo_planRepository_username=bantu
bamboo_capability_system_jdk_JDK_1_6=/usr/lib/jvm/java-6-sun
bamboo_capability_system_jdk_JDK_1_7=/usr/lib/jvm/java-7-openjdk-amd64
bamboo_planRepository_1_branchName=3.1.x
07-Sep-2019 11:26:43 From https://github.com/phpbb/phpbb
07-Sep-2019 11:26:43 * branch            refs/pull/5679/head -> FETCH_HEAD
07-Sep-2019 11:26:43   % Total    % Received % Xferd  Average Speed   Time    Time     Time  Current
07-Sep-2019 11:26:43                                  Dload  Upload   Total   Spent    Left  Speed
07-Sep-2019 11:26:43
07-Sep-2019 11:26:44   0     0    0     0    0     0      0      0 --:--:-- --:--:-- --:--:--     0
07-Sep-2019 11:26:44 100   275  100    93  100   182    165    324 --:--:-- --:--:-- --:--:--   323
07-Sep-2019 11:26:44 100   275  100    93  100   182    165    323 --:--:-- --:--:-- --:--:--   323
07-Sep-2019 11:26:44 Finished task 'Set pending build status' with result: Success
07-Sep-2019 11:26:44
Substituting variable: ${bamboo.PRnumber} with 5679
07-Sep-2019 11:26:44 Starting task 'Fetch PR' of type 'com.atlassian.bamboo.plugins.scripttask:task.builder.script'
07-Sep-2019 11:26:44
Beginning to execute external process for build 'phpBB3 - Pull Requests - Build and Test Job #9560 (PHPBB3-PR-JOB1-9560)'
... running command line:
/bin/sh /home/bamboo/temp/PHPBB3-PR-JOB1-9560-ScriptBuildTask-1150321321237758447.sh
... in: /home/bamboo/xml-data/build-dir/PHPBB3-PR-JOB1
... using extra environment variables:
bamboo_planRepository_1_branch=3.1.x
bamboo_planRepository_1_branchDisplayName=3.1.x
bamboo_repository_revision_number=dc8ff9da28b8ab4ad11c7ea94cca526f17c87fe5
bamboo_PRref=3.2.x
bamboo_resultsUrl=https://bamboo.phpbb.com/browse/PHPBB3-PR-JOB1-9560
bamboo_capability_system_builder_command_Git=/usr/bin/git
bamboo_repository_75956235_git_username=bantu
bamboo_build_working_directory=/home/bamboo/xml-data/build-dir/PHPBB3-PR-JOB1
bamboo_planRepository_1_name=phpBB Ascraeus
bamboo_buildKey=PHPBB3-PR-JOB1
bamboo_capability_phpbb_tests=true
bamboo_shortPlanName=Pull Requests
bamboo_capability_system_builder_command_fop=/usr/bin/fop
bamboo_capability_dbms_sqlite_2=true
bamboo_planRepository_name=phpBB Ascraeus
bamboo_PRnumber=5679
bamboo_buildNumber=9560
bamboo_repository_75956235_git_repositoryUrl=https://github.com/phpbb/phpbb.git
bamboo_capability_system_builder_phpunit_PHPUnit=/usr/bin/phpunit
bamboo_shortJobName=Build and Test Job
bamboo_buildResultsUrl=https://bamboo.phpbb.com/browse/PHPBB3-PR-JOB1-9560
bamboo_repository_75956235_branch_name=3.1.x
bamboo_planRepository_repositoryUrl=https://github.com/phpbb/phpbb.git
bamboo_agentId=131073
bamboo_planName=phpBB3 - Pull Requests
bamboo_build_commandline_com_atlassian_bamboo_plugins_scripttask_task_builder_script_7=/bin/sh /home/bamboo/temp/PHPBB3-PR-JOB1-9560-ScriptBuildTask-3853097279309303132.sh
bamboo_shortPlanKey=PR
bamboo_shortJobKey=JOB1
bamboo_capability_dbms_mysql_55=true
bamboo_capability_system_jdk_JDK_1_7_0_65=/usr/lib/jvm/java-7-openjdk-amd64
bamboo_planRepository_revision=dc8ff9da28b8ab4ad11c7ea94cca526f17c87fe5
bamboo_buildTimeStamp=2019-09-07T11:26:39.721Z
bamboo_repository_previous_revision_number=dc8ff9da28b8ab4ad11c7ea94cca526f17c87fe5
bamboo_capability_system_jdk_JDK_1_6_0_16=/usr/lib/jvm/java-6-sun-1.6.0.16
bamboo_capability_system_builder_mvn2_Maven_2=/usr/share/maven2
bamboo_planRepository_previousRevision=dc8ff9da28b8ab4ad11c7ea94cca526f17c87fe5
bamboo_repository_git_branch=3.1.x
bamboo_buildResultKey=PHPBB3-PR-JOB1-9560
bamboo_repository_branch_name=3.1.x
bamboo_buildPlanName=phpBB3 - Pull Requests - Build and Test Job
bamboo_planRepository_1_revision=dc8ff9da28b8ab4ad11c7ea94cca526f17c87fe5
bamboo_repository_name=phpBB Ascraeus
bamboo_buildFailed=false
bamboo_capability_system_docker_executable=/usr/bin/docker
bamboo_planRepository_branch=3.1.x
bamboo_agentWorkingDirectory=/home/bamboo/xml-data/build-dir
bamboo_capability_system_git_executable=/usr/bin/git
bamboo_capability_system_builder_phpunit_PHPUnit_3_4=/usr/bin/phpunit
bamboo_repository_git_username=bantu
bamboo_planRepository_1_previousRevision=dc8ff9da28b8ab4ad11c7ea94cca526f17c87fe5
bamboo_repository_75956235_revision_number=dc8ff9da28b8ab4ad11c7ea94cca526f17c87fe5
bamboo_planRepository_branchDisplayName=3.1.x
bamboo_planRepository_1_type=gitv2
bamboo_planRepository_branchName=3.1.x
bamboo_repository_75956235_previous_revision_number=dc8ff9da28b8ab4ad11c7ea94cca526f17c87fe5
bamboo_capability_system_jdk_JDK=/usr/lib/jvm/java-6-sun
bamboo_plan_storageTag=PHPBB3-PR
bamboo_hg_cache_directory=/home/bamboo/xml-data/build-dir/_hg-repositories-cache
bamboo_planRepository_1_username=bantu
bamboo_planRepository_type=gitv2
bamboo_git_cache_directory=/home/bamboo/xml-data/build-dir/_git-repositories-cache
bamboo_ManualBuildTriggerReason_userName=Build Robot
bamboo_repository_git_repositoryUrl=https://github.com/phpbb/phpbb.git
bamboo_repository_75956235_git_branch=3.1.x
bamboo_capability_system_builder_ant_Ant=/usr/share/ant
bamboo_repository_75956235_name=phpBB Ascraeus
bamboo_tmp_directory=/home/bamboo/temp
bamboo_working_directory=/home/bamboo/xml-data/build-dir/PHPBB3-PR-JOB1
bamboo_planKey=PHPBB3-PR
bamboo_capability_local=true
bamboo_planRepository_1_repositoryUrl=https://github.com/phpbb/phpbb.git
bamboo_planRepository_username=bantu
bamboo_capability_system_jdk_JDK_1_6=/usr/lib/jvm/java-6-sun
bamboo_capability_system_jdk_JDK_1_7=/usr/lib/jvm/java-7-openjdk-amd64
bamboo_planRepository_1_branchName=3.1.x
07-Sep-2019 11:26:45 From https://github.com/phpbb/phpbb
07-Sep-2019 11:26:45 * branch            refs/pull/5679/merge -> FETCH_HEAD
07-Sep-2019 11:26:45 Note: checking out 'FETCH_HEAD'.
07-Sep-2019 11:26:45
07-Sep-2019 11:26:45 You are in 'detached HEAD' state. You can look around, make experimental
07-Sep-2019 11:26:45 changes and commit them, and you can discard any commits you make in this
07-Sep-2019 11:26:45 state without impacting any branches by performing another checkout.
07-Sep-2019 11:26:45
07-Sep-2019 11:26:45 If you want to create a new branch to retain commits you create, you may
07-Sep-2019 11:26:45 do so (now or later) by using -b with the checkout command again. Example:
07-Sep-2019 11:26:45
07-Sep-2019 11:26:45   git checkout -b new_branch_name
07-Sep-2019 11:26:45
07-Sep-2019 11:26:45 HEAD is now at ea7a328... Merge f616d9f995a7ec571fb2a8efa0f5e2bea9c66a4d into 4db585a4cb2e5359074a82ef088574609155294b
07-Sep-2019 11:26:45 Finished task 'Fetch PR' with result: Success
07-Sep-2019 11:26:45 Skipping execution of task 'Prepare directory' as it is disabled
07-Sep-2019 11:26:45
Substituting variable: ${bamboo.working.directory} with /home/bamboo/xml-data/build-dir/PHPBB3-PR-JOB1
07-Sep-2019 11:26:45 Starting task 'Build image' of type 'com.atlassian.bamboo.plugins.bamboo-docker-plugin:task.docker.cli'
07-Sep-2019 11:26:45
Beginning to execute external process for build 'phpBB3 - Pull Requests - Build and Test Job #9560 (PHPBB3-PR-JOB1-9560)'
... running command line:
/usr/bin/docker build --force-rm=true --tag=phpbb:php-7.1 /home/bamboo/xml-data/build-dir/PHPBB3-PR-JOB1
... in: /home/bamboo/xml-data/build-dir/PHPBB3-PR-JOB1
... using extra environment variables:
bamboo_planRepository_1_branch=3.1.x
bamboo_planRepository_1_branchDisplayName=3.1.x
bamboo_repository_revision_number=dc8ff9da28b8ab4ad11c7ea94cca526f17c87fe5
bamboo_PRref=3.2.x
bamboo_resultsUrl=https://bamboo.phpbb.com/browse/PHPBB3-PR-JOB1-9560
bamboo_capability_system_builder_command_Git=/usr/bin/git
bamboo_repository_75956235_git_username=bantu
bamboo_build_working_directory=/home/bamboo/xml-data/build-dir/PHPBB3-PR-JOB1
bamboo_planRepository_1_name=phpBB Ascraeus
bamboo_buildKey=PHPBB3-PR-JOB1
bamboo_capability_phpbb_tests=true
bamboo_shortPlanName=Pull Requests
bamboo_capability_system_builder_command_fop=/usr/bin/fop
bamboo_capability_dbms_sqlite_2=true
bamboo_planRepository_name=phpBB Ascraeus
bamboo_PRnumber=5679
bamboo_buildNumber=9560
bamboo_repository_75956235_git_repositoryUrl=https://github.com/phpbb/phpbb.git
bamboo_capability_system_builder_phpunit_PHPUnit=/usr/bin/phpunit
bamboo_shortJobName=Build and Test Job
bamboo_buildResultsUrl=https://bamboo.phpbb.com/browse/PHPBB3-PR-JOB1-9560
bamboo_repository_75956235_branch_name=3.1.x
bamboo_planRepository_repositoryUrl=https://github.com/phpbb/phpbb.git
bamboo_agentId=131073
bamboo_planName=phpBB3 - Pull Requests
bamboo_build_commandline_com_atlassian_bamboo_plugins_scripttask_task_builder_script_7=/bin/sh /home/bamboo/temp/PHPBB3-PR-JOB1-9560-ScriptBuildTask-3853097279309303132.sh
bamboo_shortPlanKey=PR
bamboo_shortJobKey=JOB1
bamboo_capability_dbms_mysql_55=true
bamboo_capability_system_jdk_JDK_1_7_0_65=/usr/lib/jvm/java-7-openjdk-amd64
bamboo_planRepository_revision=dc8ff9da28b8ab4ad11c7ea94cca526f17c87fe5
bamboo_buildTimeStamp=2019-09-07T11:26:39.721Z
bamboo_repository_previous_revision_number=dc8ff9da28b8ab4ad11c7ea94cca526f17c87fe5
bamboo_capability_system_jdk_JDK_1_6_0_16=/usr/lib/jvm/java-6-sun-1.6.0.16
bamboo_capability_system_builder_mvn2_Maven_2=/usr/share/maven2
bamboo_planRepository_previousRevision=dc8ff9da28b8ab4ad11c7ea94cca526f17c87fe5
bamboo_build_commandline_com_atlassian_bamboo_plugins_scripttask_task_builder_script_4=/bin/sh /home/bamboo/temp/PHPBB3-PR-JOB1-9560-ScriptBuildTask-1150321321237758447.sh
bamboo_repository_git_branch=3.1.x
bamboo_buildResultKey=PHPBB3-PR-JOB1-9560
bamboo_repository_branch_name=3.1.x
bamboo_buildPlanName=phpBB3 - Pull Requests - Build and Test Job
bamboo_planRepository_1_revision=dc8ff9da28b8ab4ad11c7ea94cca526f17c87fe5
bamboo_repository_name=phpBB Ascraeus
bamboo_buildFailed=false
bamboo_capability_system_docker_executable=/usr/bin/docker
bamboo_planRepository_branch=3.1.x
bamboo_agentWorkingDirectory=/home/bamboo/xml-data/build-dir
bamboo_capability_system_git_executable=/usr/bin/git
bamboo_capability_system_builder_phpunit_PHPUnit_3_4=/usr/bin/phpunit
bamboo_repository_git_username=bantu
bamboo_planRepository_1_previousRevision=dc8ff9da28b8ab4ad11c7ea94cca526f17c87fe5
bamboo_repository_75956235_revision_number=dc8ff9da28b8ab4ad11c7ea94cca526f17c87fe5
bamboo_planRepository_branchDisplayName=3.1.x
bamboo_planRepository_1_type=gitv2
bamboo_planRepository_branchName=3.1.x
bamboo_repository_75956235_previous_revision_number=dc8ff9da28b8ab4ad11c7ea94cca526f17c87fe5
bamboo_capability_system_jdk_JDK=/usr/lib/jvm/java-6-sun
bamboo_plan_storageTag=PHPBB3-PR
bamboo_hg_cache_directory=/home/bamboo/xml-data/build-dir/_hg-repositories-cache
bamboo_planRepository_1_username=bantu
bamboo_planRepository_type=gitv2
bamboo_git_cache_directory=/home/bamboo/xml-data/build-dir/_git-repositories-cache
bamboo_ManualBuildTriggerReason_userName=Build Robot
bamboo_repository_git_repositoryUrl=https://github.com/phpbb/phpbb.git
bamboo_repository_75956235_git_branch=3.1.x
bamboo_capability_system_builder_ant_Ant=/usr/share/ant
bamboo_repository_75956235_name=phpBB Ascraeus
bamboo_tmp_directory=/home/bamboo/temp
bamboo_working_directory=/home/bamboo/xml-data/build-dir/PHPBB3-PR-JOB1
bamboo_planKey=PHPBB3-PR
bamboo_capability_local=true
bamboo_planRepository_1_repositoryUrl=https://github.com/phpbb/phpbb.git
bamboo_planRepository_username=bantu
bamboo_capability_system_jdk_JDK_1_6=/usr/lib/jvm/java-6-sun
bamboo_capability_system_jdk_JDK_1_7=/usr/lib/jvm/java-7-openjdk-amd64
bamboo_planRepository_1_branchName=3.1.x
07-Sep-2019 11:26:46 Sending build context to Docker daemon  20.14MB
07-Sep-2019 11:26:46
07-Sep-2019 11:26:46 Step 1/5 : FROM php:7.1
07-Sep-2019 11:26:46 ---> 6b94137690a5
07-Sep-2019 11:26:46 Step 2/5 : RUN apt-get update && apt-get install -y         git         zlib1g-dev         bzip2         zip         && docker-php-ext-install -j$(nproc) zip
07-Sep-2019 11:26:46 ---> Using cache
07-Sep-2019 11:26:46 ---> f6a0a124b579
07-Sep-2019 11:26:46 Step 3/5 : RUN pecl install xdebug-2.6.1
07-Sep-2019 11:26:46 ---> Using cache
07-Sep-2019 11:26:46 ---> 15c4b93552b7
07-Sep-2019 11:26:46 Step 4/5 : RUN docker-php-ext-enable xdebug
07-Sep-2019 11:26:46 ---> Using cache
07-Sep-2019 11:26:46 ---> ef1b69ae4ef0
07-Sep-2019 11:26:46 Step 5/5 : RUN echo "memory_limit = 1536M" >> /usr/local/etc/php/conf.d/memory.ini
07-Sep-2019 11:26:46 ---> Using cache
07-Sep-2019 11:26:46 ---> b85b0bd595b2
07-Sep-2019 11:26:46 Successfully built b85b0bd595b2
07-Sep-2019 11:26:46 Successfully tagged phpbb:php-7.1
07-Sep-2019 11:26:46 Built Docker image 'phpbb:php-7.1'
07-Sep-2019 11:26:46 Finished task 'Build image' with result: Success
07-Sep-2019 11:26:46
Substituting variable: ${bamboo.working.directory} with /home/bamboo/xml-data/build-dir/PHPBB3-PR-JOB1
07-Sep-2019 11:26:46 Starting task 'Prepare directory' of type 'com.atlassian.bamboo.plugins.bamboo-docker-plugin:task.docker.cli'
07-Sep-2019 11:26:46 Running image name (phpbb:php-7.1)
07-Sep-2019 11:26:46
Beginning to execute external process for build 'phpBB3 - Pull Requests - Build and Test Job #9560 (PHPBB3-PR-JOB1-9560)'
... running command line:
/usr/bin/docker run --volume /home/bamboo/xml-data/build-dir/PHPBB3-PR-JOB1:/data --workdir /data/phpBB --rm -e HOME=/home/bamboo -u=991 phpbb:php-7.1 /bin/bash -c php ../composer.phar install --dev; cd ../build; ../phpBB/vendor/bin/phing clean prepare
... in: /home/bamboo/xml-data/build-dir/PHPBB3-PR-JOB1
... using extra environment variables:
bamboo_planRepository_1_branch=3.1.x
bamboo_planRepository_1_branchDisplayName=3.1.x
bamboo_repository_revision_number=dc8ff9da28b8ab4ad11c7ea94cca526f17c87fe5
bamboo_PRref=3.2.x
bamboo_resultsUrl=https://bamboo.phpbb.com/browse/PHPBB3-PR-JOB1-9560
bamboo_capability_system_builder_command_Git=/usr/bin/git
bamboo_repository_75956235_git_username=bantu
bamboo_build_working_directory=/home/bamboo/xml-data/build-dir/PHPBB3-PR-JOB1
bamboo_planRepository_1_name=phpBB Ascraeus
bamboo_buildKey=PHPBB3-PR-JOB1
bamboo_capability_phpbb_tests=true
bamboo_shortPlanName=Pull Requests
bamboo_capability_system_builder_command_fop=/usr/bin/fop
bamboo_capability_dbms_sqlite_2=true
bamboo_planRepository_name=phpBB Ascraeus
bamboo_PRnumber=5679
bamboo_buildNumber=9560
bamboo_repository_75956235_git_repositoryUrl=https://github.com/phpbb/phpbb.git
bamboo_capability_system_builder_phpunit_PHPUnit=/usr/bin/phpunit
bamboo_shortJobName=Build and Test Job
bamboo_buildResultsUrl=https://bamboo.phpbb.com/browse/PHPBB3-PR-JOB1-9560
bamboo_repository_75956235_branch_name=3.1.x
bamboo_planRepository_repositoryUrl=https://github.com/phpbb/phpbb.git
bamboo_agentId=131073
bamboo_planName=phpBB3 - Pull Requests
bamboo_build_commandline_com_atlassian_bamboo_plugins_scripttask_task_builder_script_7=/bin/sh /home/bamboo/temp/PHPBB3-PR-JOB1-9560-ScriptBuildTask-3853097279309303132.sh
bamboo_shortPlanKey=PR
bamboo_shortJobKey=JOB1
bamboo_capability_dbms_mysql_55=true
bamboo_capability_system_jdk_JDK_1_7_0_65=/usr/lib/jvm/java-7-openjdk-amd64
bamboo_planRepository_revision=dc8ff9da28b8ab4ad11c7ea94cca526f17c87fe5
bamboo_buildTimeStamp=2019-09-07T11:26:39.721Z
bamboo_repository_previous_revision_number=dc8ff9da28b8ab4ad11c7ea94cca526f17c87fe5
bamboo_capability_system_jdk_JDK_1_6_0_16=/usr/lib/jvm/java-6-sun-1.6.0.16
bamboo_capability_system_builder_mvn2_Maven_2=/usr/share/maven2
bamboo_planRepository_previousRevision=dc8ff9da28b8ab4ad11c7ea94cca526f17c87fe5
bamboo_build_commandline_com_atlassian_bamboo_plugins_scripttask_task_builder_script_4=/bin/sh /home/bamboo/temp/PHPBB3-PR-JOB1-9560-ScriptBuildTask-1150321321237758447.sh
bamboo_repository_git_branch=3.1.x
bamboo_buildResultKey=PHPBB3-PR-JOB1-9560
bamboo_repository_branch_name=3.1.x
bamboo_buildPlanName=phpBB3 - Pull Requests - Build and Test Job
bamboo_planRepository_1_revision=dc8ff9da28b8ab4ad11c7ea94cca526f17c87fe5
bamboo_repository_name=phpBB Ascraeus
bamboo_buildFailed=false
bamboo_capability_system_docker_executable=/usr/bin/docker
bamboo_build_commandline_com_atlassian_bamboo_plugins_bamboo_docker_plugin_task_docker_cli_13=/usr/bin/docker build --force-rm=true --tag=phpbb:php-7.1 /home/bamboo/xml-data/build-dir/PHPBB3-PR-JOB1
bamboo_planRepository_branch=3.1.x
bamboo_agentWorkingDirectory=/home/bamboo/xml-data/build-dir
bamboo_capability_system_git_executable=/usr/bin/git
bamboo_capability_system_builder_phpunit_PHPUnit_3_4=/usr/bin/phpunit
bamboo_repository_git_username=bantu
bamboo_planRepository_1_previousRevision=dc8ff9da28b8ab4ad11c7ea94cca526f17c87fe5
bamboo_repository_75956235_revision_number=dc8ff9da28b8ab4ad11c7ea94cca526f17c87fe5
bamboo_planRepository_branchDisplayName=3.1.x
bamboo_planRepository_1_type=gitv2
bamboo_planRepository_branchName=3.1.x
bamboo_repository_75956235_previous_revision_number=dc8ff9da28b8ab4ad11c7ea94cca526f17c87fe5
bamboo_capability_system_jdk_JDK=/usr/lib/jvm/java-6-sun
bamboo_plan_storageTag=PHPBB3-PR
bamboo_hg_cache_directory=/home/bamboo/xml-data/build-dir/_hg-repositories-cache
bamboo_planRepository_1_username=bantu
bamboo_planRepository_type=gitv2
bamboo_git_cache_directory=/home/bamboo/xml-data/build-dir/_git-repositories-cache
bamboo_ManualBuildTriggerReason_userName=Build Robot
bamboo_repository_git_repositoryUrl=https://github.com/phpbb/phpbb.git
bamboo_repository_75956235_git_branch=3.1.x
bamboo_capability_system_builder_ant_Ant=/usr/share/ant
bamboo_repository_75956235_name=phpBB Ascraeus
bamboo_tmp_directory=/home/bamboo/temp
bamboo_working_directory=/home/bamboo/xml-data/build-dir/PHPBB3-PR-JOB1
bamboo_planKey=PHPBB3-PR
bamboo_capability_local=true
bamboo_planRepository_1_repositoryUrl=https://github.com/phpbb/phpbb.git
bamboo_planRepository_username=bantu
bamboo_capability_system_jdk_JDK_1_6=/usr/lib/jvm/java-6-sun
bamboo_capability_system_jdk_JDK_1_7=/usr/lib/jvm/java-7-openjdk-amd64
bamboo_planRepository_1_branchName=3.1.x
07-Sep-2019 11:26:47 Cannot create cache directory /home/bamboo/.composer/cache/repo/https---repo.packagist.org/, or directory is not writable. Proceeding without cache
07-Sep-2019 11:26:47 Cannot create cache directory /home/bamboo/.composer/cache/files/, or directory is not writable. Proceeding without cache
07-Sep-2019 11:26:47 You are using the deprecated option "dev". Dev packages are installed by default now.
07-Sep-2019 11:26:47 Loading composer repositories with package information
07-Sep-2019 11:26:47 Installing dependencies (including require-dev) from lock file
07-Sep-2019 11:26:47 Package operations: 66 installs, 0 updates, 0 removals
07-Sep-2019 11:26:48   - Installing bantu/ini-get-wrapper (v1.0.1): Downloading (connecting...)Downloading (100%)         
07-Sep-2019 11:26:49   - Installing google/recaptcha (1.1.2): Downloading (connecting...)Downloading (100%)         
07-Sep-2019 11:26:49   - Installing react/promise (v2.7.1): Downloading (connecting...)Downloading (0%)           Downloading (5%)Downloading (30%)Downloading (35%)Downloading (70%)Downloading (75%)Downloading (80%)Downloading (100%)
07-Sep-2019 11:26:50   - Installing guzzlehttp/streams (3.0.0): Downloading (connecting...)Downloading (0%)           Downloading (25%)Downloading (35%)Downloading (45%)Downloading (55%)Downloading (70%)Downloading (80%)Downloading (100%)
07-Sep-2019 11:26:51   - Installing guzzlehttp/ringphp (1.1.1): Downloading (connecting...)Downloading (0%)           Downloading (10%)Downloading (25%)Downloading (35%)Downloading (40%)Downloading (50%)Downloading (60%)Downloading (70%)Downloading (80%)Downloading (95%)Downloading (100%)
07-Sep-2019 11:26:52   - Installing lusitanian/oauth (v0.8.11): Downloading (connecting...)Downloading (100%)         
07-Sep-2019 11:26:52   - Installing marc1706/fast-image-size (v1.1.4): Downloading (connecting...)Downloading (0%)           Downloading (45%)Downloading (100%)
07-Sep-2019 11:26:53   - Installing paragonie/random_compat (v2.0.18): Downloading (connecting...)Downloading (0%)           Downloading (25%)Downloading (90%)Downloading (100%)
07-Sep-2019 11:26:54   - Installing patchwork/utf8 (v1.3.1): Downloading (connecting...)Downloading (100%)         
07-Sep-2019 11:26:55   - Installing s9e/text-formatter (1.4.5): Downloading (connecting...)Downloading (100%)         
07-Sep-2019 11:26:55   - Installing symfony/polyfill-ctype (v1.11.0): Downloading (connecting...)Downloading (0%)           Downloading (100%)
07-Sep-2019 11:26:56   - Installing symfony/filesystem (v2.8.50): Downloading (connecting...)Downloading (100%)         
07-Sep-2019 11:26:57   - Installing symfony/config (v2.8.50): Downloading (connecting...)Downloading (100%)         
07-Sep-2019 11:26:58   - Installing ircmaxell/password-compat (v1.0.4): Downloading (connecting...)Downloading (100%)         
07-Sep-2019 11:26:58   - Installing symfony/polyfill-php55 (v1.11.0): Downloading (connecting...)Downloading (100%)         
07-Sep-2019 11:26:59   - Installing symfony/polyfill-php54 (v1.11.0): Downloading (connecting...)Downloading (0%)           Downloading (45%)Downloading (100%)
07-Sep-2019 11:26:59   - Installing symfony/polyfill-mbstring (v1.11.0): Downloading (connecting...)Downloading (0%)           Downloading (30%)Downloading (55%)Downloading (95%)Downloading (100%)
07-Sep-2019 11:27:00   - Installing symfony/http-foundation (v2.8.50): Downloading (connecting...)Downloading (100%)         
07-Sep-2019 11:27:01   - Installing symfony/event-dispatcher (v2.8.50): Downloading (connecting...)Downloading (0%)           Downloading (5%)Downloading (10%)Downloading (80%)Downloading (85%)Downloading (90%)Downloading (95%)Downloading (100%)
07-Sep-2019 11:27:01   - Installing psr/log (1.1.0): Downloading (connecting...)Downloading (0%)           Downloading (65%)Downloading (100%)
07-Sep-2019 11:27:02   - Installing symfony/debug (v2.8.50): Downloading (connecting...)Downloading (100%)         
07-Sep-2019 11:27:03   - Installing symfony/http-kernel (v2.8.51): Downloading (connecting...)Downloading (100%)         
07-Sep-2019 11:27:04   - Installing symfony/dependency-injection (v2.8.50): Downloading (connecting...)Downloading (100%)         
07-Sep-2019 11:27:04   - Installing zendframework/zend-stdlib (2.5.1): Downloading (connecting...)Downloading (100%)         
07-Sep-2019 11:27:05   - Installing zendframework/zend-eventmanager (2.5.1): Downloading (connecting...)Downloading (100%)         
07-Sep-2019 11:27:06   - Installing zendframework/zend-code (2.5.1): Downloading (connecting...)Downloading (100%)         
07-Sep-2019 11:27:06   - Installing ocramius/proxy-manager (1.0.2): Downloading (connecting...)Downloading (100%)         
07-Sep-2019 11:27:07   - Installing symfony/proxy-manager-bridge (v2.8.50): Downloading (connecting...)Downloading (100%)         
07-Sep-2019 11:27:08   - Installing symfony/routing (v2.8.50): Downloading (connecting...)Downloading (100%)         
07-Sep-2019 11:27:09   - Installing twig/twig (v1.42.2): Downloading (connecting...)Downloading (100%)         
07-Sep-2019 11:27:10   - Installing symfony/twig-bridge (v2.8.50): Downloading (connecting...)Downloading (100%)         
07-Sep-2019 11:27:10   - Installing symfony/dom-crawler (v2.8.50): Downloading (connecting...)Downloading (100%)         
07-Sep-2019 11:27:11   - Installing symfony/css-selector (v2.8.50): Downloading (connecting...)Downloading (100%)         
07-Sep-2019 11:27:12   - Installing symfony/browser-kit (v2.8.50): Downloading (connecting...)Downloading (100%)         
07-Sep-2019 11:27:12   - Installing guzzlehttp/guzzle (5.3.3): Downloading (connecting...)Downloading (100%)         
07-Sep-2019 11:27:13   - Installing fabpot/goutte (v2.0.4): Downloading (connecting...)Downloading (100%)         
07-Sep-2019 11:27:14   - Installing facebook/webdriver (1.1.3): Downloading (connecting...)Downloading (100%)         
07-Sep-2019 11:27:15   - Installing symfony/process (v2.8.50): Downloading (connecting...)Downloading (100%)         
07-Sep-2019 11:27:15   - Installing symfony/console (v2.8.50): Downloading (connecting...)Downloading (100%)         
07-Sep-2019 11:27:16   - Installing laravel/homestead (v2.2.2): Downloading (connecting...)Downloading (100%)         
07-Sep-2019 11:27:17   - Installing phing/phing (2.4.14): Downloading (connecting...)Downloading (100%)         
07-Sep-2019 11:27:18   - Installing phpdocumentor/reflection-docblock (2.0.5): Downloading (connecting...)Downloading (100%)         
07-Sep-2019 11:27:19   - Installing symfony/yaml (v2.8.50): Downloading (connecting...)Downloading (0%)           Downloading (15%)Downloading (20%)Downloading (30%)Downloading (55%)Downloading (70%)Downloading (85%)Downloading (90%)Downloading (100%)
07-Sep-2019 11:27:19   - Installing sebastian/version (1.0.6): Downloading (connecting...)Downloading (0%)           Downloading (100%)
07-Sep-2019 11:27:20   - Installing sebastian/global-state (1.1.1): Downloading (connecting...)Downloading (0%)           Downloading (40%)Downloading (85%)Downloading (100%)
07-Sep-2019 11:27:20   - Installing sebastian/recursion-context (1.0.5): Downloading (connecting...)Downloading (0%)           Downloading (35%)Downloading (70%)Downloading (100%)
07-Sep-2019 11:27:21   - Installing sebastian/exporter (1.2.2): Downloading (connecting...)Downloading (0%)           Downloading (95%)Downloading (100%)
07-Sep-2019 11:27:21   - Installing sebastian/environment (1.3.8): Downloading (connecting...)Downloading (0%)           Downloading (15%)Downloading (30%)Downloading (45%)Downloading (60%)Downloading (75%)Downloading (100%)
07-Sep-2019 11:27:22   - Installing sebastian/diff (1.4.3): Downloading (connecting...)Downloading (0%)           Downloading (35%)Downloading (40%)Downloading (75%)Downloading (100%)
07-Sep-2019 11:27:23   - Installing sebastian/comparator (1.2.4): Downloading (connecting...)Downloading (0%)           Downloading (10%)Downloading (55%)Downloading (65%)Downloading (70%)Downloading (100%)
07-Sep-2019 11:27:23   - Installing phpunit/php-text-template (1.2.1): Downloading (connecting...)Downloading (0%)           Downloading (35%)Downloading (100%)
07-Sep-2019 11:27:24   - Installing doctrine/instantiator (1.0.5): Downloading (connecting...)Downloading (0%)           Downloading (15%)Downloading (30%)Downloading (45%)Downloading (60%)Downloading (75%)Downloading (90%)Downloading (100%)
07-Sep-2019 11:27:24   - Installing phpunit/phpunit-mock-objects (2.3.8): Downloading (connecting...)Downloading (0%)           Downloading (5%)Downloading (20%)Downloading (25%)Downloading (30%)Downloading (35%)Downloading (40%)Downloading (55%)Downloading (60%)Downloading (65%)Downloading (75%)Downloading (80%)Downloading (85%)Downloading (90%)Downloading (100%)
07-Sep-2019 11:27:25   - Installing phpunit/php-timer (1.0.9): Downloading (connecting...)Downloading (0%)           Downloading (45%)Downloading (90%)Downloading (100%)
07-Sep-2019 11:27:26   - Installing phpunit/php-file-iterator (1.4.5): Downloading (connecting...)Downloading (0%)           Downloading (100%)
07-Sep-2019 11:27:26   - Installing phpunit/php-token-stream (1.4.12): Downloading (connecting...)Downloading (0%)           Downloading (5%)Downloading (10%)Downloading (15%)Downloading (20%)Downloading (100%)
07-Sep-2019 11:27:27   - Installing phpunit/php-code-coverage (2.2.4): Downloading (connecting...)Downloading (0%)           Downloading (5%)Downloading (10%)Downloading (15%)Downloading (20%)Downloading (25%)Downloading (30%)Downloading (35%)Downloading (40%)Downloading (45%)Downloading (50%)Downloading (55%)Downloading (60%)Downloading (65%)Downloading (70%)Downloading (75%)Downloading (80%)Downloading (85%)Downloading (90%)Downloading (95%)Downloading (100%)
07-Sep-2019 11:27:28   - Installing phpspec/prophecy (1.8.1): Downloading (connecting...)Downloading (0%)           Downloading (10%)Downloading (20%)Downloading (25%)Downloading (30%)Downloading (35%)Downloading (40%)Downloading (45%)Downloading (50%)Downloading (60%)Downloading (70%)Downloading (80%)Downloading (90%)Downloading (95%)Downloading (100%)
07-Sep-2019 11:27:28   - Installing phpunit/phpunit (4.8.36): Downloading (connecting...)Downloading (100%)         
07-Sep-2019 11:27:29   - Installing phpunit/dbunit (1.3.2): Downloading (connecting...)Downloading (100%)         
07-Sep-2019 11:27:30   - Installing symfony/finder (v2.8.50): Downloading (connecting...)Downloading (100%)         
07-Sep-2019 11:27:31   - Installing pimple/pimple (v1.0.2): Downloading (connecting...)Downloading (100%)         
07-Sep-2019 11:27:31   - Installing nikic/php-parser (v0.9.5): Downloading (connecting...)Downloading (100%)         
07-Sep-2019 11:27:32   - Installing michelf/php-markdown (1.8.0): Downloading (connecting...)Downloading (0%)           Downloading (10%)Downloading (35%)Downloading (45%)Downloading (75%)Downloading (85%)Downloading (100%)
07-Sep-2019 11:27:33   - Installing sami/sami (v1.4.1): Downloading (connecting...)Downloading (100%)         
07-Sep-2019 11:27:34   - Installing squizlabs/php_codesniffer (2.9.2): Downloading (connecting...)Downloading (100%)         
07-Sep-2019 11:27:34 lusitanian/oauth suggests installing predis/predis (Allows using the Redis storage backend.)
07-Sep-2019 11:27:34 paragonie/random_compat suggests installing ext-libsodium (Provides a modern crypto API that can be used to generate random bytes.)
07-Sep-2019 11:27:34 patchwork/utf8 suggests installing ext-intl (Use Intl for best performance)
07-Sep-2019 11:27:34 patchwork/utf8 suggests installing ext-wfio (Use WFIO for UTF-8 filesystem access on Windows)
07-Sep-2019 11:27:34 s9e/text-formatter suggests installing ext-intl (Allows international URLs to be accepted by the URL filter)
07-Sep-2019 11:27:34 s9e/text-formatter suggests installing ext-xsl (Enables the XSLT renderer)
07-Sep-2019 11:27:34 symfony/http-kernel suggests installing symfony/class-loader
07-Sep-2019 11:27:34 symfony/http-kernel suggests installing symfony/var-dumper
07-Sep-2019 11:27:34 symfony/dependency-injection suggests installing symfony/expression-language (For using expressions in service container configuration)
07-Sep-2019 11:27:34 zendframework/zend-stdlib suggests installing zendframework/zend-filter (To support naming strategy hydrator usage)
07-Sep-2019 11:27:34 zendframework/zend-stdlib suggests installing zendframework/zend-serializer (Zend\Serializer component)
07-Sep-2019 11:27:34 zendframework/zend-stdlib suggests installing zendframework/zend-servicemanager (To support hydrator plugin manager usage)
07-Sep-2019 11:27:34 zendframework/zend-code suggests installing doctrine/common (Doctrine\Common >=2.1 for annotation features)
07-Sep-2019 11:27:34 ocramius/proxy-manager suggests installing ocramius/generated-hydrator (To have very fast object to array to object conversion for ghost objects)
07-Sep-2019 11:27:34 ocramius/proxy-manager suggests installing zendframework/zend-json (To have the JsonRpc adapter (Remote Object feature))
07-Sep-2019 11:27:34 ocramius/proxy-manager suggests installing zendframework/zend-soap (To have the Soap adapter (Remote Object feature))
07-Sep-2019 11:27:34 ocramius/proxy-manager suggests installing zendframework/zend-xmlrpc (To have the XmlRpc adapter (Remote Object feature))
07-Sep-2019 11:27:34 symfony/routing suggests installing doctrine/annotations (For using the annotation loader)
07-Sep-2019 11:27:34 symfony/routing suggests installing symfony/expression-language (For using expression matching)
07-Sep-2019 11:27:34 symfony/twig-bridge suggests installing symfony/asset (For using the AssetExtension)
07-Sep-2019 11:27:34 symfony/twig-bridge suggests installing symfony/expression-language (For using the ExpressionExtension)
07-Sep-2019 11:27:34 symfony/twig-bridge suggests installing symfony/form (For using the FormExtension)
07-Sep-2019 11:27:34 symfony/twig-bridge suggests installing symfony/security (For using the SecurityExtension)
07-Sep-2019 11:27:34 symfony/twig-bridge suggests installing symfony/stopwatch (For using the StopwatchExtension)
07-Sep-2019 11:27:34 symfony/twig-bridge suggests installing symfony/templating (For using the TwigEngine)
07-Sep-2019 11:27:34 symfony/twig-bridge suggests installing symfony/translation (For using the TranslationExtension)
07-Sep-2019 11:27:34 symfony/twig-bridge suggests installing symfony/var-dumper (For using the DumpExtension)
07-Sep-2019 11:27:34 facebook/webdriver suggests installing phpdocumentor/phpdocumentor (2.*)
07-Sep-2019 11:27:34 symfony/console suggests installing psr/log-implementation (For using the console logger)
07-Sep-2019 11:27:34 phpdocumentor/reflection-docblock suggests installing dflydev/markdown (~1.0)
07-Sep-2019 11:27:34 phpdocumentor/reflection-docblock suggests installing erusev/parsedown (~1.0)
07-Sep-2019 11:27:34 sebastian/global-state suggests installing ext-uopz (*)
07-Sep-2019 11:27:34 phpunit/phpunit-mock-objects suggests installing ext-soap (*)
07-Sep-2019 11:27:34 phpunit/phpunit suggests installing phpunit/php-invoker (~1.1)
07-Sep-2019 11:27:34 Package phpunit/phpunit-mock-objects is abandoned, you should avoid using it. No replacement was suggested.
07-Sep-2019 11:27:34 Package phpunit/dbunit is abandoned, you should avoid using it. No replacement was suggested.
07-Sep-2019 11:27:34 Package sami/sami is abandoned, you should avoid using it. No replacement was suggested.
07-Sep-2019 11:27:34 Generating autoload files
07-Sep-2019 11:27:34
07-Sep-2019 11:27:34 Notice: A non well formed numeric value encountered in /data/phpBB/vendor/phing/phing/classes/phing/Phing.php on line 1305
07-Sep-2019 11:27:34
07-Sep-2019 11:27:34 Call Stack:
07-Sep-2019 11:27:34     0.0003     352256   1. {main}() /data/phpBB/vendor/phing/phing/bin/phing:0
07-Sep-2019 11:27:34     0.0006     359304   2. require_once('/data/phpBB/vendor/phing/phing/bin/phing.php') /data/phpBB/vendor/phing/phing/bin/phing:18
07-Sep-2019 11:27:34     0.0299    3352736   3. Phing::startup() /data/phpBB/vendor/phing/phing/bin/phing.php:33
07-Sep-2019 11:27:34     0.0302    3426768   4. Phing::setIni() /data/phpBB/vendor/phing/phing/classes/phing/Phing.php:1393
07-Sep-2019 11:27:34     0.0303    3427008   5. Phing::convertShorthand() /data/phpBB/vendor/phing/phing/classes/phing/Phing.php:1335
07-Sep-2019 11:27:34
07-Sep-2019 11:27:34 Buildfile: /data/build/build.xml
07-Sep-2019 11:27:34
07-Sep-2019 11:27:34 phpBB > clean:
07-Sep-2019 11:27:34
07-Sep-2019 11:27:34    [delete] Directory /data/build/logs does not exist or is not a directory.
07-Sep-2019 11:27:34    [delete] Directory /data/build/api does not exist or is not a directory.
07-Sep-2019 11:27:34    [delete] Directory /data/build/codebrowser does not exist or is not a directory.
07-Sep-2019 11:27:34    [delete] Directory /data/build/coverage does not exist or is not a directory.
07-Sep-2019 11:27:34    [delete] Directory /data/build/cpd does not exist or is not a directory.
07-Sep-2019 11:27:34    [delete] Directory /data/build/dependencies does not exist or is not a directory.
07-Sep-2019 11:27:34    [delete] Directory /data/build/new_version does not exist or is not a directory.
07-Sep-2019 11:27:34    [delete] Directory /data/build/old_versions does not exist or is not a directory.
07-Sep-2019 11:27:34    [delete] Directory /data/build/save does not exist or is not a directory.
07-Sep-2019 11:27:34
07-Sep-2019 11:27:34 phpBB > prepare:
07-Sep-2019 11:27:34
07-Sep-2019 11:27:34     [mkdir] Created dir: /data/build/logs
07-Sep-2019 11:27:34     [mkdir] Created dir: /data/build/api
07-Sep-2019 11:27:34     [mkdir] Created dir: /data/build/codebrowser
07-Sep-2019 11:27:34     [mkdir] Created dir: /data/build/coverage
07-Sep-2019 11:27:34     [mkdir] Created dir: /data/build/cpd
07-Sep-2019 11:27:34     [mkdir] Created dir: /data/build/dependencies
07-Sep-2019 11:27:34     [mkdir] Created dir: /data/build/new_version
07-Sep-2019 11:27:34     [mkdir] Created dir: /data/build/new_version/files
07-Sep-2019 11:27:34     [mkdir] Created dir: /data/build/new_version/patches
07-Sep-2019 11:27:34     [mkdir] Created dir: /data/build/new_version/release_files
07-Sep-2019 11:27:34     [mkdir] Created dir: /data/build/new_version/update
07-Sep-2019 11:27:34     [mkdir] Created dir: /data/build/old_versions
07-Sep-2019 11:27:34     [mkdir] Created dir: /data/build/save
07-Sep-2019 11:27:34
07-Sep-2019 11:27:34 BUILD FINISHED
07-Sep-2019 11:27:34
07-Sep-2019 11:27:34 Total time: 0.0764 seconds
07-Sep-2019 11:27:34
07-Sep-2019 11:27:35 Finished task 'Prepare directory' with result: Success
07-Sep-2019 11:27:35 Skipping execution of task 'Run sniffs' as it is disabled
07-Sep-2019 11:27:35
Substituting variable: ${bamboo.working.directory} with /home/bamboo/xml-data/build-dir/PHPBB3-PR-JOB1
07-Sep-2019 11:27:35 Starting task 'Run sniffs' of type 'com.atlassian.bamboo.plugins.bamboo-docker-plugin:task.docker.cli'
07-Sep-2019 11:27:35 Running image name (phpbb:php-7.1)
07-Sep-2019 11:27:35
Beginning to execute external process for build 'phpBB3 - Pull Requests - Build and Test Job #9560 (PHPBB3-PR-JOB1-9560)'
... running command line:
/usr/bin/docker run --volume /home/bamboo/xml-data/build-dir/PHPBB3-PR-JOB1:/data --workdir /data/build --rm -u=991 phpbb:php-7.1 ../phpBB/vendor/bin/phing sniff
... in: /home/bamboo/xml-data/build-dir/PHPBB3-PR-JOB1
... using extra environment variables:
bamboo_planRepository_1_branch=3.1.x
bamboo_planRepository_1_branchDisplayName=3.1.x
bamboo_repository_revision_number=dc8ff9da28b8ab4ad11c7ea94cca526f17c87fe5
bamboo_PRref=3.2.x
bamboo_resultsUrl=https://bamboo.phpbb.com/browse/PHPBB3-PR-JOB1-9560
bamboo_capability_system_builder_command_Git=/usr/bin/git
bamboo_repository_75956235_git_username=bantu
bamboo_build_working_directory=/home/bamboo/xml-data/build-dir/PHPBB3-PR-JOB1
bamboo_planRepository_1_name=phpBB Ascraeus
bamboo_buildKey=PHPBB3-PR-JOB1
bamboo_capability_phpbb_tests=true
bamboo_shortPlanName=Pull Requests
bamboo_capability_system_builder_command_fop=/usr/bin/fop
bamboo_capability_dbms_sqlite_2=true
bamboo_planRepository_name=phpBB Ascraeus
bamboo_PRnumber=5679
bamboo_buildNumber=9560
bamboo_repository_75956235_git_repositoryUrl=https://github.com/phpbb/phpbb.git
bamboo_capability_system_builder_phpunit_PHPUnit=/usr/bin/phpunit
bamboo_shortJobName=Build and Test Job
bamboo_buildResultsUrl=https://bamboo.phpbb.com/browse/PHPBB3-PR-JOB1-9560
bamboo_repository_75956235_branch_name=3.1.x
bamboo_planRepository_repositoryUrl=https://github.com/phpbb/phpbb.git
bamboo_agentId=131073
bamboo_planName=phpBB3 - Pull Requests
bamboo_build_commandline_com_atlassian_bamboo_plugins_scripttask_task_builder_script_7=/bin/sh /home/bamboo/temp/PHPBB3-PR-JOB1-9560-ScriptBuildTask-3853097279309303132.sh
bamboo_shortPlanKey=PR
bamboo_shortJobKey=JOB1
bamboo_capability_dbms_mysql_55=true
bamboo_capability_system_jdk_JDK_1_7_0_65=/usr/lib/jvm/java-7-openjdk-amd64
bamboo_planRepository_revision=dc8ff9da28b8ab4ad11c7ea94cca526f17c87fe5
bamboo_buildTimeStamp=2019-09-07T11:26:39.721Z
bamboo_repository_previous_revision_number=dc8ff9da28b8ab4ad11c7ea94cca526f17c87fe5
bamboo_capability_system_jdk_JDK_1_6_0_16=/usr/lib/jvm/java-6-sun-1.6.0.16
bamboo_capability_system_builder_mvn2_Maven_2=/usr/share/maven2
bamboo_planRepository_previousRevision=dc8ff9da28b8ab4ad11c7ea94cca526f17c87fe5
bamboo_build_commandline_com_atlassian_bamboo_plugins_scripttask_task_builder_script_4=/bin/sh /home/bamboo/temp/PHPBB3-PR-JOB1-9560-ScriptBuildTask-1150321321237758447.sh
bamboo_repository_git_branch=3.1.x
bamboo_buildResultKey=PHPBB3-PR-JOB1-9560
bamboo_repository_branch_name=3.1.x
bamboo_buildPlanName=phpBB3 - Pull Requests - Build and Test Job
bamboo_planRepository_1_revision=dc8ff9da28b8ab4ad11c7ea94cca526f17c87fe5
bamboo_repository_name=phpBB Ascraeus
bamboo_buildFailed=false
bamboo_capability_system_docker_executable=/usr/bin/docker
bamboo_build_commandline_com_atlassian_bamboo_plugins_bamboo_docker_plugin_task_docker_cli_12=/usr/bin/docker run --volume /home/bamboo/xml-data/build-dir/PHPBB3-PR-JOB1:/data --workdir /data/phpBB --rm -e HOME=/home/bamboo -u=991 phpbb:php-7.1 /bin/bash -c php ../composer.phar install --dev; cd ../build; ../phpBB/vendor/bin/phing clean prepare
bamboo_build_commandline_com_atlassian_bamboo_plugins_bamboo_docker_plugin_task_docker_cli_13=/usr/bin/docker build --force-rm=true --tag=phpbb:php-7.1 /home/bamboo/xml-data/build-dir/PHPBB3-PR-JOB1
bamboo_planRepository_branch=3.1.x
bamboo_agentWorkingDirectory=/home/bamboo/xml-data/build-dir
bamboo_capability_system_git_executable=/usr/bin/git
bamboo_capability_system_builder_phpunit_PHPUnit_3_4=/usr/bin/phpunit
bamboo_repository_git_username=bantu
bamboo_planRepository_1_previousRevision=dc8ff9da28b8ab4ad11c7ea94cca526f17c87fe5
bamboo_repository_75956235_revision_number=dc8ff9da28b8ab4ad11c7ea94cca526f17c87fe5
bamboo_planRepository_branchDisplayName=3.1.x
bamboo_planRepository_1_type=gitv2
bamboo_planRepository_branchName=3.1.x
bamboo_repository_75956235_previous_revision_number=dc8ff9da28b8ab4ad11c7ea94cca526f17c87fe5
bamboo_capability_system_jdk_JDK=/usr/lib/jvm/java-6-sun
bamboo_plan_storageTag=PHPBB3-PR
bamboo_hg_cache_directory=/home/bamboo/xml-data/build-dir/_hg-repositories-cache
bamboo_planRepository_1_username=bantu
bamboo_planRepository_type=gitv2
bamboo_git_cache_directory=/home/bamboo/xml-data/build-dir/_git-repositories-cache
bamboo_ManualBuildTriggerReason_userName=Build Robot
bamboo_repository_git_repositoryUrl=https://github.com/phpbb/phpbb.git
bamboo_repository_75956235_git_branch=3.1.x
bamboo_capability_system_builder_ant_Ant=/usr/share/ant
bamboo_repository_75956235_name=phpBB Ascraeus
bamboo_tmp_directory=/home/bamboo/temp
bamboo_working_directory=/home/bamboo/xml-data/build-dir/PHPBB3-PR-JOB1
bamboo_planKey=PHPBB3-PR
bamboo_capability_local=true
bamboo_planRepository_1_repositoryUrl=https://github.com/phpbb/phpbb.git
bamboo_planRepository_username=bantu
bamboo_capability_system_jdk_JDK_1_6=/usr/lib/jvm/java-6-sun
bamboo_capability_system_jdk_JDK_1_7=/usr/lib/jvm/java-7-openjdk-amd64
bamboo_planRepository_1_branchName=3.1.x
07-Sep-2019 11:27:35
07-Sep-2019 11:27:35 Notice: A non well formed numeric value encountered in /data/phpBB/vendor/phing/phing/classes/phing/Phing.php on line 1305
07-Sep-2019 11:27:35
07-Sep-2019 11:27:35 Call Stack:
07-Sep-2019 11:27:35     0.0002     351120   1. {main}() /data/phpBB/vendor/phing/phing/bin/phing:0
07-Sep-2019 11:27:35     0.0005     358168   2. require_once('/data/phpBB/vendor/phing/phing/bin/phing.php') /data/phpBB/vendor/phing/phing/bin/phing:18
07-Sep-2019 11:27:35     0.0291    3351600   3. Phing::startup() /data/phpBB/vendor/phing/phing/bin/phing.php:33
07-Sep-2019 11:27:35     0.0294    3425624   4. Phing::setIni() /data/phpBB/vendor/phing/phing/classes/phing/Phing.php:1393
07-Sep-2019 11:27:35     0.0294    3425864   5. Phing::convertShorthand() /data/phpBB/vendor/phing/phing/classes/phing/Phing.php:1335
07-Sep-2019 11:27:35
07-Sep-2019 11:27:35 Buildfile: /data/build/build.xml
07-Sep-2019 11:27:35
07-Sep-2019 11:27:35 phpBB > sniff:
07-Sep-2019 11:27:35
07-Sep-2019 11:27:40 ............................................................  60 / 724 (8%)
07-Sep-2019 11:27:40 ............................................................ 120 / 724 (17%)
07-Sep-2019 11:27:41 ............................................................ 180 / 724 (25%)
07-Sep-2019 11:27:42 ............................................................ 240 / 724 (33%)
07-Sep-2019 11:27:43 ............................................................ 300 / 724 (41%)
07-Sep-2019 11:27:47 ............................................................ 360 / 724 (50%)
07-Sep-2019 11:27:50 ............................................................ 420 / 724 (58%)
07-Sep-2019 11:27:53 ............................................................ 480 / 724 (66%)
07-Sep-2019 11:27:55 ............................................................ 540 / 724 (75%)
07-Sep-2019 11:27:58 ............................................................ 600 / 724 (83%)
07-Sep-2019 11:28:01 ............................................................ 660 / 724 (91%)
07-Sep-2019 11:28:02 ............................................................ 720 / 724 (99%)
07-Sep-2019 11:28:02 ....
07-Sep-2019 11:28:02
07-Sep-2019 11:28:02 Time: 26.9 secs; Memory: 70Mb
07-Sep-2019 11:28:02
07-Sep-2019 11:28:06 ............................................................  60 / 206 (29%)
07-Sep-2019 11:28:16 ............................................................ 120 / 206 (58%)
07-Sep-2019 11:28:24 ............................................................ 180 / 206 (87%)
07-Sep-2019 11:28:27 ..........................
07-Sep-2019 11:28:27
07-Sep-2019 11:28:27 Time: 25.12 secs; Memory: 40Mb
07-Sep-2019 11:28:27
07-Sep-2019 11:28:27
07-Sep-2019 11:28:27
07-Sep-2019 11:28:27 Time: 14ms; Memory: 4Mb
07-Sep-2019 11:28:27
07-Sep-2019 11:28:27
07-Sep-2019 11:28:27 BUILD FINISHED
07-Sep-2019 11:28:27
07-Sep-2019 11:28:27 Total time: 52.2466 seconds
07-Sep-2019 11:28:27
07-Sep-2019 11:28:28 Finished task 'Run sniffs' with result: Success
07-Sep-2019 11:28:28 Skipping execution of task 'Run tests' as it is disabled
07-Sep-2019 11:28:28
Substituting variable: ${bamboo.working.directory} with /home/bamboo/xml-data/build-dir/PHPBB3-PR-JOB1
07-Sep-2019 11:28:28 Starting task 'Run tests' of type 'com.atlassian.bamboo.plugins.bamboo-docker-plugin:task.docker.cli'
07-Sep-2019 11:28:28 Running image name (phpbb:php-7.1)
07-Sep-2019 11:28:28
Beginning to execute external process for build 'phpBB3 - Pull Requests - Build and Test Job #9560 (PHPBB3-PR-JOB1-9560)'
... running command line:
/usr/bin/docker run --volume /home/bamboo/xml-data/build-dir/PHPBB3-PR-JOB1:/data --workdir /data --rm -u=991 -t phpbb:php-7.1 /bin/bash -c phpBB/vendor/bin/phpunit --log-junit build/logs/phpunit.xml
... in: /home/bamboo/xml-data/build-dir/PHPBB3-PR-JOB1
... using extra environment variables:
bamboo_planRepository_1_branch=3.1.x
bamboo_planRepository_1_branchDisplayName=3.1.x
bamboo_repository_revision_number=dc8ff9da28b8ab4ad11c7ea94cca526f17c87fe5
bamboo_PRref=3.2.x
bamboo_resultsUrl=https://bamboo.phpbb.com/browse/PHPBB3-PR-JOB1-9560
bamboo_capability_system_builder_command_Git=/usr/bin/git
bamboo_repository_75956235_git_username=bantu
bamboo_build_working_directory=/home/bamboo/xml-data/build-dir/PHPBB3-PR-JOB1
bamboo_planRepository_1_name=phpBB Ascraeus
bamboo_buildKey=PHPBB3-PR-JOB1
bamboo_capability_phpbb_tests=true
bamboo_shortPlanName=Pull Requests
bamboo_capability_system_builder_command_fop=/usr/bin/fop
bamboo_capability_dbms_sqlite_2=true
bamboo_planRepository_name=phpBB Ascraeus
bamboo_PRnumber=5679
bamboo_buildNumber=9560
bamboo_repository_75956235_git_repositoryUrl=https://github.com/phpbb/phpbb.git
bamboo_capability_system_builder_phpunit_PHPUnit=/usr/bin/phpunit
bamboo_shortJobName=Build and Test Job
bamboo_buildResultsUrl=https://bamboo.phpbb.com/browse/PHPBB3-PR-JOB1-9560
bamboo_repository_75956235_branch_name=3.1.x
bamboo_planRepository_repositoryUrl=https://github.com/phpbb/phpbb.git
bamboo_agentId=131073
bamboo_planName=phpBB3 - Pull Requests
bamboo_build_commandline_com_atlassian_bamboo_plugins_scripttask_task_builder_script_7=/bin/sh /home/bamboo/temp/PHPBB3-PR-JOB1-9560-ScriptBuildTask-3853097279309303132.sh
bamboo_shortPlanKey=PR
bamboo_shortJobKey=JOB1
bamboo_capability_dbms_mysql_55=true
bamboo_capability_system_jdk_JDK_1_7_0_65=/usr/lib/jvm/java-7-openjdk-amd64
bamboo_planRepository_revision=dc8ff9da28b8ab4ad11c7ea94cca526f17c87fe5
bamboo_buildTimeStamp=2019-09-07T11:26:39.721Z
bamboo_repository_previous_revision_number=dc8ff9da28b8ab4ad11c7ea94cca526f17c87fe5
bamboo_capability_system_jdk_JDK_1_6_0_16=/usr/lib/jvm/java-6-sun-1.6.0.16
bamboo_capability_system_builder_mvn2_Maven_2=/usr/share/maven2
bamboo_planRepository_previousRevision=dc8ff9da28b8ab4ad11c7ea94cca526f17c87fe5
bamboo_build_commandline_com_atlassian_bamboo_plugins_scripttask_task_builder_script_4=/bin/sh /home/bamboo/temp/PHPBB3-PR-JOB1-9560-ScriptBuildTask-1150321321237758447.sh
bamboo_repository_git_branch=3.1.x
bamboo_buildResultKey=PHPBB3-PR-JOB1-9560
bamboo_repository_branch_name=3.1.x
bamboo_buildPlanName=phpBB3 - Pull Requests - Build and Test Job
bamboo_planRepository_1_revision=dc8ff9da28b8ab4ad11c7ea94cca526f17c87fe5
bamboo_repository_name=phpBB Ascraeus
bamboo_buildFailed=false
bamboo_capability_system_docker_executable=/usr/bin/docker
bamboo_build_commandline_com_atlassian_bamboo_plugins_bamboo_docker_plugin_task_docker_cli_11=/usr/bin/docker run --volume /home/bamboo/xml-data/build-dir/PHPBB3-PR-JOB1:/data --workdir /data/build --rm -u=991 phpbb:php-7.1 ../phpBB/vendor/bin/phing sniff
bamboo_build_commandline_com_atlassian_bamboo_plugins_bamboo_docker_plugin_task_docker_cli_12=/usr/bin/docker run --volume /home/bamboo/xml-data/build-dir/PHPBB3-PR-JOB1:/data --workdir /data/phpBB --rm -e HOME=/home/bamboo -u=991 phpbb:php-7.1 /bin/bash -c php ../composer.phar install --dev; cd ../build; ../phpBB/vendor/bin/phing clean prepare
bamboo_build_commandline_com_atlassian_bamboo_plugins_bamboo_docker_plugin_task_docker_cli_13=/usr/bin/docker build --force-rm=true --tag=phpbb:php-7.1 /home/bamboo/xml-data/build-dir/PHPBB3-PR-JOB1
bamboo_planRepository_branch=3.1.x
bamboo_agentWorkingDirectory=/home/bamboo/xml-data/build-dir
bamboo_capability_system_git_executable=/usr/bin/git
bamboo_capability_system_builder_phpunit_PHPUnit_3_4=/usr/bin/phpunit
bamboo_repository_git_username=bantu
bamboo_planRepository_1_previousRevision=dc8ff9da28b8ab4ad11c7ea94cca526f17c87fe5
bamboo_repository_75956235_revision_number=dc8ff9da28b8ab4ad11c7ea94cca526f17c87fe5
bamboo_planRepository_branchDisplayName=3.1.x
bamboo_planRepository_1_type=gitv2
bamboo_planRepository_branchName=3.1.x
bamboo_repository_75956235_previous_revision_number=dc8ff9da28b8ab4ad11c7ea94cca526f17c87fe5
bamboo_capability_system_jdk_JDK=/usr/lib/jvm/java-6-sun
bamboo_plan_storageTag=PHPBB3-PR
bamboo_hg_cache_directory=/home/bamboo/xml-data/build-dir/_hg-repositories-cache
bamboo_planRepository_1_username=bantu
bamboo_planRepository_type=gitv2
bamboo_git_cache_directory=/home/bamboo/xml-data/build-dir/_git-repositories-cache
bamboo_ManualBuildTriggerReason_userName=Build Robot
bamboo_repository_git_repositoryUrl=https://github.com/phpbb/phpbb.git
bamboo_repository_75956235_git_branch=3.1.x
bamboo_capability_system_builder_ant_Ant=/usr/share/ant
bamboo_repository_75956235_name=phpBB Ascraeus
bamboo_tmp_directory=/home/bamboo/temp
bamboo_working_directory=/home/bamboo/xml-data/build-dir/PHPBB3-PR-JOB1
bamboo_planKey=PHPBB3-PR
bamboo_capability_local=true
bamboo_planRepository_1_repositoryUrl=https://github.com/phpbb/phpbb.git
bamboo_planRepository_username=bantu
bamboo_capability_system_jdk_JDK_1_6=/usr/lib/jvm/java-6-sun
bamboo_capability_system_jdk_JDK_1_7=/usr/lib/jvm/java-7-openjdk-amd64
bamboo_planRepository_1_branchName=3.1.x
07-Sep-2019 11:28:30 PHPUnit 4.8.36 by Sebastian Bergmann and contributors.
07-Sep-2019 11:28:30
07-Sep-2019 11:28:38 .............................................................   61 / 7056 (  0%)
07-Sep-2019 11:28:41 .............................................................  122 / 7056 (  1%)
07-Sep-2019 11:28:43 .............I.....SSSSSSSS............SSSS.........S...S....  183 / 7056 (  2%)
07-Sep-2019 11:28:47 .............................................................  244 / 7056 (  3%)
07-Sep-2019 11:28:57 .....S.......................................................  305 / 7056 (  4%)
07-Sep-2019 11:28:59 .............................................................  366 / 7056 (  5%)
07-Sep-2019 11:29:01 .............................................................  427 / 7056 (  6%)
07-Sep-2019 11:29:04 .............................................................  488 / 7056 (  6%)
07-Sep-2019 11:29:06 .............................................................  549 / 7056 (  7%)
07-Sep-2019 11:29:08 .............................................................  610 / 7056 (  8%)
07-Sep-2019 11:29:11 .............................................................  671 / 7056 (  9%)
07-Sep-2019 11:29:13 .............................................................  732 / 7056 ( 10%)
07-Sep-2019 11:29:15 .............................................................  793 / 7056 ( 11%)
07-Sep-2019 11:29:18 .............................................................  854 / 7056 ( 12%)
07-Sep-2019 11:29:20 .............................................................  915 / 7056 ( 12%)
07-Sep-2019 11:29:22 .............................................................  976 / 7056 ( 13%)
07-Sep-2019 11:29:25 ............................................................. 1037 / 7056 ( 14%)
07-Sep-2019 11:29:31 ................................................I............ 1098 / 7056 ( 15%)
07-Sep-2019 11:29:39 ............................................................. 1159 / 7056 ( 16%)
07-Sep-2019 11:29:46 ............................................................. 1220 / 7056 ( 17%)
07-Sep-2019 11:29:51 .....................................S.S.S................... 1281 / 7056 ( 18%)
07-Sep-2019 11:29:53 ............................................................. 1342 / 7056 ( 19%)
07-Sep-2019 11:29:55 ............................................................. 1403 / 7056 ( 19%)
07-Sep-2019 11:29:58 ............................................................. 1464 / 7056 ( 20%)
07-Sep-2019 11:30:00 ............................................................. 1525 / 7056 ( 21%)
07-Sep-2019 11:30:02 ............................................................. 1586 / 7056 ( 22%)
07-Sep-2019 11:30:04 ............................................................. 1647 / 7056 ( 23%)
07-Sep-2019 11:30:07 ............................................................. 1708 / 7056 ( 24%)
07-Sep-2019 11:30:09 ............................................................. 1769 / 7056 ( 25%)
07-Sep-2019 11:30:11 ............................................................. 1830 / 7056 ( 25%)
07-Sep-2019 11:30:13 ............................................................. 1891 / 7056 ( 26%)
07-Sep-2019 11:30:15 ............................................................. 1952 / 7056 ( 27%)
07-Sep-2019 11:30:18 ............................................................. 2013 / 7056 ( 28%)
07-Sep-2019 11:30:20 ............................................................. 2074 / 7056 ( 29%)
07-Sep-2019 11:30:23 ............................................................. 2135 / 7056 ( 30%)
07-Sep-2019 11:30:26 ............................................................. 2196 / 7056 ( 31%)
07-Sep-2019 11:30:29 ............................................................. 2257 / 7056 ( 31%)
07-Sep-2019 11:30:31 ............................................................. 2318 / 7056 ( 32%)
07-Sep-2019 11:30:35 ............................I.II............................. 2379 / 7056 ( 33%)
07-Sep-2019 11:30:39 ............................................................. 2440 / 7056 ( 34%)
07-Sep-2019 11:30:41 ............................................................. 2501 / 7056 ( 35%)
07-Sep-2019 11:30:43 ............................................................. 2562 / 7056 ( 36%)
07-Sep-2019 11:30:48 ............................................................. 2623 / 7056 ( 37%)
07-Sep-2019 11:30:51 ............................................................. 2684 / 7056 ( 38%)
07-Sep-2019 11:30:55 .....FF...................................................... 2745 / 7056 ( 38%)
07-Sep-2019 11:30:57 ............................................................. 2806 / 7056 ( 39%)
07-Sep-2019 11:31:10 ............................................................. 2867 / 7056 ( 40%)
07-Sep-2019 11:31:16 ............................................................. 2928 / 7056 ( 41%)
07-Sep-2019 11:31:22 ......................................................S...... 2989 / 7056 ( 42%)
07-Sep-2019 11:31:28 ............................................................. 3050 / 7056 ( 43%)
07-Sep-2019 11:31:34 ............................................................. 3111 / 7056 ( 44%)
07-Sep-2019 11:31:40 ............................................................. 3172 / 7056 ( 44%)
07-Sep-2019 11:31:53 ............................................................. 3233 / 7056 ( 45%)
07-Sep-2019 11:32:00 ............................................................. 3294 / 7056 ( 46%)
07-Sep-2019 11:32:03 ............................................................. 3355 / 7056 ( 47%)
07-Sep-2019 11:32:06 ............................................................. 3416 / 7056 ( 48%)
07-Sep-2019 11:32:08 ............................................................. 3477 / 7056 ( 49%)
07-Sep-2019 11:32:11 ............................................................. 3538 / 7056 ( 50%)
07-Sep-2019 11:32:13 ............................................................. 3599 / 7056 ( 51%)
07-Sep-2019 11:32:16 ............................................................. 3660 / 7056 ( 51%)
07-Sep-2019 11:32:18 ............................................................. 3721 / 7056 ( 52%)
07-Sep-2019 11:32:21 ............................................................. 3782 / 7056 ( 53%)
07-Sep-2019 11:32:26 ............................................................. 3843 / 7056 ( 54%)
07-Sep-2019 11:32:30 ............................................................. 3904 / 7056 ( 55%)
07-Sep-2019 11:32:35 ............................................................. 3965 / 7056 ( 56%)
07-Sep-2019 11:32:38 ............................................................. 4026 / 7056 ( 57%)
07-Sep-2019 11:32:42 ............................................................. 4087 / 7056 ( 57%)
07-Sep-2019 11:32:49 ............................................................. 4148 / 7056 ( 58%)
07-Sep-2019 11:32:55 ............................................................. 4209 / 7056 ( 59%)
07-Sep-2019 11:32:58 ............................................................. 4270 / 7056 ( 60%)
07-Sep-2019 11:33:02 ............................................................. 4331 / 7056 ( 61%)
07-Sep-2019 11:33:04 ............................................................. 4392 / 7056 ( 62%)
07-Sep-2019 11:33:07 ............................................................. 4453 / 7056 ( 63%)
07-Sep-2019 11:33:10 ............................................................. 4514 / 7056 ( 63%)
07-Sep-2019 11:33:13 ............................................................. 4575 / 7056 ( 64%)
07-Sep-2019 11:33:16 ............................................................. 4636 / 7056 ( 65%)
07-Sep-2019 11:33:18 ............................................................. 4697 / 7056 ( 66%)
07-Sep-2019 11:33:21 ............................................................. 4758 / 7056 ( 67%)
07-Sep-2019 11:33:24 ............................................................. 4819 / 7056 ( 68%)
07-Sep-2019 11:33:36 ...........................................................S. 4880 / 7056 ( 69%)
07-Sep-2019 11:33:46 ............................................................. 4941 / 7056 ( 70%)
07-Sep-2019 11:33:56 ............................................................. 5002 / 7056 ( 70%)
07-Sep-2019 11:34:02 ............................................................. 5063 / 7056 ( 71%)
07-Sep-2019 11:34:05 ............................................................. 5124 / 7056 ( 72%)
07-Sep-2019 11:34:08 ............................................................. 5185 / 7056 ( 73%)
07-Sep-2019 11:34:11 ............................................................. 5246 / 7056 ( 74%)
07-Sep-2019 11:34:12 ...............SSSSSSSSSSSSSSSSSSSSSSSSSSSSSSSSSSSSSSSSSSSSSS 5307 / 7056 ( 75%)
07-Sep-2019 11:34:12 SSSSSSSSSSSSSSSSSSSSSSSSSSSSSSSSSSSSSSSSSSSSSSSSSSSSSSSSSSSSS 5368 / 7056 ( 76%)
07-Sep-2019 11:34:12 SSSSSSSSSSSSSSSSSSSSSSSSSSSSSSSSSSSSSSSSSSSSSSSSSSSSSSSSSSSSS 5429 / 7056 ( 76%)
07-Sep-2019 11:34:12 SSSSSSSSSSSSSSSSSSSSSSSSSSSSSSSSSSSSSSSSSSSSSSSSSSSSSSSSSSSSS 5490 / 7056 ( 77%)
07-Sep-2019 11:34:15 SSSSSSSSSSSSSSSSSSSSSSSSS.................................... 5551 / 7056 ( 78%)
07-Sep-2019 11:34:20 ............................................................. 5612 / 7056 ( 79%)
07-Sep-2019 11:34:25 ............................................................. 5673 / 7056 ( 80%)
07-Sep-2019 11:34:30 ............................................................. 5734 / 7056 ( 81%)
07-Sep-2019 11:34:35 ............................................................. 5795 / 7056 ( 82%)
07-Sep-2019 11:34:40 ............................................................. 5856 / 7056 ( 82%)
07-Sep-2019 11:34:45 ............................................................. 5917 / 7056 ( 83%)
07-Sep-2019 11:34:51 ............................................................. 5978 / 7056 ( 84%)
07-Sep-2019 11:34:56 ............................................................. 6039 / 7056 ( 85%)
07-Sep-2019 11:35:01 ............................................................. 6100 / 7056 ( 86%)
07-Sep-2019 11:35:06 ............................................................. 6161 / 7056 ( 87%)
07-Sep-2019 11:35:11 ............................................................. 6222 / 7056 ( 88%)
07-Sep-2019 11:35:16 ............................................................. 6283 / 7056 ( 89%)
07-Sep-2019 11:35:21 ............................................................. 6344 / 7056 ( 89%)
07-Sep-2019 11:35:26 ............................................................. 6405 / 7056 ( 90%)
07-Sep-2019 11:35:31 ............................................................. 6466 / 7056 ( 91%)
07-Sep-2019 11:35:36 ............................................................. 6527 / 7056 ( 92%)
07-Sep-2019 11:35:41 ............................................................. 6588 / 7056 ( 93%)
07-Sep-2019 11:35:46 ............................................................. 6649 / 7056 ( 94%)
07-Sep-2019 11:35:51 ............................................................. 6710 / 7056 ( 95%)
07-Sep-2019 11:35:56 ............................................................. 6771 / 7056 ( 95%)
07-Sep-2019 11:36:01 ............................................................. 6832 / 7056 ( 96%)
07-Sep-2019 11:36:06 ............................................................. 6893 / 7056 ( 97%)
07-Sep-2019 11:36:11 ............................................................. 6954 / 7056 ( 98%)
07-Sep-2019 11:36:16 ............................................................. 7015 / 7056 ( 99%)
07-Sep-2019 11:36:20 .......................................SS
07-Sep-2019 11:36:20
07-Sep-2019 11:36:20 Time: 7.85 minutes, Memory: 228.00MB
07-Sep-2019 11:36:20
07-Sep-2019 11:36:20 There were 2 failures:
07-Sep-2019 11:36:20
07-Sep-2019 11:36:20 1) phpbb_functions_validate_user_email_test::test_validate_user_email with data set #5 ('banned', array('just because'), 'banned2@example.com')
07-Sep-2019 11:36:20 Failed asserting that two arrays are equal.
07-Sep-2019 11:36:20 --- Expected
07-Sep-2019 11:36:20 +++ Actual
07-Sep-2019 11:36:20 @@ @@
07-Sep-2019 11:36:20 Array (
07-Sep-2019 11:36:20 -    0 => 'just because'
07-Sep-2019 11:36:20 )
07-Sep-2019 11:36:20
07-Sep-2019 11:36:20 /data/tests/functions/validate_data_helper.php:37
07-Sep-2019 11:36:20 /data/tests/functions/validate_user_email_test.php:77
07-Sep-2019 11:36:20
07-Sep-2019 11:36:20 2) phpbb_functions_validate_user_email_test::test_validate_user_email with data set #6 ('banned', array('EMAIL_BANNED'), 'banned@example.com')
07-Sep-2019 11:36:20 Failed asserting that two arrays are equal.
07-Sep-2019 11:36:20 --- Expected
07-Sep-2019 11:36:20 +++ Actual
07-Sep-2019 11:36:20 @@ @@
07-Sep-2019 11:36:20 Array (
07-Sep-2019 11:36:20 -    0 => 'EMAIL_BANNED'
07-Sep-2019 11:36:20 )
07-Sep-2019 11:36:20
07-Sep-2019 11:36:20 /data/tests/functions/validate_data_helper.php:37
07-Sep-2019 11:36:20 /data/tests/functions/validate_user_email_test.php:77
07-Sep-2019 11:36:20
07-Sep-2019 11:36:20 FAILURES!
07-Sep-2019 11:36:20 Tests: 9316, Assertions: 125000, Failures: 2, Skipped: 276, Incomplete: 5.
07-Sep-2019 11:36:20 Error occurred while running Task 'Run tests(10)' of type com.atlassian.bamboo.plugins.bamboo-docker-plugin:task.docker.cli.
07-Sep-2019 11:36:20 com.atlassian.bamboo.task.TaskException: Failed to execute task
07-Sep-2019 11:36:20         at com.atlassian.bamboo.plugins.docker.service.RunService.execute(RunService.java:75)
07-Sep-2019 11:36:20         at com.atlassian.bamboo.plugins.docker.tasks.cli.DockerCliTask.execute(DockerCliTask.java:70)
07-Sep-2019 11:36:20         at com.atlassian.bamboo.task.TaskExecutorImpl.lambda$executeTasks$3(TaskExecutorImpl.java:285)
07-Sep-2019 11:36:20         at com.atlassian.bamboo.task.TaskExecutorImpl.executeTaskWithPrePostActions(TaskExecutorImpl.java:224)
07-Sep-2019 11:36:20         at com.atlassian.bamboo.task.TaskExecutorImpl.executeTasks(TaskExecutorImpl.java:285)
07-Sep-2019 11:36:20         at com.atlassian.bamboo.task.TaskExecutorImpl.execute(TaskExecutorImpl.java:112)
07-Sep-2019 11:36:20         at com.atlassian.bamboo.build.pipeline.tasks.ExecuteBuildTask.call(ExecuteBuildTask.java:71)
07-Sep-2019 11:36:20         at com.atlassian.bamboo.v2.build.agent.DefaultBuildAgent.executeBuildPhase(DefaultBuildAgent.java:203)
07-Sep-2019 11:36:20         at com.atlassian.bamboo.v2.build.agent.DefaultBuildAgent.build(DefaultBuildAgent.java:175)
07-Sep-2019 11:36:20         at com.atlassian.bamboo.v2.build.agent.BuildAgentControllerImpl.lambda$waitAndPerformBuild$0(BuildAgentControllerImpl.java:122)
07-Sep-2019 11:36:20         at com.atlassian.bamboo.variable.CustomVariableContextImpl.withVariableSubstitutor(CustomVariableContextImpl.java:185)
07-Sep-2019 11:36:20         at com.atlassian.bamboo.v2.build.agent.BuildAgentControllerImpl.waitAndPerformBuild(BuildAgentControllerImpl.java:117)
07-Sep-2019 11:36:20         at com.atlassian.bamboo.v2.build.agent.DefaultBuildAgent$1.run(DefaultBuildAgent.java:126)
07-Sep-2019 11:36:20         at com.atlassian.bamboo.utils.BambooRunnables$1.run(BambooRunnables.java:48)
07-Sep-2019 11:36:20         at com.atlassian.bamboo.security.ImpersonationHelper.runWith(ImpersonationHelper.java:26)
07-Sep-2019 11:36:20         at com.atlassian.bamboo.security.ImpersonationHelper.runWithSystemAuthority(ImpersonationHelper.java:17)
07-Sep-2019 11:36:20         at com.atlassian.bamboo.security.ImpersonationHelper$1.run(ImpersonationHelper.java:41)
07-Sep-2019 11:36:20         at java.lang.Thread.run(Thread.java:748)
07-Sep-2019 11:36:20 Caused by: com.atlassian.bamboo.docker.DockerException: Error running Docker run command
07-Sep-2019 11:36:20         at com.atlassian.bamboo.docker.DockerContainerServiceImpl.run(DockerContainerServiceImpl.java:118)
07-Sep-2019 11:36:20         at sun.reflect.GeneratedMethodAccessor2260.invoke(Unknown Source)
07-Sep-2019 11:36:20         at sun.reflect.DelegatingMethodAccessorImpl.invoke(DelegatingMethodAccessorImpl.java:43)
07-Sep-2019 11:36:20         at java.lang.reflect.Method.invoke(Method.java:498)
07-Sep-2019 11:36:20         at com.atlassian.plugin.util.ContextClassLoaderSettingInvocationHandler.invoke(ContextClassLoaderSettingInvocationHandler.java:26)
07-Sep-2019 11:36:20         at com.sun.proxy.$Proxy401.run(Unknown Source)
07-Sep-2019 11:36:20         at sun.reflect.GeneratedMethodAccessor2260.invoke(Unknown Source)
07-Sep-2019 11:36:20         at sun.reflect.DelegatingMethodAccessorImpl.invoke(DelegatingMethodAccessorImpl.java:43)
07-Sep-2019 11:36:20         at java.lang.reflect.Method.invoke(Method.java:498)
07-Sep-2019 11:36:20         at org.springframework.aop.support.AopUtils.invokeJoinpointUsingReflection(AopUtils.java:302)
07-Sep-2019 11:36:20         at org.eclipse.gemini.blueprint.service.importer.support.internal.aop.ServiceInvoker.doInvoke(ServiceInvoker.java:56)
07-Sep-2019 11:36:20         at org.eclipse.gemini.blueprint.service.importer.support.internal.aop.ServiceInvoker.invoke(ServiceInvoker.java:60)
07-Sep-2019 11:36:20         at org.springframework.aop.framework.ReflectiveMethodInvocation.proceed(ReflectiveMethodInvocation.java:179)
07-Sep-2019 11:36:20         at org.springframework.aop.support.DelegatingIntroductionInterceptor.doProceed(DelegatingIntroductionInterceptor.java:133)
07-Sep-2019 11:36:20         at org.springframework.aop.support.DelegatingIntroductionInterceptor.invoke(DelegatingIntroductionInterceptor.java:121)
07-Sep-2019 11:36:20         at org.springframework.aop.framework.ReflectiveMethodInvocation.proceed(ReflectiveMethodInvocation.java:179)
07-Sep-2019 11:36:20         at org.eclipse.gemini.blueprint.service.util.internal.aop.ServiceTCCLInterceptor.invokeUnprivileged(ServiceTCCLInterceptor.java:70)
07-Sep-2019 11:36:20         at org.eclipse.gemini.blueprint.service.util.internal.aop.ServiceTCCLInterceptor.invoke(ServiceTCCLInterceptor.java:53)
07-Sep-2019 11:36:20         at org.springframework.aop.framework.ReflectiveMethodInvocation.proceed(ReflectiveMethodInvocation.java:179)
07-Sep-2019 11:36:20         at org.eclipse.gemini.blueprint.service.importer.support.LocalBundleContextAdvice.invoke(LocalBundleContextAdvice.java:57)
07-Sep-2019 11:36:20         at org.springframework.aop.framework.ReflectiveMethodInvocation.proceed(ReflectiveMethodInvocation.java:179)
07-Sep-2019 11:36:20         at org.springframework.aop.support.DelegatingIntroductionInterceptor.doProceed(DelegatingIntroductionInterceptor.java:133)
07-Sep-2019 11:36:20         at org.springframework.aop.support.DelegatingIntroductionInterceptor.invoke(DelegatingIntroductionInterceptor.java:121)
07-Sep-2019 11:36:20         at org.springframework.aop.framework.ReflectiveMethodInvocation.proceed(ReflectiveMethodInvocation.java:179)
07-Sep-2019 11:36:20         at org.springframework.aop.framework.JdkDynamicAopProxy.invoke(JdkDynamicAopProxy.java:207)
07-Sep-2019 11:36:20         at com.sun.proxy.$Proxy662.run(Unknown Source)
07-Sep-2019 11:36:20         at com.atlassian.bamboo.plugins.docker.client.DockerCmd.run(DockerCmd.java:51)
07-Sep-2019 11:36:20         at com.atlassian.bamboo.plugins.docker.service.RunService.execute(RunService.java:64)
07-Sep-2019 11:36:20         ... 17 more
07-Sep-2019 11:36:20 Caused by: com.atlassian.utils.process.ProcessException: Error executing /usr/bin/docker run --volume /home/bamboo/xml-data/build-dir/PHPBB3-PR-JOB1:/data --workdir /data --rm -u=991 -t phpbb:php-7.1 /bin/bash -c "phpBB/vendor/bin/phpunit --log-junit build/logs/phpunit.xml"
07-Sep-2019 11:36:20         at com.atlassian.bamboo.docker.DockerContainerServiceImpl.execute(DockerContainerServiceImpl.java:252)
07-Sep-2019 11:36:20         at com.atlassian.bamboo.docker.DockerContainerServiceImpl.run(DockerContainerServiceImpl.java:106)
07-Sep-2019 11:36:20         ... 44 more
07-Sep-2019 11:36:20 Starting task 'Parsing test results produced by script' of type 'com.atlassian.bamboo.plugins.testresultparser:task.testresultparser.junit'
07-Sep-2019 11:36:20 Parsing test results under /home/bamboo/xml-data/build-dir/PHPBB3-PR-JOB1...
07-Sep-2019 11:36:20 Failing task since 2 failing test cases were found.
07-Sep-2019 11:36:20 Finished task 'Parsing test results produced by script' with result: Failed
07-Sep-2019 11:36:20
Substituting variable: ${bamboo.PRnumber} with 5679
07-Sep-2019 11:36:20
Substituting variable: ${bamboo.buildResultsUrl} with https://bamboo.phpbb.com/browse/PHPBB3-PR-JOB1-9560
07-Sep-2019 11:36:20
Substituting variable: ${bamboo.buildResultsUrl} with https://bamboo.phpbb.com/browse/PHPBB3-PR-JOB1-9560
07-Sep-2019 11:36:20 Starting task 'Set result build status' of type 'com.atlassian.bamboo.plugins.scripttask:task.builder.script'
07-Sep-2019 11:36:20
Beginning to execute external process for build 'phpBB3 - Pull Requests - Build and Test Job #9560 (PHPBB3-PR-JOB1-9560)'
... running command line:
/bin/sh /home/bamboo/temp/PHPBB3-PR-JOB1-9560-ScriptBuildTask-4037868618908445902.sh
... in: /home/bamboo/xml-data/build-dir/PHPBB3-PR-JOB1
... using extra environment variables:
bamboo_planRepository_1_branch=3.1.x
bamboo_planRepository_1_branchDisplayName=3.1.x
bamboo_repository_revision_number=dc8ff9da28b8ab4ad11c7ea94cca526f17c87fe5
bamboo_PRref=3.2.x
bamboo_resultsUrl=https://bamboo.phpbb.com/browse/PHPBB3-PR-JOB1-9560
bamboo_capability_system_builder_command_Git=/usr/bin/git
bamboo_repository_75956235_git_username=bantu
bamboo_build_working_directory=/home/bamboo/xml-data/build-dir/PHPBB3-PR-JOB1
bamboo_planRepository_1_name=phpBB Ascraeus
bamboo_buildKey=PHPBB3-PR-JOB1
bamboo_capability_phpbb_tests=true
bamboo_shortPlanName=Pull Requests
bamboo_capability_system_builder_command_fop=/usr/bin/fop
bamboo_capability_dbms_sqlite_2=true
bamboo_planRepository_name=phpBB Ascraeus
bamboo_PRnumber=5679
bamboo_buildNumber=9560
bamboo_repository_75956235_git_repositoryUrl=https://github.com/phpbb/phpbb.git
bamboo_capability_system_builder_phpunit_PHPUnit=/usr/bin/phpunit
bamboo_shortJobName=Build and Test Job
bamboo_buildResultsUrl=https://bamboo.phpbb.com/browse/PHPBB3-PR-JOB1-9560
bamboo_repository_75956235_branch_name=3.1.x
bamboo_planRepository_repositoryUrl=https://github.com/phpbb/phpbb.git
bamboo_agentId=131073
bamboo_planName=phpBB3 - Pull Requests
bamboo_build_commandline_com_atlassian_bamboo_plugins_scripttask_task_builder_script_7=/bin/sh /home/bamboo/temp/PHPBB3-PR-JOB1-9560-ScriptBuildTask-3853097279309303132.sh
bamboo_shortPlanKey=PR
bamboo_shortJobKey=JOB1
bamboo_capability_dbms_mysql_55=true
bamboo_capability_system_jdk_JDK_1_7_0_65=/usr/lib/jvm/java-7-openjdk-amd64
bamboo_planRepository_revision=dc8ff9da28b8ab4ad11c7ea94cca526f17c87fe5
bamboo_buildTimeStamp=2019-09-07T11:26:39.721Z
bamboo_repository_previous_revision_number=dc8ff9da28b8ab4ad11c7ea94cca526f17c87fe5
bamboo_capability_system_jdk_JDK_1_6_0_16=/usr/lib/jvm/java-6-sun-1.6.0.16
bamboo_capability_system_builder_mvn2_Maven_2=/usr/share/maven2
bamboo_planRepository_previousRevision=dc8ff9da28b8ab4ad11c7ea94cca526f17c87fe5
bamboo_build_commandline_com_atlassian_bamboo_plugins_scripttask_task_builder_script_4=/bin/sh /home/bamboo/temp/PHPBB3-PR-JOB1-9560-ScriptBuildTask-1150321321237758447.sh
bamboo_repository_git_branch=3.1.x
bamboo_buildResultKey=PHPBB3-PR-JOB1-9560
bamboo_repository_branch_name=3.1.x
bamboo_buildPlanName=phpBB3 - Pull Requests - Build and Test Job
bamboo_planRepository_1_revision=dc8ff9da28b8ab4ad11c7ea94cca526f17c87fe5
bamboo_repository_name=phpBB Ascraeus
bamboo_buildFailed=true
bamboo_build_commandline_com_atlassian_bamboo_plugins_bamboo_docker_plugin_task_docker_cli_10=/usr/bin/docker run --volume /home/bamboo/xml-data/build-dir/PHPBB3-PR-JOB1:/data --workdir /data --rm -u=991 -t phpbb:php-7.1 /bin/bash -c phpBB/vendor/bin/phpunit --log-junit build/logs/phpunit.xml
bamboo_capability_system_docker_executable=/usr/bin/docker
bamboo_build_commandline_com_atlassian_bamboo_plugins_bamboo_docker_plugin_task_docker_cli_11=/usr/bin/docker run --volume /home/bamboo/xml-data/build-dir/PHPBB3-PR-JOB1:/data --workdir /data/build --rm -u=991 phpbb:php-7.1 ../phpBB/vendor/bin/phing sniff
bamboo_build_commandline_com_atlassian_bamboo_plugins_bamboo_docker_plugin_task_docker_cli_12=/usr/bin/docker run --volume /home/bamboo/xml-data/build-dir/PHPBB3-PR-JOB1:/data --workdir /data/phpBB --rm -e HOME=/home/bamboo -u=991 phpbb:php-7.1 /bin/bash -c php ../composer.phar install --dev; cd ../build; ../phpBB/vendor/bin/phing clean prepare
bamboo_build_commandline_com_atlassian_bamboo_plugins_bamboo_docker_plugin_task_docker_cli_13=/usr/bin/docker build --force-rm=true --tag=phpbb:php-7.1 /home/bamboo/xml-data/build-dir/PHPBB3-PR-JOB1
bamboo_planRepository_branch=3.1.x
bamboo_agentWorkingDirectory=/home/bamboo/xml-data/build-dir
bamboo_jobFailed=true
bamboo_capability_system_git_executable=/usr/bin/git
bamboo_capability_system_builder_phpunit_PHPUnit_3_4=/usr/bin/phpunit
bamboo_repository_git_username=bantu
bamboo_planRepository_1_previousRevision=dc8ff9da28b8ab4ad11c7ea94cca526f17c87fe5
bamboo_repository_75956235_revision_number=dc8ff9da28b8ab4ad11c7ea94cca526f17c87fe5
bamboo_planRepository_branchDisplayName=3.1.x
bamboo_planRepository_1_type=gitv2
bamboo_planRepository_branchName=3.1.x
bamboo_repository_75956235_previous_revision_number=dc8ff9da28b8ab4ad11c7ea94cca526f17c87fe5
bamboo_capability_system_jdk_JDK=/usr/lib/jvm/java-6-sun
bamboo_plan_storageTag=PHPBB3-PR
bamboo_hg_cache_directory=/home/bamboo/xml-data/build-dir/_hg-repositories-cache
bamboo_planRepository_1_username=bantu
bamboo_planRepository_type=gitv2
bamboo_git_cache_directory=/home/bamboo/xml-data/build-dir/_git-repositories-cache
bamboo_ManualBuildTriggerReason_userName=Build Robot
bamboo_repository_git_repositoryUrl=https://github.com/phpbb/phpbb.git
bamboo_repository_75956235_git_branch=3.1.x
bamboo_capability_system_builder_ant_Ant=/usr/share/ant
bamboo_repository_75956235_name=phpBB Ascraeus
bamboo_tmp_directory=/home/bamboo/temp
bamboo_working_directory=/home/bamboo/xml-data/build-dir/PHPBB3-PR-JOB1
bamboo_planKey=PHPBB3-PR
bamboo_capability_local=true
bamboo_planRepository_1_repositoryUrl=https://github.com/phpbb/phpbb.git
bamboo_planRepository_username=bantu
bamboo_capability_system_jdk_JDK_1_6=/usr/lib/jvm/java-6-sun
bamboo_capability_system_jdk_JDK_1_7=/usr/lib/jvm/java-7-openjdk-amd64
bamboo_planRepository_1_branchName=3.1.x
07-Sep-2019 11:36:21 From https://github.com/phpbb/phpbb
07-Sep-2019 11:36:21 * branch            refs/pull/5679/head -> FETCH_HEAD
07-Sep-2019 11:36:21   <testsuite name="" tests="6775" assertions="124997" failures="2" errors="0" time="465.304314">
07-Sep-2019 11:36:21     <testsuite name="phpBB Test Suite" tests="5236" assertions="123458" failures="2" errors="0" time="337.952799">
07-Sep-2019 11:36:21       <testsuite name="phpbb_functions_validate_user_email_test" file="/data/tests/functions/validate_user_email_test.php" tests="7" assertions="7" failures="2" errors="0" time="0.651594">
07-Sep-2019 11:36:21         <testsuite name="phpbb_functions_validate_user_email_test::test_validate_user_email" tests="7" assertions="7" failures="2" errors="0" time="0.651594">
07-Sep-2019 11:36:21   % Total    % Received % Xferd  Average Speed   Time    Time     Time  Current
07-Sep-2019 11:36:21                                  Dload  Upload   Total   Spent    Left  Speed
07-Sep-2019 11:36:21
07-Sep-2019 11:36:22   0     0    0     0    0     0      0      0 --:--:-- --:--:-- --:--:--     0
07-Sep-2019 11:36:22 100   267  100    93  100   174    258    484 --:--:-- --:--:-- --:--:--   484
07-Sep-2019 11:36:22 Finished task 'Set result build status' with result: Success
07-Sep-2019 11:36:22 Running post build plugin 'NCover Results Collector'
07-Sep-2019 11:36:22 Running post build plugin 'Artifact Copier'
07-Sep-2019 11:36:22 Running post build plugin 'npm Cache Cleanup'
07-Sep-2019 11:36:22 Running post build plugin 'Clover Results Collector'
07-Sep-2019 11:36:22 Running post build plugin 'Docker Container Cleanup'
07-Sep-2019 11:36:22 Successfully removed working directory at '/home/bamboo/xml-data/build-dir/PHPBB3-PR-JOB1'
07-Sep-2019 11:36:22 Finalising the build...
07-Sep-2019 11:36:22 Stopping timer.
07-Sep-2019 11:36:22 Build PHPBB3-PR-JOB1-9560 completed.
07-Sep-2019 11:36:22 Running on server: post build plugin 'NCover Results Collector'
07-Sep-2019 11:36:22 Running on server: post build plugin 'Build Hanging Detection Configuration'
07-Sep-2019 11:36:22 Running on server: post build plugin 'Clover Delta Calculator'
07-Sep-2019 11:36:22 Running on server: post build plugin 'Maven Dependencies Postprocessor'
07-Sep-2019 11:36:22 All post build plugins have finished
07-Sep-2019 11:36:22 Generating build results summary...
07-Sep-2019 11:36:29 Saving build results to disk...
07-Sep-2019 11:36:29 Logging substituted variables...
07-Sep-2019 11:36:29 Indexing build results...
07-Sep-2019 11:36:29 Finished building PHPBB3-PR-JOB1-9560.
07-Sep-2019 11:36:29
Substituting variable: ${bamboo.PRnumber} with 5679