Tests pending pull requests

Build: #9577 failed

Job: Build and Test Job failed

Stages & jobs

  1. Build and Test

Build log

The build generated 385 lines of output. Download or view full build log

10-Sep-2019 23:02:34 Build phpBB3 - Pull Requests - Build and Test Job #9577 (PHPBB3-PR-JOB1-9577) started building on agent Default Agent
10-Sep-2019 23:02:34
10-Sep-2019 23:02:34 Build working directory is /home/bamboo/xml-data/build-dir/PHPBB3-PR-JOB1
10-Sep-2019 23:02:34 Executing build phpBB3 - Pull Requests - Build and Test Job #9577 (PHPBB3-PR-JOB1-9577)
10-Sep-2019 23:02:34 Starting task 'Checkout develop branch' of type 'com.atlassian.bamboo.plugins.vcs:task.vcs.checkout'
10-Sep-2019 23:02:34 Build always requires a clean checkout
10-Sep-2019 23:02:34 Cleaning build directory '/home/bamboo/xml-data/build-dir/PHPBB3-PR-JOB1'
10-Sep-2019 23:02:34 Checking out into /home/bamboo/xml-data/build-dir/PHPBB3-PR-JOB1
10-Sep-2019 23:02:34 Updating source code to revision: dc8ff9da28b8ab4ad11c7ea94cca526f17c87fe5
10-Sep-2019 23:02:34 Fetching 'refs/heads/3.1.x' from 'https://github.com/phpbb/phpbb.git'.
10-Sep-2019 23:02:35 Checking out revision dc8ff9da28b8ab4ad11c7ea94cca526f17c87fe5.
10-Sep-2019 23:02:35 Creating local git repository in '/home/bamboo/xml-data/build-dir/PHPBB3-PR-JOB1/.git'.
10-Sep-2019 23:02:35 Cloning into '/home/bamboo/xml-data/build-dir/PHPBB3-PR-JOB1'...
10-Sep-2019 23:02:35 done.
10-Sep-2019 23:02:38 Switched to a new branch '3.1.x'
10-Sep-2019 23:02:38 Branch 3.1.x set up to track remote branch 3.1.x from origin.
10-Sep-2019 23:02:39 Updated source code to revision: dc8ff9da28b8ab4ad11c7ea94cca526f17c87fe5
10-Sep-2019 23:02:39 Finished task 'Checkout develop branch' with result: Success
10-Sep-2019 23:02:39 Running pre-build action: VCS Version Collector
10-Sep-2019 23:02:39
Substituting variable: ${bamboo.PRnumber} with 5685
10-Sep-2019 23:02:39
Substituting variable: ${bamboo.buildResultsUrl} with https://bamboo.phpbb.com/browse/PHPBB3-PR-JOB1-9577
10-Sep-2019 23:02:39 Starting task 'Set pending build status' of type 'com.atlassian.bamboo.plugins.scripttask:task.builder.script'
10-Sep-2019 23:02:39
Beginning to execute external process for build 'phpBB3 - Pull Requests - Build and Test Job #9577 (PHPBB3-PR-JOB1-9577)'
... running command line:
/bin/sh /home/bamboo/temp/PHPBB3-PR-JOB1-9577-ScriptBuildTask-5734615447471524700.sh
... in: /home/bamboo/xml-data/build-dir/PHPBB3-PR-JOB1
... using extra environment variables:
bamboo_planRepository_1_branch=3.1.x
bamboo_planRepository_1_branchDisplayName=3.1.x
bamboo_repository_revision_number=dc8ff9da28b8ab4ad11c7ea94cca526f17c87fe5
bamboo_PRref=3.2.x
bamboo_resultsUrl=https://bamboo.phpbb.com/browse/PHPBB3-PR-JOB1-9577
bamboo_capability_system_builder_command_Git=/usr/bin/git
bamboo_repository_75956235_git_username=bantu
bamboo_build_working_directory=/home/bamboo/xml-data/build-dir/PHPBB3-PR-JOB1
bamboo_planRepository_1_name=phpBB Ascraeus
bamboo_buildKey=PHPBB3-PR-JOB1
bamboo_capability_phpbb_tests=true
bamboo_shortPlanName=Pull Requests
bamboo_capability_system_builder_command_fop=/usr/bin/fop
bamboo_capability_dbms_sqlite_2=true
bamboo_planRepository_name=phpBB Ascraeus
bamboo_PRnumber=5685
bamboo_buildNumber=9577
bamboo_repository_75956235_git_repositoryUrl=https://github.com/phpbb/phpbb.git
bamboo_capability_system_builder_phpunit_PHPUnit=/usr/bin/phpunit
bamboo_shortJobName=Build and Test Job
bamboo_buildResultsUrl=https://bamboo.phpbb.com/browse/PHPBB3-PR-JOB1-9577
bamboo_repository_75956235_branch_name=3.1.x
bamboo_planRepository_repositoryUrl=https://github.com/phpbb/phpbb.git
bamboo_agentId=131073
bamboo_planName=phpBB3 - Pull Requests
bamboo_shortPlanKey=PR
bamboo_shortJobKey=JOB1
bamboo_capability_dbms_mysql_55=true
bamboo_capability_system_jdk_JDK_1_7_0_65=/usr/lib/jvm/java-7-openjdk-amd64
bamboo_planRepository_revision=dc8ff9da28b8ab4ad11c7ea94cca526f17c87fe5
bamboo_buildTimeStamp=2019-09-10T23:02:34.725Z
bamboo_repository_previous_revision_number=dc8ff9da28b8ab4ad11c7ea94cca526f17c87fe5
bamboo_capability_system_jdk_JDK_1_6_0_16=/usr/lib/jvm/java-6-sun-1.6.0.16
bamboo_capability_system_builder_mvn2_Maven_2=/usr/share/maven2
bamboo_planRepository_previousRevision=dc8ff9da28b8ab4ad11c7ea94cca526f17c87fe5
bamboo_repository_git_branch=3.1.x
bamboo_buildResultKey=PHPBB3-PR-JOB1-9577
bamboo_repository_branch_name=3.1.x
bamboo_buildPlanName=phpBB3 - Pull Requests - Build and Test Job
bamboo_planRepository_1_revision=dc8ff9da28b8ab4ad11c7ea94cca526f17c87fe5
bamboo_repository_name=phpBB Ascraeus
bamboo_buildFailed=false
bamboo_capability_system_docker_executable=/usr/bin/docker
bamboo_planRepository_branch=3.1.x
bamboo_agentWorkingDirectory=/home/bamboo/xml-data/build-dir
bamboo_capability_system_git_executable=/usr/bin/git
bamboo_capability_system_builder_phpunit_PHPUnit_3_4=/usr/bin/phpunit
bamboo_repository_git_username=bantu
bamboo_planRepository_1_previousRevision=dc8ff9da28b8ab4ad11c7ea94cca526f17c87fe5
bamboo_repository_75956235_revision_number=dc8ff9da28b8ab4ad11c7ea94cca526f17c87fe5
bamboo_planRepository_branchDisplayName=3.1.x
bamboo_planRepository_1_type=gitv2
bamboo_planRepository_branchName=3.1.x
bamboo_repository_75956235_previous_revision_number=dc8ff9da28b8ab4ad11c7ea94cca526f17c87fe5
bamboo_capability_system_jdk_JDK=/usr/lib/jvm/java-6-sun
bamboo_plan_storageTag=PHPBB3-PR
bamboo_hg_cache_directory=/home/bamboo/xml-data/build-dir/_hg-repositories-cache
bamboo_planRepository_1_username=bantu
bamboo_planRepository_type=gitv2
bamboo_git_cache_directory=/home/bamboo/xml-data/build-dir/_git-repositories-cache
bamboo_ManualBuildTriggerReason_userName=Build Robot
bamboo_repository_git_repositoryUrl=https://github.com/phpbb/phpbb.git
bamboo_repository_75956235_git_branch=3.1.x
bamboo_capability_system_builder_ant_Ant=/usr/share/ant
bamboo_repository_75956235_name=phpBB Ascraeus
bamboo_tmp_directory=/home/bamboo/temp
bamboo_working_directory=/home/bamboo/xml-data/build-dir/PHPBB3-PR-JOB1
bamboo_planKey=PHPBB3-PR
bamboo_capability_local=true
bamboo_planRepository_1_repositoryUrl=https://github.com/phpbb/phpbb.git
bamboo_planRepository_username=bantu
bamboo_capability_system_jdk_JDK_1_6=/usr/lib/jvm/java-6-sun
bamboo_capability_system_jdk_JDK_1_7=/usr/lib/jvm/java-7-openjdk-amd64
bamboo_planRepository_1_branchName=3.1.x
10-Sep-2019 23:02:40 From https://github.com/phpbb/phpbb
10-Sep-2019 23:02:40 * branch            refs/pull/5685/head -> FETCH_HEAD
10-Sep-2019 23:02:40   % Total    % Received % Xferd  Average Speed   Time    Time     Time  Current
10-Sep-2019 23:02:40                                  Dload  Upload   Total   Spent    Left  Speed
10-Sep-2019 23:02:40
10-Sep-2019 23:02:40   0     0    0     0    0     0      0      0 --:--:-- --:--:-- --:--:--     0
10-Sep-2019 23:02:40 100   275  100    93  100   182    313    613 --:--:-- --:--:-- --:--:--   614
10-Sep-2019 23:02:40 Finished task 'Set pending build status' with result: Success
10-Sep-2019 23:02:40
Substituting variable: ${bamboo.PRnumber} with 5685
10-Sep-2019 23:02:40 Starting task 'Fetch PR' of type 'com.atlassian.bamboo.plugins.scripttask:task.builder.script'
10-Sep-2019 23:02:40
Beginning to execute external process for build 'phpBB3 - Pull Requests - Build and Test Job #9577 (PHPBB3-PR-JOB1-9577)'
... running command line:
/bin/sh /home/bamboo/temp/PHPBB3-PR-JOB1-9577-ScriptBuildTask-5100357543160451971.sh
... in: /home/bamboo/xml-data/build-dir/PHPBB3-PR-JOB1
... using extra environment variables:
bamboo_planRepository_1_branch=3.1.x
bamboo_planRepository_1_branchDisplayName=3.1.x
bamboo_repository_revision_number=dc8ff9da28b8ab4ad11c7ea94cca526f17c87fe5
bamboo_PRref=3.2.x
bamboo_resultsUrl=https://bamboo.phpbb.com/browse/PHPBB3-PR-JOB1-9577
bamboo_capability_system_builder_command_Git=/usr/bin/git
bamboo_repository_75956235_git_username=bantu
bamboo_build_working_directory=/home/bamboo/xml-data/build-dir/PHPBB3-PR-JOB1
bamboo_planRepository_1_name=phpBB Ascraeus
bamboo_buildKey=PHPBB3-PR-JOB1
bamboo_capability_phpbb_tests=true
bamboo_shortPlanName=Pull Requests
bamboo_capability_system_builder_command_fop=/usr/bin/fop
bamboo_capability_dbms_sqlite_2=true
bamboo_planRepository_name=phpBB Ascraeus
bamboo_PRnumber=5685
bamboo_buildNumber=9577
bamboo_repository_75956235_git_repositoryUrl=https://github.com/phpbb/phpbb.git
bamboo_capability_system_builder_phpunit_PHPUnit=/usr/bin/phpunit
bamboo_shortJobName=Build and Test Job
bamboo_buildResultsUrl=https://bamboo.phpbb.com/browse/PHPBB3-PR-JOB1-9577
bamboo_repository_75956235_branch_name=3.1.x
bamboo_planRepository_repositoryUrl=https://github.com/phpbb/phpbb.git
bamboo_agentId=131073
bamboo_planName=phpBB3 - Pull Requests
bamboo_build_commandline_com_atlassian_bamboo_plugins_scripttask_task_builder_script_7=/bin/sh /home/bamboo/temp/PHPBB3-PR-JOB1-9577-ScriptBuildTask-5734615447471524700.sh
bamboo_shortPlanKey=PR
bamboo_shortJobKey=JOB1
bamboo_capability_dbms_mysql_55=true
bamboo_capability_system_jdk_JDK_1_7_0_65=/usr/lib/jvm/java-7-openjdk-amd64
bamboo_planRepository_revision=dc8ff9da28b8ab4ad11c7ea94cca526f17c87fe5
bamboo_buildTimeStamp=2019-09-10T23:02:34.725Z
bamboo_repository_previous_revision_number=dc8ff9da28b8ab4ad11c7ea94cca526f17c87fe5
bamboo_capability_system_jdk_JDK_1_6_0_16=/usr/lib/jvm/java-6-sun-1.6.0.16
bamboo_capability_system_builder_mvn2_Maven_2=/usr/share/maven2
bamboo_planRepository_previousRevision=dc8ff9da28b8ab4ad11c7ea94cca526f17c87fe5
bamboo_repository_git_branch=3.1.x
bamboo_buildResultKey=PHPBB3-PR-JOB1-9577
bamboo_repository_branch_name=3.1.x
bamboo_buildPlanName=phpBB3 - Pull Requests - Build and Test Job
bamboo_planRepository_1_revision=dc8ff9da28b8ab4ad11c7ea94cca526f17c87fe5
bamboo_repository_name=phpBB Ascraeus
bamboo_buildFailed=false
bamboo_capability_system_docker_executable=/usr/bin/docker
bamboo_planRepository_branch=3.1.x
bamboo_agentWorkingDirectory=/home/bamboo/xml-data/build-dir
bamboo_capability_system_git_executable=/usr/bin/git
bamboo_capability_system_builder_phpunit_PHPUnit_3_4=/usr/bin/phpunit
bamboo_repository_git_username=bantu
bamboo_planRepository_1_previousRevision=dc8ff9da28b8ab4ad11c7ea94cca526f17c87fe5
bamboo_repository_75956235_revision_number=dc8ff9da28b8ab4ad11c7ea94cca526f17c87fe5
bamboo_planRepository_branchDisplayName=3.1.x
bamboo_planRepository_1_type=gitv2
bamboo_planRepository_branchName=3.1.x
bamboo_repository_75956235_previous_revision_number=dc8ff9da28b8ab4ad11c7ea94cca526f17c87fe5
bamboo_capability_system_jdk_JDK=/usr/lib/jvm/java-6-sun
bamboo_plan_storageTag=PHPBB3-PR
bamboo_hg_cache_directory=/home/bamboo/xml-data/build-dir/_hg-repositories-cache
bamboo_planRepository_1_username=bantu
bamboo_planRepository_type=gitv2
bamboo_git_cache_directory=/home/bamboo/xml-data/build-dir/_git-repositories-cache
bamboo_ManualBuildTriggerReason_userName=Build Robot
bamboo_repository_git_repositoryUrl=https://github.com/phpbb/phpbb.git
bamboo_repository_75956235_git_branch=3.1.x
bamboo_capability_system_builder_ant_Ant=/usr/share/ant
bamboo_repository_75956235_name=phpBB Ascraeus
bamboo_tmp_directory=/home/bamboo/temp
bamboo_working_directory=/home/bamboo/xml-data/build-dir/PHPBB3-PR-JOB1
bamboo_planKey=PHPBB3-PR
bamboo_capability_local=true
bamboo_planRepository_1_repositoryUrl=https://github.com/phpbb/phpbb.git
bamboo_planRepository_username=bantu
bamboo_capability_system_jdk_JDK_1_6=/usr/lib/jvm/java-6-sun
bamboo_capability_system_jdk_JDK_1_7=/usr/lib/jvm/java-7-openjdk-amd64
bamboo_planRepository_1_branchName=3.1.x
10-Sep-2019 23:02:41 From https://github.com/phpbb/phpbb
10-Sep-2019 23:02:41 * branch            refs/pull/5685/merge -> FETCH_HEAD
10-Sep-2019 23:02:42 Note: checking out 'FETCH_HEAD'.
10-Sep-2019 23:02:42
10-Sep-2019 23:02:42 You are in 'detached HEAD' state. You can look around, make experimental
10-Sep-2019 23:02:42 changes and commit them, and you can discard any commits you make in this
10-Sep-2019 23:02:42 state without impacting any branches by performing another checkout.
10-Sep-2019 23:02:42
10-Sep-2019 23:02:42 If you want to create a new branch to retain commits you create, you may
10-Sep-2019 23:02:42 do so (now or later) by using -b with the checkout command again. Example:
10-Sep-2019 23:02:42
10-Sep-2019 23:02:42   git checkout -b new_branch_name
10-Sep-2019 23:02:42
10-Sep-2019 23:02:42 HEAD is now at 88a87d1... Merge d63b9469f405c05a7828d0f77d6b9a110700cba9 into 4db585a4cb2e5359074a82ef088574609155294b
10-Sep-2019 23:02:42 Finished task 'Fetch PR' with result: Success
10-Sep-2019 23:02:42 Skipping execution of task 'Prepare directory' as it is disabled
10-Sep-2019 23:02:42
Substituting variable: ${bamboo.working.directory} with /home/bamboo/xml-data/build-dir/PHPBB3-PR-JOB1
10-Sep-2019 23:02:42 Starting task 'Build image' of type 'com.atlassian.bamboo.plugins.bamboo-docker-plugin:task.docker.cli'
10-Sep-2019 23:02:42
Beginning to execute external process for build 'phpBB3 - Pull Requests - Build and Test Job #9577 (PHPBB3-PR-JOB1-9577)'
... running command line:
/usr/bin/docker build --force-rm=true --tag=phpbb:php-7.1 /home/bamboo/xml-data/build-dir/PHPBB3-PR-JOB1
... in: /home/bamboo/xml-data/build-dir/PHPBB3-PR-JOB1
... using extra environment variables:
bamboo_planRepository_1_branch=3.1.x
bamboo_planRepository_1_branchDisplayName=3.1.x
bamboo_repository_revision_number=dc8ff9da28b8ab4ad11c7ea94cca526f17c87fe5
bamboo_PRref=3.2.x
bamboo_resultsUrl=https://bamboo.phpbb.com/browse/PHPBB3-PR-JOB1-9577
bamboo_capability_system_builder_command_Git=/usr/bin/git
bamboo_repository_75956235_git_username=bantu
bamboo_build_working_directory=/home/bamboo/xml-data/build-dir/PHPBB3-PR-JOB1
bamboo_planRepository_1_name=phpBB Ascraeus
bamboo_buildKey=PHPBB3-PR-JOB1
bamboo_capability_phpbb_tests=true
bamboo_shortPlanName=Pull Requests
bamboo_capability_system_builder_command_fop=/usr/bin/fop
bamboo_capability_dbms_sqlite_2=true
bamboo_planRepository_name=phpBB Ascraeus
bamboo_PRnumber=5685
bamboo_buildNumber=9577
bamboo_repository_75956235_git_repositoryUrl=https://github.com/phpbb/phpbb.git
bamboo_capability_system_builder_phpunit_PHPUnit=/usr/bin/phpunit
bamboo_shortJobName=Build and Test Job
bamboo_buildResultsUrl=https://bamboo.phpbb.com/browse/PHPBB3-PR-JOB1-9577
bamboo_repository_75956235_branch_name=3.1.x
bamboo_planRepository_repositoryUrl=https://github.com/phpbb/phpbb.git
bamboo_agentId=131073
bamboo_planName=phpBB3 - Pull Requests
bamboo_build_commandline_com_atlassian_bamboo_plugins_scripttask_task_builder_script_7=/bin/sh /home/bamboo/temp/PHPBB3-PR-JOB1-9577-ScriptBuildTask-5734615447471524700.sh
bamboo_shortPlanKey=PR
bamboo_shortJobKey=JOB1
bamboo_capability_dbms_mysql_55=true
bamboo_capability_system_jdk_JDK_1_7_0_65=/usr/lib/jvm/java-7-openjdk-amd64
bamboo_planRepository_revision=dc8ff9da28b8ab4ad11c7ea94cca526f17c87fe5
bamboo_buildTimeStamp=2019-09-10T23:02:34.725Z
bamboo_repository_previous_revision_number=dc8ff9da28b8ab4ad11c7ea94cca526f17c87fe5
bamboo_capability_system_jdk_JDK_1_6_0_16=/usr/lib/jvm/java-6-sun-1.6.0.16
bamboo_capability_system_builder_mvn2_Maven_2=/usr/share/maven2
bamboo_planRepository_previousRevision=dc8ff9da28b8ab4ad11c7ea94cca526f17c87fe5
bamboo_build_commandline_com_atlassian_bamboo_plugins_scripttask_task_builder_script_4=/bin/sh /home/bamboo/temp/PHPBB3-PR-JOB1-9577-ScriptBuildTask-5100357543160451971.sh
bamboo_repository_git_branch=3.1.x
bamboo_buildResultKey=PHPBB3-PR-JOB1-9577
bamboo_repository_branch_name=3.1.x
bamboo_buildPlanName=phpBB3 - Pull Requests - Build and Test Job
bamboo_planRepository_1_revision=dc8ff9da28b8ab4ad11c7ea94cca526f17c87fe5
bamboo_repository_name=phpBB Ascraeus
bamboo_buildFailed=false
bamboo_capability_system_docker_executable=/usr/bin/docker
bamboo_planRepository_branch=3.1.x
bamboo_agentWorkingDirectory=/home/bamboo/xml-data/build-dir
bamboo_capability_system_git_executable=/usr/bin/git
bamboo_capability_system_builder_phpunit_PHPUnit_3_4=/usr/bin/phpunit
bamboo_repository_git_username=bantu
bamboo_planRepository_1_previousRevision=dc8ff9da28b8ab4ad11c7ea94cca526f17c87fe5
bamboo_repository_75956235_revision_number=dc8ff9da28b8ab4ad11c7ea94cca526f17c87fe5
bamboo_planRepository_branchDisplayName=3.1.x
bamboo_planRepository_1_type=gitv2
bamboo_planRepository_branchName=3.1.x
bamboo_repository_75956235_previous_revision_number=dc8ff9da28b8ab4ad11c7ea94cca526f17c87fe5
bamboo_capability_system_jdk_JDK=/usr/lib/jvm/java-6-sun
bamboo_plan_storageTag=PHPBB3-PR
bamboo_hg_cache_directory=/home/bamboo/xml-data/build-dir/_hg-repositories-cache
bamboo_planRepository_1_username=bantu
bamboo_planRepository_type=gitv2
bamboo_git_cache_directory=/home/bamboo/xml-data/build-dir/_git-repositories-cache
bamboo_ManualBuildTriggerReason_userName=Build Robot
bamboo_repository_git_repositoryUrl=https://github.com/phpbb/phpbb.git
bamboo_repository_75956235_git_branch=3.1.x
bamboo_capability_system_builder_ant_Ant=/usr/share/ant
bamboo_repository_75956235_name=phpBB Ascraeus
bamboo_tmp_directory=/home/bamboo/temp
bamboo_working_directory=/home/bamboo/xml-data/build-dir/PHPBB3-PR-JOB1
bamboo_planKey=PHPBB3-PR
bamboo_capability_local=true
bamboo_planRepository_1_repositoryUrl=https://github.com/phpbb/phpbb.git
bamboo_planRepository_username=bantu
bamboo_capability_system_jdk_JDK_1_6=/usr/lib/jvm/java-6-sun
bamboo_capability_system_jdk_JDK_1_7=/usr/lib/jvm/java-7-openjdk-amd64
bamboo_planRepository_1_branchName=3.1.x
10-Sep-2019 23:02:43 Sending build context to Docker daemon  20.01MB
10-Sep-2019 23:02:43
10-Sep-2019 23:02:43 Step 1/5 : FROM php:7.1
10-Sep-2019 23:02:43 ---> 733744c7fb19
10-Sep-2019 23:02:43 Step 2/5 : RUN apt-get update && apt-get install -y         git         zlib1g-dev         bzip2         zip         && docker-php-ext-install -j$(nproc) zip
10-Sep-2019 23:02:43 ---> Using cache
10-Sep-2019 23:02:43 ---> 922a485f7d56
10-Sep-2019 23:02:43 Step 3/5 : RUN pecl install xdebug-2.6.1
10-Sep-2019 23:02:43 ---> Using cache
10-Sep-2019 23:02:43 ---> 9d18315d07da
10-Sep-2019 23:02:43 Step 4/5 : RUN docker-php-ext-enable xdebug
10-Sep-2019 23:02:43 ---> Using cache
10-Sep-2019 23:02:43 ---> c478ba6cd87c
10-Sep-2019 23:02:43 Step 5/5 : RUN echo "memory_limit = 1536M" >> /usr/local/etc/php/conf.d/memory.ini
10-Sep-2019 23:02:43 ---> Using cache
10-Sep-2019 23:02:43 ---> a809ad3aa1fa
10-Sep-2019 23:02:43 Successfully built a809ad3aa1fa
10-Sep-2019 23:02:43 Successfully tagged phpbb:php-7.1
10-Sep-2019 23:02:43 Built Docker image 'phpbb:php-7.1'
10-Sep-2019 23:02:43 Finished task 'Build image' with result: Success
10-Sep-2019 23:02:43
Substituting variable: ${bamboo.working.directory} with /home/bamboo/xml-data/build-dir/PHPBB3-PR-JOB1
10-Sep-2019 23:02:43 Starting task 'Prepare directory' of type 'com.atlassian.bamboo.plugins.bamboo-docker-plugin:task.docker.cli'
10-Sep-2019 23:02:43 Running image name (phpbb:php-7.1)
10-Sep-2019 23:02:43
Beginning to execute external process for build 'phpBB3 - Pull Requests - Build and Test Job #9577 (PHPBB3-PR-JOB1-9577)'
... running command line:
/usr/bin/docker run --volume /home/bamboo/xml-data/build-dir/PHPBB3-PR-JOB1:/data --workdir /data/phpBB --rm -e HOME=/home/bamboo -u=991 phpbb:php-7.1 /bin/bash -c php ../composer.phar install --dev; cd ../build; ../phpBB/vendor/bin/phing clean prepare
... in: /home/bamboo/xml-data/build-dir/PHPBB3-PR-JOB1
... using extra environment variables:
bamboo_planRepository_1_branch=3.1.x
bamboo_planRepository_1_branchDisplayName=3.1.x
bamboo_repository_revision_number=dc8ff9da28b8ab4ad11c7ea94cca526f17c87fe5
bamboo_PRref=3.2.x
bamboo_resultsUrl=https://bamboo.phpbb.com/browse/PHPBB3-PR-JOB1-9577
bamboo_capability_system_builder_command_Git=/usr/bin/git
bamboo_repository_75956235_git_username=bantu
bamboo_build_working_directory=/home/bamboo/xml-data/build-dir/PHPBB3-PR-JOB1
bamboo_planRepository_1_name=phpBB Ascraeus
bamboo_buildKey=PHPBB3-PR-JOB1
bamboo_capability_phpbb_tests=true
bamboo_shortPlanName=Pull Requests
bamboo_capability_system_builder_command_fop=/usr/bin/fop
bamboo_capability_dbms_sqlite_2=true
bamboo_planRepository_name=phpBB Ascraeus
bamboo_PRnumber=5685
bamboo_buildNumber=9577
bamboo_repository_75956235_git_repositoryUrl=https://github.com/phpbb/phpbb.git
bamboo_capability_system_builder_phpunit_PHPUnit=/usr/bin/phpunit
bamboo_shortJobName=Build and Test Job
bamboo_buildResultsUrl=https://bamboo.phpbb.com/browse/PHPBB3-PR-JOB1-9577
bamboo_repository_75956235_branch_name=3.1.x
bamboo_planRepository_repositoryUrl=https://github.com/phpbb/phpbb.git
bamboo_agentId=131073
bamboo_planName=phpBB3 - Pull Requests
bamboo_build_commandline_com_atlassian_bamboo_plugins_scripttask_task_builder_script_7=/bin/sh /home/bamboo/temp/PHPBB3-PR-JOB1-9577-ScriptBuildTask-5734615447471524700.sh
bamboo_shortPlanKey=PR
bamboo_shortJobKey=JOB1
bamboo_capability_dbms_mysql_55=true
bamboo_capability_system_jdk_JDK_1_7_0_65=/usr/lib/jvm/java-7-openjdk-amd64
bamboo_planRepository_revision=dc8ff9da28b8ab4ad11c7ea94cca526f17c87fe5
bamboo_buildTimeStamp=2019-09-10T23:02:34.725Z
bamboo_repository_previous_revision_number=dc8ff9da28b8ab4ad11c7ea94cca526f17c87fe5
bamboo_capability_system_jdk_JDK_1_6_0_16=/usr/lib/jvm/java-6-sun-1.6.0.16
bamboo_capability_system_builder_mvn2_Maven_2=/usr/share/maven2
bamboo_planRepository_previousRevision=dc8ff9da28b8ab4ad11c7ea94cca526f17c87fe5
bamboo_build_commandline_com_atlassian_bamboo_plugins_scripttask_task_builder_script_4=/bin/sh /home/bamboo/temp/PHPBB3-PR-JOB1-9577-ScriptBuildTask-5100357543160451971.sh
bamboo_repository_git_branch=3.1.x
bamboo_buildResultKey=PHPBB3-PR-JOB1-9577
bamboo_repository_branch_name=3.1.x
bamboo_buildPlanName=phpBB3 - Pull Requests - Build and Test Job
bamboo_planRepository_1_revision=dc8ff9da28b8ab4ad11c7ea94cca526f17c87fe5
bamboo_repository_name=phpBB Ascraeus
bamboo_buildFailed=false
bamboo_capability_system_docker_executable=/usr/bin/docker
bamboo_build_commandline_com_atlassian_bamboo_plugins_bamboo_docker_plugin_task_docker_cli_13=/usr/bin/docker build --force-rm=true --tag=phpbb:php-7.1 /home/bamboo/xml-data/build-dir/PHPBB3-PR-JOB1
bamboo_planRepository_branch=3.1.x
bamboo_agentWorkingDirectory=/home/bamboo/xml-data/build-dir
bamboo_capability_system_git_executable=/usr/bin/git
bamboo_capability_system_builder_phpunit_PHPUnit_3_4=/usr/bin/phpunit
bamboo_repository_git_username=bantu
bamboo_planRepository_1_previousRevision=dc8ff9da28b8ab4ad11c7ea94cca526f17c87fe5
bamboo_repository_75956235_revision_number=dc8ff9da28b8ab4ad11c7ea94cca526f17c87fe5
bamboo_planRepository_branchDisplayName=3.1.x
bamboo_planRepository_1_type=gitv2
bamboo_planRepository_branchName=3.1.x
bamboo_repository_75956235_previous_revision_number=dc8ff9da28b8ab4ad11c7ea94cca526f17c87fe5
bamboo_capability_system_jdk_JDK=/usr/lib/jvm/java-6-sun
bamboo_plan_storageTag=PHPBB3-PR
bamboo_hg_cache_directory=/home/bamboo/xml-data/build-dir/_hg-repositories-cache
bamboo_planRepository_1_username=bantu
bamboo_planRepository_type=gitv2
bamboo_git_cache_directory=/home/bamboo/xml-data/build-dir/_git-repositories-cache
bamboo_ManualBuildTriggerReason_userName=Build Robot
bamboo_repository_git_repositoryUrl=https://github.com/phpbb/phpbb.git
bamboo_repository_75956235_git_branch=3.1.x
bamboo_capability_system_builder_ant_Ant=/usr/share/ant
bamboo_repository_75956235_name=phpBB Ascraeus
bamboo_tmp_directory=/home/bamboo/temp
bamboo_working_directory=/home/bamboo/xml-data/build-dir/PHPBB3-PR-JOB1
bamboo_planKey=PHPBB3-PR
bamboo_capability_local=true
bamboo_planRepository_1_repositoryUrl=https://github.com/phpbb/phpbb.git
bamboo_planRepository_username=bantu
bamboo_capability_system_jdk_JDK_1_6=/usr/lib/jvm/java-6-sun
bamboo_capability_system_jdk_JDK_1_7=/usr/lib/jvm/java-7-openjdk-amd64
bamboo_planRepository_1_branchName=3.1.x
10-Sep-2019 23:02:44 Cannot create cache directory /home/bamboo/.composer/cache/repo/https---repo.packagist.org/, or directory is not writable. Proceeding without cache
10-Sep-2019 23:02:44 Cannot create cache directory /home/bamboo/.composer/cache/files/, or directory is not writable. Proceeding without cache
10-Sep-2019 23:02:44 You are using the deprecated option "dev". Dev packages are installed by default now.
10-Sep-2019 23:02:44 Loading composer repositories with package information
10-Sep-2019 23:02:44 Installing dependencies (including require-dev) from lock file
10-Sep-2019 23:02:44 Package operations: 66 installs, 0 updates, 0 removals
10-Sep-2019 23:02:45   - Installing bantu/ini-get-wrapper (v1.0.1): Downloading (connecting...)Downloading (100%)         
10-Sep-2019 23:02:45   - Installing google/recaptcha (1.1.2): Downloading (connecting...)Downloading (100%)         
10-Sep-2019 23:02:46   - Installing react/promise (v2.7.1): Downloading (connecting...)Downloading (0%)           Downloading (5%)Downloading (30%)Downloading (35%)Downloading (50%)Downloading (55%)Downloading (80%)Downloading (85%)Downloading (100%)
10-Sep-2019 23:02:46   - Installing guzzlehttp/streams (3.0.0): Downloading (connecting...)Downloading (0%)           Downloading (25%)Downloading (35%)Downloading (50%)Downloading (60%)Downloading (75%)Downloading (85%)Downloading (90%)Downloading (100%)
10-Sep-2019 23:02:47   - Installing guzzlehttp/ringphp (1.1.1): Downloading (connecting...)Downloading (0%)           Downloading (10%)Downloading (15%)Downloading (20%)Downloading (30%)Downloading (40%)Downloading (50%)Downloading (60%)Downloading (70%)Downloading (80%)Downloading (85%)Downloading (95%)Downloading (100%)
10-Sep-2019 23:02:48   - Installing lusitanian/oauth (v0.8.11): Downloading (connecting...)Downloading (0%)           Downloading (5%)Downloading (10%)Downloading (15%)Downloading (20%)Downloading (30%)Downloading (35%)Downloading (45%)Downloading (50%)Downloading (55%)Downloading (60%)Downloading (65%)Downloading (70%)Downloading (75%)Downloading (80%)Downloading (85%)Downloading (95%)Downloading (100%)
10-Sep-2019 23:02:48   - Installing marc1706/fast-image-size (v1.1.4): Downloading (connecting...)Downloading (100%)         
10-Sep-2019 23:02:48   - Installing paragonie/random_compat (v2.0.18): Downloading (connecting...)Downloading (0%)           Downloading (25%)Downloading (50%)Downloading (75%)Downloading (100%)
10-Sep-2019 23:02:49   - Installing patchwork/utf8 (v1.3.1): Downloading (connecting...)Downloading (0%)           Downloading (5%)Downloading (10%)Downloading (15%)Downloading (20%)Downloading (25%)Downloading (30%)Downloading (35%)Downloading (40%)Downloading (45%)Downloading (50%)Downloading (55%)Downloading (60%)Downloading (65%)Downloading (70%)Downloading (75%)Downloading (80%)Downloading (85%)Downloading (90%)Downloading (95%)Downloading (100%)
10-Sep-2019 23:02:50   - Installing s9e/text-formatter (1.4.5): Downloading (connecting...)Downloading (100%)         
10-Sep-2019 23:02:50   - Installing symfony/polyfill-ctype (v1.11.0): Downloading (connecting...)Downloading (0%)           Downloading (100%)
10-Sep-2019 23:02:51   - Installing symfony/filesystem (v2.8.50): Downloading (connecting...)Downloading (0%)           Downloading (40%)Downloading (45%)Downloading (85%)Downloading (100%)
10-Sep-2019 23:02:51   - Installing symfony/config (v2.8.50): Downloading (connecting...)Downloading (100%)         
10-Sep-2019 23:02:52   - Installing ircmaxell/password-compat (v1.0.4): Downloading (connecting...)Downloading (0%)           Downloading (100%)
10-Sep-2019 23:02:52   - Installing symfony/polyfill-php55 (v1.11.0): Downloading (connecting...)Downloading (0%)           Downloading (80%)Downloading (100%)
10-Sep-2019 23:02:53   - Installing symfony/polyfill-php54 (v1.11.0): Downloading (connecting...)Downloading (100%)         
10-Sep-2019 23:02:53   - Installing symfony/polyfill-mbstring (v1.11.0): Downloading (connecting...)Downloading (0%)           Downloading (30%)Downloading (55%)Downloading (80%)Downloading (100%)
10-Sep-2019 23:02:54   - Installing symfony/http-foundation (v2.8.50): Downloading (connecting...)Downloading (0%)           Downloading (5%)Downloading (10%)Downloading (15%)Downloading (20%)Downloading (25%)Downloading (30%)Downloading (35%)Downloading (40%)Downloading (45%)Downloading (50%)Downloading (55%)Downloading (60%)Downloading (65%)Downloading (70%)Downloading (75%)Downloading (80%)Downloading (85%)Downloading (90%)Downloading (95%)Downloading (100%)
10-Sep-2019 23:02:54   - Installing symfony/event-dispatcher (v2.8.50): Downloading (connecting...)Downloading (0%)           Downloading (5%)Downloading (10%)Downloading (95%)Downloading (100%)
10-Sep-2019 23:02:55   - Installing psr/log (1.1.0): Downloading (connecting...)Downloading (0%)           Downloading (65%)Downloading (90%)Downloading (100%)
10-Sep-2019 23:02:56   - Installing symfony/debug (v2.8.50): Downloading (connecting...)Downloading (0%)           Downloading (15%)Downloading (25%)Downloading (30%)Downloading (55%)Downloading (65%)Downloading (75%)Downloading (80%)Downloading (90%)Downloading (100%)
10-Sep-2019 23:02:56   - Installing symfony/http-kernel (v2.8.51): Downloading (connecting...)Downloading (100%)         
10-Sep-2019 23:02:57   - Installing symfony/dependency-injection (v2.8.50): Downloading (connecting...)Downloading (100%)         
10-Sep-2019 23:02:58   - Installing zendframework/zend-stdlib (2.5.1): Downloading (connecting...)Downloading (100%)         
10-Sep-2019 23:02:58   - Installing zendframework/zend-eventmanager (2.5.1): Downloading (connecting...)Downloading (100%)         
10-Sep-2019 23:02:58   - Installing zendframework/zend-code (2.5.1): Downloading (connecting...)Downloading (100%)         
10-Sep-2019 23:02:59   - Installing ocramius/proxy-manager (1.0.2): Downloading (connecting...)Downloading (0%)           Downloading (5%)Downloading (10%)Downloading (15%)Downloading (20%)Downloading (25%)Downloading (30%)Downloading (35%)Downloading (40%)Downloading (45%)Downloading (50%)Downloading (55%)Downloading (60%)Downloading (65%)Downloading (70%)Downloading (75%)Downloading (80%)Downloading (85%)Downloading (90%)Downloading (95%)Downloading (100%)
10-Sep-2019 23:03:00   - Installing symfony/proxy-manager-bridge (v2.8.50): Downloading (connecting...)Downloading (100%)         
10-Sep-2019 23:03:00   - Installing symfony/routing (v2.8.50): Downloading (connecting...)Downloading (100%)         
10-Sep-2019 23:03:01   - Installing twig/twig (v1.42.2): Downloading (connecting...)Downloading (0%)           Downloading (5%)Downloading (10%)Downloading (15%)Downloading (20%)Downloading (25%)Downloading (30%)Downloading (35%)Downloading (40%)Downloading (45%)Downloading (50%)Downloading (55%)Downloading (60%)Downloading (65%)Downloading (70%)Downloading (75%)Downloading (80%)Downloading (85%)Downloading (90%)Downloading (95%)Downloading (100%)
10-Sep-2019 23:03:02   - Installing symfony/twig-bridge (v2.8.50): Downloading (connecting...)Downloading (100%)         
10-Sep-2019 23:03:03   - Installing symfony/dom-crawler (v2.8.50): Downloading (connecting...)Downloading (100%)         
10-Sep-2019 23:03:03   - Installing symfony/css-selector (v2.8.50): Downloading (connecting...)Downloading (0%)           Downloading (5%)Downloading (10%)Downloading (25%)Downloading (35%)Downloading (40%)Downloading (45%)Downloading (50%)Downloading (70%)Downloading (75%)Downloading (80%)Downloading (85%)Downloading (100%)
10-Sep-2019 23:03:04   - Installing symfony/browser-kit (v2.8.50): Downloading (connecting...)Downloading (100%)         
10-Sep-2019 23:03:04   - Installing guzzlehttp/guzzle (5.3.3): Downloading (connecting...)Downloading (0%)           Downloading (5%)Downloading (10%)Downloading (15%)Downloading (20%)Downloading (25%)Downloading (30%)Downloading (35%)Downloading (40%)Downloading (45%)Downloading (50%)Downloading (55%)Downloading (60%)Downloading (65%)Downloading (70%)Downloading (75%)Downloading (80%)Downloading (85%)Downloading (90%)Downloading (95%)Downloading (100%)
10-Sep-2019 23:03:05   - Installing fabpot/goutte (v2.0.4): Downloading (connecting...)Downloading (100%)         
10-Sep-2019 23:03:05   - Installing facebook/webdriver (1.1.3): Downloading (connecting...)Downloading (100%)         
10-Sep-2019 23:03:06   - Installing symfony/process (v2.8.50): Downloading (connecting...)Downloading (0%)           Downloading (15%)Downloading (30%)Downloading (45%)Downloading (65%)Downloading (80%)Downloading (95%)Downloading (100%)
10-Sep-2019 23:03:07   - Installing symfony/console (v2.8.50): Downloading (connecting...)Downloading (0%)           Downloading (5%)Downloading (10%)Downloading (15%)Downloading (20%)Downloading (25%)Downloading (30%)Downloading (35%)Downloading (40%)Downloading (45%)Downloading (50%)Downloading (55%)Downloading (60%)Downloading (65%)Downloading (70%)Downloading (75%)Downloading (80%)Downloading (85%)Downloading (90%)Downloading (95%)Downloading (100%)
10-Sep-2019 23:03:07   - Installing laravel/homestead (v2.2.2): Downloading (connecting...)Downloading (100%)         
10-Sep-2019 23:03:08   - Installing phing/phing (2.4.14): Downloading (connecting...)Downloading (100%)         
10-Sep-2019 23:03:09   - Installing phpdocumentor/reflection-docblock (2.0.5): Downloading (connecting...)Downloading (0%)           Downloading (20%)Downloading (30%)Downloading (35%)Downloading (50%)Downloading (65%)Downloading (70%)Downloading (85%)Downloading (95%)Downloading (100%)
10-Sep-2019 23:03:09   - Installing symfony/yaml (v2.8.50): Downloading (connecting...)Downloading (100%)         
10-Sep-2019 23:03:10   - Installing sebastian/version (1.0.6): Downloading (connecting...)Downloading (0%)           Downloading (100%)
10-Sep-2019 23:03:10   - Installing sebastian/global-state (1.1.1): Downloading (connecting...)Downloading (0%)           Downloading (40%)Downloading (70%)Downloading (100%)
10-Sep-2019 23:03:11   - Installing sebastian/recursion-context (1.0.5): Downloading (connecting...)Downloading (0%)           Downloading (35%)Downloading (70%)Downloading (100%)
10-Sep-2019 23:03:11   - Installing sebastian/exporter (1.2.2): Downloading (connecting...)Downloading (0%)           Downloading (100%)
10-Sep-2019 23:03:12   - Installing sebastian/environment (1.3.8): Downloading (connecting...)Downloading (0%)           Downloading (15%)Downloading (30%)Downloading (45%)Downloading (60%)Downloading (75%)Downloading (100%)
10-Sep-2019 23:03:12   - Installing sebastian/diff (1.4.3): Downloading (connecting...)Downloading (0%)           Downloading (35%)Downloading (40%)Downloading (75%)Downloading (100%)
10-Sep-2019 23:03:13   - Installing sebastian/comparator (1.2.4): Downloading (connecting...)Downloading (0%)           Downloading (10%)Downloading (55%)Downloading (65%)Downloading (70%)Downloading (100%)
10-Sep-2019 23:03:13   - Installing phpunit/php-text-template (1.2.1): Downloading (connecting...)Downloading (0%)           Downloading (35%)Downloading (100%)
10-Sep-2019 23:03:13   - Installing doctrine/instantiator (1.0.5): Downloading (connecting...)Downloading (0%)           Downloading (15%)Downloading (30%)Downloading (45%)Downloading (60%)Downloading (85%)Downloading (100%)
10-Sep-2019 23:03:14   - Installing phpunit/phpunit-mock-objects (2.3.8): Downloading (connecting...)Downloading (0%)           Downloading (5%)Downloading (20%)Downloading (25%)Downloading (30%)Downloading (35%)Downloading (40%)Downloading (55%)Downloading (60%)Downloading (65%)Downloading (80%)Downloading (85%)Downloading (90%)Downloading (95%)Downloading (100%)
10-Sep-2019 23:03:15   - Installing phpunit/php-timer (1.0.9): Downloading (connecting...)Downloading (0%)           Downloading (45%)Downloading (90%)Downloading (100%)
10-Sep-2019 23:03:15   - Installing phpunit/php-file-iterator (1.4.5): Downloading (connecting...)Downloading (0%)           Downloading (100%)
10-Sep-2019 23:03:16   - Installing phpunit/php-token-stream (1.4.12): Downloading (connecting...)Downloading (0%)           Downloading (5%)Downloading (10%)Downloading (15%)Downloading (20%)Downloading (100%)
10-Sep-2019 23:03:16   - Installing phpunit/php-code-coverage (2.2.4): Downloading (connecting...)Downloading (0%)           Downloading (5%)Downloading (10%)Downloading (15%)Downloading (20%)Downloading (25%)Downloading (30%)Downloading (35%)Downloading (40%)Downloading (45%)Downloading (50%)Downloading (55%)Downloading (60%)Downloading (65%)Downloading (70%)Downloading (75%)Downloading (80%)Downloading (85%)Downloading (90%)Downloading (95%)Downloading (100%)
10-Sep-2019 23:03:17   - Installing phpspec/prophecy (1.8.1): Downloading (connecting...)Downloading (0%)           Downloading (15%)Downloading (25%)Downloading (35%)Downloading (40%)Downloading (50%)Downloading (60%)Downloading (70%)Downloading (80%)Downloading (85%)Downloading (90%)Downloading (95%)Downloading (100%)
10-Sep-2019 23:03:17   - Installing phpunit/phpunit (4.8.36): Downloading (connecting...)Downloading (0%)           Downloading (5%)Downloading (10%)Downloading (15%)Downloading (20%)Downloading (25%)Downloading (30%)Downloading (35%)Downloading (40%)Downloading (45%)Downloading (50%)Downloading (55%)Downloading (60%)Downloading (65%)Downloading (70%)Downloading (75%)Downloading (80%)Downloading (85%)Downloading (90%)Downloading (95%)Downloading (100%)
10-Sep-2019 23:03:18   - Installing phpunit/dbunit (1.3.2): Downloading (connecting...)Downloading (100%)         
10-Sep-2019 23:03:19   - Installing symfony/finder (v2.8.50): Downloading (connecting...)Downloading (100%)         
10-Sep-2019 23:03:19   - Installing pimple/pimple (v1.0.2): Downloading (connecting...)Downloading (100%)         
10-Sep-2019 23:03:20   - Installing nikic/php-parser (v0.9.5): Downloading (connecting...)Downloading (0%)           Downloading (5%)Downloading (10%)Downloading (15%)Downloading (20%)Downloading (25%)Downloading (30%)Downloading (35%)Downloading (40%)Downloading (45%)Downloading (50%)Downloading (55%)Downloading (60%)Downloading (65%)Downloading (70%)Downloading (75%)Downloading (80%)Downloading (85%)Downloading (90%)Downloading (95%)Downloading (100%)
10-Sep-2019 23:03:20   - Installing michelf/php-markdown (1.8.0): Downloading (connecting...)Downloading (0%)           Downloading (10%)Downloading (35%)Downloading (45%)Downloading (75%)Downloading (85%)Downloading (100%)
10-Sep-2019 23:03:21   - Installing sami/sami (v1.4.1): Downloading (connecting...)Downloading (100%)         
10-Sep-2019 23:03:22   - Installing squizlabs/php_codesniffer (2.9.2): Downloading (connecting...)Downloading (0%)           Downloading (5%)Downloading (10%)Downloading (15%)Downloading (20%)Downloading (25%)Downloading (30%)Downloading (35%)Downloading (40%)Downloading (45%)Downloading (50%)Downloading (55%)Downloading (60%)Downloading (65%)Downloading (70%)Downloading (75%)Downloading (80%)Downloading (85%)Downloading (100%)
10-Sep-2019 23:03:23 lusitanian/oauth suggests installing predis/predis (Allows using the Redis storage backend.)
10-Sep-2019 23:03:23 paragonie/random_compat suggests installing ext-libsodium (Provides a modern crypto API that can be used to generate random bytes.)
10-Sep-2019 23:03:23 patchwork/utf8 suggests installing ext-intl (Use Intl for best performance)
10-Sep-2019 23:03:23 patchwork/utf8 suggests installing ext-wfio (Use WFIO for UTF-8 filesystem access on Windows)
10-Sep-2019 23:03:23 s9e/text-formatter suggests installing ext-intl (Allows international URLs to be accepted by the URL filter)
10-Sep-2019 23:03:23 s9e/text-formatter suggests installing ext-xsl (Enables the XSLT renderer)
10-Sep-2019 23:03:23 symfony/http-kernel suggests installing symfony/class-loader
10-Sep-2019 23:03:23 symfony/http-kernel suggests installing symfony/var-dumper
10-Sep-2019 23:03:23 symfony/dependency-injection suggests installing symfony/expression-language (For using expressions in service container configuration)
10-Sep-2019 23:03:23 zendframework/zend-stdlib suggests installing zendframework/zend-filter (To support naming strategy hydrator usage)
10-Sep-2019 23:03:23 zendframework/zend-stdlib suggests installing zendframework/zend-serializer (Zend\Serializer component)
10-Sep-2019 23:03:23 zendframework/zend-stdlib suggests installing zendframework/zend-servicemanager (To support hydrator plugin manager usage)
10-Sep-2019 23:03:23 zendframework/zend-code suggests installing doctrine/common (Doctrine\Common >=2.1 for annotation features)
10-Sep-2019 23:03:23 ocramius/proxy-manager suggests installing ocramius/generated-hydrator (To have very fast object to array to object conversion for ghost objects)
10-Sep-2019 23:03:23 ocramius/proxy-manager suggests installing zendframework/zend-json (To have the JsonRpc adapter (Remote Object feature))
10-Sep-2019 23:03:23 ocramius/proxy-manager suggests installing zendframework/zend-soap (To have the Soap adapter (Remote Object feature))
10-Sep-2019 23:03:23 ocramius/proxy-manager suggests installing zendframework/zend-xmlrpc (To have the XmlRpc adapter (Remote Object feature))
10-Sep-2019 23:03:23 symfony/routing suggests installing doctrine/annotations (For using the annotation loader)
10-Sep-2019 23:03:23 symfony/routing suggests installing symfony/expression-language (For using expression matching)
10-Sep-2019 23:03:23 symfony/twig-bridge suggests installing symfony/asset (For using the AssetExtension)
10-Sep-2019 23:03:23 symfony/twig-bridge suggests installing symfony/expression-language (For using the ExpressionExtension)
10-Sep-2019 23:03:23 symfony/twig-bridge suggests installing symfony/form (For using the FormExtension)
10-Sep-2019 23:03:23 symfony/twig-bridge suggests installing symfony/security (For using the SecurityExtension)
10-Sep-2019 23:03:23 symfony/twig-bridge suggests installing symfony/stopwatch (For using the StopwatchExtension)
10-Sep-2019 23:03:23 symfony/twig-bridge suggests installing symfony/templating (For using the TwigEngine)
10-Sep-2019 23:03:23 symfony/twig-bridge suggests installing symfony/translation (For using the TranslationExtension)
10-Sep-2019 23:03:23 symfony/twig-bridge suggests installing symfony/var-dumper (For using the DumpExtension)
10-Sep-2019 23:03:23 facebook/webdriver suggests installing phpdocumentor/phpdocumentor (2.*)
10-Sep-2019 23:03:23 symfony/console suggests installing psr/log-implementation (For using the console logger)
10-Sep-2019 23:03:23 phpdocumentor/reflection-docblock suggests installing dflydev/markdown (~1.0)
10-Sep-2019 23:03:23 phpdocumentor/reflection-docblock suggests installing erusev/parsedown (~1.0)
10-Sep-2019 23:03:23 sebastian/global-state suggests installing ext-uopz (*)
10-Sep-2019 23:03:23 phpunit/phpunit-mock-objects suggests installing ext-soap (*)
10-Sep-2019 23:03:23 phpunit/phpunit suggests installing phpunit/php-invoker (~1.1)
10-Sep-2019 23:03:23 Package phpunit/phpunit-mock-objects is abandoned, you should avoid using it. No replacement was suggested.
10-Sep-2019 23:03:23 Package phpunit/dbunit is abandoned, you should avoid using it. No replacement was suggested.
10-Sep-2019 23:03:23 Package sami/sami is abandoned, you should avoid using it. No replacement was suggested.
10-Sep-2019 23:03:23 Generating autoload files
10-Sep-2019 23:03:23
10-Sep-2019 23:03:23 Notice: A non well formed numeric value encountered in /data/phpBB/vendor/phing/phing/classes/phing/Phing.php on line 1305
10-Sep-2019 23:03:23
10-Sep-2019 23:03:23 Call Stack:
10-Sep-2019 23:03:23     0.0003     352256   1. {main}() /data/phpBB/vendor/phing/phing/bin/phing:0
10-Sep-2019 23:03:23     0.0006     359304   2. require_once('/data/phpBB/vendor/phing/phing/bin/phing.php') /data/phpBB/vendor/phing/phing/bin/phing:18
10-Sep-2019 23:03:23     0.0301    3352736   3. Phing::startup() /data/phpBB/vendor/phing/phing/bin/phing.php:33
10-Sep-2019 23:03:23     0.0304    3426768   4. Phing::setIni() /data/phpBB/vendor/phing/phing/classes/phing/Phing.php:1393
10-Sep-2019 23:03:23     0.0304    3427008   5. Phing::convertShorthand() /data/phpBB/vendor/phing/phing/classes/phing/Phing.php:1335
10-Sep-2019 23:03:23
10-Sep-2019 23:03:23 Buildfile: /data/build/build.xml
10-Sep-2019 23:03:23
10-Sep-2019 23:03:23 phpBB > clean:
10-Sep-2019 23:03:23
10-Sep-2019 23:03:23    [delete] Directory /data/build/logs does not exist or is not a directory.
10-Sep-2019 23:03:23    [delete] Directory /data/build/api does not exist or is not a directory.
10-Sep-2019 23:03:23    [delete] Directory /data/build/codebrowser does not exist or is not a directory.
10-Sep-2019 23:03:23    [delete] Directory /data/build/coverage does not exist or is not a directory.
10-Sep-2019 23:03:23    [delete] Directory /data/build/cpd does not exist or is not a directory.
10-Sep-2019 23:03:23    [delete] Directory /data/build/dependencies does not exist or is not a directory.
10-Sep-2019 23:03:23    [delete] Directory /data/build/new_version does not exist or is not a directory.
10-Sep-2019 23:03:23    [delete] Directory /data/build/old_versions does not exist or is not a directory.
10-Sep-2019 23:03:23    [delete] Directory /data/build/save does not exist or is not a directory.
10-Sep-2019 23:03:23
10-Sep-2019 23:03:23 phpBB > prepare:
10-Sep-2019 23:03:23
10-Sep-2019 23:03:23     [mkdir] Created dir: /data/build/logs
10-Sep-2019 23:03:23     [mkdir] Created dir: /data/build/api
10-Sep-2019 23:03:23     [mkdir] Created dir: /data/build/codebrowser
10-Sep-2019 23:03:23     [mkdir] Created dir: /data/build/coverage
10-Sep-2019 23:03:23     [mkdir] Created dir: /data/build/cpd
10-Sep-2019 23:03:23     [mkdir] Created dir: /data/build/dependencies
10-Sep-2019 23:03:23     [mkdir] Created dir: /data/build/new_version
10-Sep-2019 23:03:23     [mkdir] Created dir: /data/build/new_version/files
10-Sep-2019 23:03:23     [mkdir] Created dir: /data/build/new_version/patches
10-Sep-2019 23:03:23     [mkdir] Created dir: /data/build/new_version/release_files
10-Sep-2019 23:03:23     [mkdir] Created dir: /data/build/new_version/update
10-Sep-2019 23:03:23     [mkdir] Created dir: /data/build/old_versions
10-Sep-2019 23:03:23     [mkdir] Created dir: /data/build/save
10-Sep-2019 23:03:23
10-Sep-2019 23:03:23 BUILD FINISHED
10-Sep-2019 23:03:23
10-Sep-2019 23:03:23 Total time: 0.0776 seconds
10-Sep-2019 23:03:23
10-Sep-2019 23:03:23 Finished task 'Prepare directory' with result: Success
10-Sep-2019 23:03:23 Skipping execution of task 'Run sniffs' as it is disabled
10-Sep-2019 23:03:23
Substituting variable: ${bamboo.working.directory} with /home/bamboo/xml-data/build-dir/PHPBB3-PR-JOB1
10-Sep-2019 23:03:23 Starting task 'Run sniffs' of type 'com.atlassian.bamboo.plugins.bamboo-docker-plugin:task.docker.cli'
10-Sep-2019 23:03:23 Running image name (phpbb:php-7.1)
10-Sep-2019 23:03:23
Beginning to execute external process for build 'phpBB3 - Pull Requests - Build and Test Job #9577 (PHPBB3-PR-JOB1-9577)'
... running command line:
/usr/bin/docker run --volume /home/bamboo/xml-data/build-dir/PHPBB3-PR-JOB1:/data --workdir /data/build --rm -u=991 phpbb:php-7.1 ../phpBB/vendor/bin/phing sniff
... in: /home/bamboo/xml-data/build-dir/PHPBB3-PR-JOB1
... using extra environment variables:
bamboo_planRepository_1_branch=3.1.x
bamboo_planRepository_1_branchDisplayName=3.1.x
bamboo_repository_revision_number=dc8ff9da28b8ab4ad11c7ea94cca526f17c87fe5
bamboo_PRref=3.2.x
bamboo_resultsUrl=https://bamboo.phpbb.com/browse/PHPBB3-PR-JOB1-9577
bamboo_capability_system_builder_command_Git=/usr/bin/git
bamboo_repository_75956235_git_username=bantu
bamboo_build_working_directory=/home/bamboo/xml-data/build-dir/PHPBB3-PR-JOB1
bamboo_planRepository_1_name=phpBB Ascraeus
bamboo_buildKey=PHPBB3-PR-JOB1
bamboo_capability_phpbb_tests=true
bamboo_shortPlanName=Pull Requests
bamboo_capability_system_builder_command_fop=/usr/bin/fop
bamboo_capability_dbms_sqlite_2=true
bamboo_planRepository_name=phpBB Ascraeus
bamboo_PRnumber=5685
bamboo_buildNumber=9577
bamboo_repository_75956235_git_repositoryUrl=https://github.com/phpbb/phpbb.git
bamboo_capability_system_builder_phpunit_PHPUnit=/usr/bin/phpunit
bamboo_shortJobName=Build and Test Job
bamboo_buildResultsUrl=https://bamboo.phpbb.com/browse/PHPBB3-PR-JOB1-9577
bamboo_repository_75956235_branch_name=3.1.x
bamboo_planRepository_repositoryUrl=https://github.com/phpbb/phpbb.git
bamboo_agentId=131073
bamboo_planName=phpBB3 - Pull Requests
bamboo_build_commandline_com_atlassian_bamboo_plugins_scripttask_task_builder_script_7=/bin/sh /home/bamboo/temp/PHPBB3-PR-JOB1-9577-ScriptBuildTask-5734615447471524700.sh
bamboo_shortPlanKey=PR
bamboo_shortJobKey=JOB1
bamboo_capability_dbms_mysql_55=true
bamboo_capability_system_jdk_JDK_1_7_0_65=/usr/lib/jvm/java-7-openjdk-amd64
bamboo_planRepository_revision=dc8ff9da28b8ab4ad11c7ea94cca526f17c87fe5
bamboo_buildTimeStamp=2019-09-10T23:02:34.725Z
bamboo_repository_previous_revision_number=dc8ff9da28b8ab4ad11c7ea94cca526f17c87fe5
bamboo_capability_system_jdk_JDK_1_6_0_16=/usr/lib/jvm/java-6-sun-1.6.0.16
bamboo_capability_system_builder_mvn2_Maven_2=/usr/share/maven2
bamboo_planRepository_previousRevision=dc8ff9da28b8ab4ad11c7ea94cca526f17c87fe5
bamboo_build_commandline_com_atlassian_bamboo_plugins_scripttask_task_builder_script_4=/bin/sh /home/bamboo/temp/PHPBB3-PR-JOB1-9577-ScriptBuildTask-5100357543160451971.sh
bamboo_repository_git_branch=3.1.x
bamboo_buildResultKey=PHPBB3-PR-JOB1-9577
bamboo_repository_branch_name=3.1.x
bamboo_buildPlanName=phpBB3 - Pull Requests - Build and Test Job
bamboo_planRepository_1_revision=dc8ff9da28b8ab4ad11c7ea94cca526f17c87fe5
bamboo_repository_name=phpBB Ascraeus
bamboo_buildFailed=false
bamboo_capability_system_docker_executable=/usr/bin/docker
bamboo_build_commandline_com_atlassian_bamboo_plugins_bamboo_docker_plugin_task_docker_cli_12=/usr/bin/docker run --volume /home/bamboo/xml-data/build-dir/PHPBB3-PR-JOB1:/data --workdir /data/phpBB --rm -e HOME=/home/bamboo -u=991 phpbb:php-7.1 /bin/bash -c php ../composer.phar install --dev; cd ../build; ../phpBB/vendor/bin/phing clean prepare
bamboo_build_commandline_com_atlassian_bamboo_plugins_bamboo_docker_plugin_task_docker_cli_13=/usr/bin/docker build --force-rm=true --tag=phpbb:php-7.1 /home/bamboo/xml-data/build-dir/PHPBB3-PR-JOB1
bamboo_planRepository_branch=3.1.x
bamboo_agentWorkingDirectory=/home/bamboo/xml-data/build-dir
bamboo_capability_system_git_executable=/usr/bin/git
bamboo_capability_system_builder_phpunit_PHPUnit_3_4=/usr/bin/phpunit
bamboo_repository_git_username=bantu
bamboo_planRepository_1_previousRevision=dc8ff9da28b8ab4ad11c7ea94cca526f17c87fe5
bamboo_repository_75956235_revision_number=dc8ff9da28b8ab4ad11c7ea94cca526f17c87fe5
bamboo_planRepository_branchDisplayName=3.1.x
bamboo_planRepository_1_type=gitv2
bamboo_planRepository_branchName=3.1.x
bamboo_repository_75956235_previous_revision_number=dc8ff9da28b8ab4ad11c7ea94cca526f17c87fe5
bamboo_capability_system_jdk_JDK=/usr/lib/jvm/java-6-sun
bamboo_plan_storageTag=PHPBB3-PR
bamboo_hg_cache_directory=/home/bamboo/xml-data/build-dir/_hg-repositories-cache
bamboo_planRepository_1_username=bantu
bamboo_planRepository_type=gitv2
bamboo_git_cache_directory=/home/bamboo/xml-data/build-dir/_git-repositories-cache
bamboo_ManualBuildTriggerReason_userName=Build Robot
bamboo_repository_git_repositoryUrl=https://github.com/phpbb/phpbb.git
bamboo_repository_75956235_git_branch=3.1.x
bamboo_capability_system_builder_ant_Ant=/usr/share/ant
bamboo_repository_75956235_name=phpBB Ascraeus
bamboo_tmp_directory=/home/bamboo/temp
bamboo_working_directory=/home/bamboo/xml-data/build-dir/PHPBB3-PR-JOB1
bamboo_planKey=PHPBB3-PR
bamboo_capability_local=true
bamboo_planRepository_1_repositoryUrl=https://github.com/phpbb/phpbb.git
bamboo_planRepository_username=bantu
bamboo_capability_system_jdk_JDK_1_6=/usr/lib/jvm/java-6-sun
bamboo_capability_system_jdk_JDK_1_7=/usr/lib/jvm/java-7-openjdk-amd64
bamboo_planRepository_1_branchName=3.1.x
10-Sep-2019 23:03:24
10-Sep-2019 23:03:24 Notice: A non well formed numeric value encountered in /data/phpBB/vendor/phing/phing/classes/phing/Phing.php on line 1305
10-Sep-2019 23:03:24
10-Sep-2019 23:03:24 Call Stack:
10-Sep-2019 23:03:24     0.0002     351120   1. {main}() /data/phpBB/vendor/phing/phing/bin/phing:0
10-Sep-2019 23:03:24     0.0005     358168   2. require_once('/data/phpBB/vendor/phing/phing/bin/phing.php') /data/phpBB/vendor/phing/phing/bin/phing:18
10-Sep-2019 23:03:24     0.0305    3351600   3. Phing::startup() /data/phpBB/vendor/phing/phing/bin/phing.php:33
10-Sep-2019 23:03:24     0.0309    3425624   4. Phing::setIni() /data/phpBB/vendor/phing/phing/classes/phing/Phing.php:1393
10-Sep-2019 23:03:24     0.0309    3425864   5. Phing::convertShorthand() /data/phpBB/vendor/phing/phing/classes/phing/Phing.php:1335
10-Sep-2019 23:03:24
10-Sep-2019 23:03:24 Buildfile: /data/build/build.xml
10-Sep-2019 23:03:24
10-Sep-2019 23:03:24 phpBB > sniff:
10-Sep-2019 23:03:24
10-Sep-2019 23:03:29 ............................................................  60 / 724 (8%)
10-Sep-2019 23:03:30 ............................................................ 120 / 724 (17%)
10-Sep-2019 23:03:30 ............................................................ 180 / 724 (25%)
10-Sep-2019 23:03:31 ............................................................ 240 / 724 (33%)
10-Sep-2019 23:03:33 ............................................................ 300 / 724 (41%)
10-Sep-2019 23:03:37 ............................................................ 360 / 724 (50%)
10-Sep-2019 23:03:40 ............................................................ 420 / 724 (58%)
10-Sep-2019 23:03:42 ............................................................ 480 / 724 (66%)
10-Sep-2019 23:03:45 ............................................................ 540 / 724 (75%)
10-Sep-2019 23:03:47 ............................................................ 600 / 724 (83%)
10-Sep-2019 23:03:50 ............................................................ 660 / 724 (91%)
10-Sep-2019 23:03:52 ............................................................ 720 / 724 (99%)
10-Sep-2019 23:03:52 ....
10-Sep-2019 23:03:52
10-Sep-2019 23:03:52 Time: 27.76 secs; Memory: 70Mb
10-Sep-2019 23:03:52
10-Sep-2019 23:03:56 ............................................................  60 / 206 (29%)
10-Sep-2019 23:04:06 ............................................................ 120 / 206 (58%)
10-Sep-2019 23:04:14 ............................................................ 180 / 206 (87%)
10-Sep-2019 23:04:17 ..........................
10-Sep-2019 23:04:17
10-Sep-2019 23:04:17 Time: 25.52 secs; Memory: 40Mb
10-Sep-2019 23:04:17
10-Sep-2019 23:04:18
10-Sep-2019 23:04:18
10-Sep-2019 23:04:18 Time: 14ms; Memory: 4Mb
10-Sep-2019 23:04:18
10-Sep-2019 23:04:18
10-Sep-2019 23:04:18 BUILD FINISHED
10-Sep-2019 23:04:18
10-Sep-2019 23:04:18 Total time: 53.5134 seconds
10-Sep-2019 23:04:18
10-Sep-2019 23:04:18 Finished task 'Run sniffs' with result: Success
10-Sep-2019 23:04:18 Skipping execution of task 'Run tests' as it is disabled
10-Sep-2019 23:04:18
Substituting variable: ${bamboo.working.directory} with /home/bamboo/xml-data/build-dir/PHPBB3-PR-JOB1
10-Sep-2019 23:04:18 Starting task 'Run tests' of type 'com.atlassian.bamboo.plugins.bamboo-docker-plugin:task.docker.cli'
10-Sep-2019 23:04:18 Running image name (phpbb:php-7.1)
10-Sep-2019 23:04:18
Beginning to execute external process for build 'phpBB3 - Pull Requests - Build and Test Job #9577 (PHPBB3-PR-JOB1-9577)'
... running command line:
/usr/bin/docker run --volume /home/bamboo/xml-data/build-dir/PHPBB3-PR-JOB1:/data --workdir /data --rm -u=991 -t phpbb:php-7.1 /bin/bash -c phpBB/vendor/bin/phpunit --log-junit build/logs/phpunit.xml
... in: /home/bamboo/xml-data/build-dir/PHPBB3-PR-JOB1
... using extra environment variables:
bamboo_planRepository_1_branch=3.1.x
bamboo_planRepository_1_branchDisplayName=3.1.x
bamboo_repository_revision_number=dc8ff9da28b8ab4ad11c7ea94cca526f17c87fe5
bamboo_PRref=3.2.x
bamboo_resultsUrl=https://bamboo.phpbb.com/browse/PHPBB3-PR-JOB1-9577
bamboo_capability_system_builder_command_Git=/usr/bin/git
bamboo_repository_75956235_git_username=bantu
bamboo_build_working_directory=/home/bamboo/xml-data/build-dir/PHPBB3-PR-JOB1
bamboo_planRepository_1_name=phpBB Ascraeus
bamboo_buildKey=PHPBB3-PR-JOB1
bamboo_capability_phpbb_tests=true
bamboo_shortPlanName=Pull Requests
bamboo_capability_system_builder_command_fop=/usr/bin/fop
bamboo_capability_dbms_sqlite_2=true
bamboo_planRepository_name=phpBB Ascraeus
bamboo_PRnumber=5685
bamboo_buildNumber=9577
bamboo_repository_75956235_git_repositoryUrl=https://github.com/phpbb/phpbb.git
bamboo_capability_system_builder_phpunit_PHPUnit=/usr/bin/phpunit
bamboo_shortJobName=Build and Test Job
bamboo_buildResultsUrl=https://bamboo.phpbb.com/browse/PHPBB3-PR-JOB1-9577
bamboo_repository_75956235_branch_name=3.1.x
bamboo_planRepository_repositoryUrl=https://github.com/phpbb/phpbb.git
bamboo_agentId=131073
bamboo_planName=phpBB3 - Pull Requests
bamboo_build_commandline_com_atlassian_bamboo_plugins_scripttask_task_builder_script_7=/bin/sh /home/bamboo/temp/PHPBB3-PR-JOB1-9577-ScriptBuildTask-5734615447471524700.sh
bamboo_shortPlanKey=PR
bamboo_shortJobKey=JOB1
bamboo_capability_dbms_mysql_55=true
bamboo_capability_system_jdk_JDK_1_7_0_65=/usr/lib/jvm/java-7-openjdk-amd64
bamboo_planRepository_revision=dc8ff9da28b8ab4ad11c7ea94cca526f17c87fe5
bamboo_buildTimeStamp=2019-09-10T23:02:34.725Z
bamboo_repository_previous_revision_number=dc8ff9da28b8ab4ad11c7ea94cca526f17c87fe5
bamboo_capability_system_jdk_JDK_1_6_0_16=/usr/lib/jvm/java-6-sun-1.6.0.16
bamboo_capability_system_builder_mvn2_Maven_2=/usr/share/maven2
bamboo_planRepository_previousRevision=dc8ff9da28b8ab4ad11c7ea94cca526f17c87fe5
bamboo_build_commandline_com_atlassian_bamboo_plugins_scripttask_task_builder_script_4=/bin/sh /home/bamboo/temp/PHPBB3-PR-JOB1-9577-ScriptBuildTask-5100357543160451971.sh
bamboo_repository_git_branch=3.1.x
bamboo_buildResultKey=PHPBB3-PR-JOB1-9577
bamboo_repository_branch_name=3.1.x
bamboo_buildPlanName=phpBB3 - Pull Requests - Build and Test Job
bamboo_planRepository_1_revision=dc8ff9da28b8ab4ad11c7ea94cca526f17c87fe5
bamboo_repository_name=phpBB Ascraeus
bamboo_buildFailed=false
bamboo_capability_system_docker_executable=/usr/bin/docker
bamboo_build_commandline_com_atlassian_bamboo_plugins_bamboo_docker_plugin_task_docker_cli_11=/usr/bin/docker run --volume /home/bamboo/xml-data/build-dir/PHPBB3-PR-JOB1:/data --workdir /data/build --rm -u=991 phpbb:php-7.1 ../phpBB/vendor/bin/phing sniff
bamboo_build_commandline_com_atlassian_bamboo_plugins_bamboo_docker_plugin_task_docker_cli_12=/usr/bin/docker run --volume /home/bamboo/xml-data/build-dir/PHPBB3-PR-JOB1:/data --workdir /data/phpBB --rm -e HOME=/home/bamboo -u=991 phpbb:php-7.1 /bin/bash -c php ../composer.phar install --dev; cd ../build; ../phpBB/vendor/bin/phing clean prepare
bamboo_build_commandline_com_atlassian_bamboo_plugins_bamboo_docker_plugin_task_docker_cli_13=/usr/bin/docker build --force-rm=true --tag=phpbb:php-7.1 /home/bamboo/xml-data/build-dir/PHPBB3-PR-JOB1
bamboo_planRepository_branch=3.1.x
bamboo_agentWorkingDirectory=/home/bamboo/xml-data/build-dir
bamboo_capability_system_git_executable=/usr/bin/git
bamboo_capability_system_builder_phpunit_PHPUnit_3_4=/usr/bin/phpunit
bamboo_repository_git_username=bantu
bamboo_planRepository_1_previousRevision=dc8ff9da28b8ab4ad11c7ea94cca526f17c87fe5
bamboo_repository_75956235_revision_number=dc8ff9da28b8ab4ad11c7ea94cca526f17c87fe5
bamboo_planRepository_branchDisplayName=3.1.x
bamboo_planRepository_1_type=gitv2
bamboo_planRepository_branchName=3.1.x
bamboo_repository_75956235_previous_revision_number=dc8ff9da28b8ab4ad11c7ea94cca526f17c87fe5
bamboo_capability_system_jdk_JDK=/usr/lib/jvm/java-6-sun
bamboo_plan_storageTag=PHPBB3-PR
bamboo_hg_cache_directory=/home/bamboo/xml-data/build-dir/_hg-repositories-cache
bamboo_planRepository_1_username=bantu
bamboo_planRepository_type=gitv2
bamboo_git_cache_directory=/home/bamboo/xml-data/build-dir/_git-repositories-cache
bamboo_ManualBuildTriggerReason_userName=Build Robot
bamboo_repository_git_repositoryUrl=https://github.com/phpbb/phpbb.git
bamboo_repository_75956235_git_branch=3.1.x
bamboo_capability_system_builder_ant_Ant=/usr/share/ant
bamboo_repository_75956235_name=phpBB Ascraeus
bamboo_tmp_directory=/home/bamboo/temp
bamboo_working_directory=/home/bamboo/xml-data/build-dir/PHPBB3-PR-JOB1
bamboo_planKey=PHPBB3-PR
bamboo_capability_local=true
bamboo_planRepository_1_repositoryUrl=https://github.com/phpbb/phpbb.git
bamboo_planRepository_username=bantu
bamboo_capability_system_jdk_JDK_1_6=/usr/lib/jvm/java-6-sun
bamboo_capability_system_jdk_JDK_1_7=/usr/lib/jvm/java-7-openjdk-amd64
bamboo_planRepository_1_branchName=3.1.x
10-Sep-2019 23:04:19
10-Sep-2019 23:04:19 Parse error: syntax error, unexpected ';', expecting ',' or ')' in /data/tests/functional/posting_test.php on line 52
10-Sep-2019 23:04:19
10-Sep-2019 23:04:20 Error occurred while running Task 'Run tests(10)' of type com.atlassian.bamboo.plugins.bamboo-docker-plugin:task.docker.cli.
10-Sep-2019 23:04:20 com.atlassian.bamboo.task.TaskException: Failed to execute task
10-Sep-2019 23:04:20         at com.atlassian.bamboo.plugins.docker.service.RunService.execute(RunService.java:75)
10-Sep-2019 23:04:20         at com.atlassian.bamboo.plugins.docker.tasks.cli.DockerCliTask.execute(DockerCliTask.java:70)
10-Sep-2019 23:04:20         at com.atlassian.bamboo.task.TaskExecutorImpl.lambda$executeTasks$3(TaskExecutorImpl.java:285)
10-Sep-2019 23:04:20         at com.atlassian.bamboo.task.TaskExecutorImpl.executeTaskWithPrePostActions(TaskExecutorImpl.java:224)
10-Sep-2019 23:04:20         at com.atlassian.bamboo.task.TaskExecutorImpl.executeTasks(TaskExecutorImpl.java:285)
10-Sep-2019 23:04:20         at com.atlassian.bamboo.task.TaskExecutorImpl.execute(TaskExecutorImpl.java:112)
10-Sep-2019 23:04:20         at com.atlassian.bamboo.build.pipeline.tasks.ExecuteBuildTask.call(ExecuteBuildTask.java:71)
10-Sep-2019 23:04:20         at com.atlassian.bamboo.v2.build.agent.DefaultBuildAgent.executeBuildPhase(DefaultBuildAgent.java:203)
10-Sep-2019 23:04:20         at com.atlassian.bamboo.v2.build.agent.DefaultBuildAgent.build(DefaultBuildAgent.java:175)
10-Sep-2019 23:04:20         at com.atlassian.bamboo.v2.build.agent.BuildAgentControllerImpl.lambda$waitAndPerformBuild$0(BuildAgentControllerImpl.java:122)
10-Sep-2019 23:04:20         at com.atlassian.bamboo.variable.CustomVariableContextImpl.withVariableSubstitutor(CustomVariableContextImpl.java:185)
10-Sep-2019 23:04:20         at com.atlassian.bamboo.v2.build.agent.BuildAgentControllerImpl.waitAndPerformBuild(BuildAgentControllerImpl.java:117)
10-Sep-2019 23:04:20         at com.atlassian.bamboo.v2.build.agent.DefaultBuildAgent$1.run(DefaultBuildAgent.java:126)
10-Sep-2019 23:04:20         at com.atlassian.bamboo.utils.BambooRunnables$1.run(BambooRunnables.java:48)
10-Sep-2019 23:04:20         at com.atlassian.bamboo.security.ImpersonationHelper.runWith(ImpersonationHelper.java:26)
10-Sep-2019 23:04:20         at com.atlassian.bamboo.security.ImpersonationHelper.runWithSystemAuthority(ImpersonationHelper.java:17)
10-Sep-2019 23:04:20         at com.atlassian.bamboo.security.ImpersonationHelper$1.run(ImpersonationHelper.java:41)
10-Sep-2019 23:04:20         at java.lang.Thread.run(Thread.java:748)
10-Sep-2019 23:04:20 Caused by: com.atlassian.bamboo.docker.DockerException: Error running Docker run command
10-Sep-2019 23:04:20         at com.atlassian.bamboo.docker.DockerContainerServiceImpl.run(DockerContainerServiceImpl.java:118)
10-Sep-2019 23:04:20         at sun.reflect.GeneratedMethodAccessor2260.invoke(Unknown Source)
10-Sep-2019 23:04:20         at sun.reflect.DelegatingMethodAccessorImpl.invoke(DelegatingMethodAccessorImpl.java:43)
10-Sep-2019 23:04:20         at java.lang.reflect.Method.invoke(Method.java:498)
10-Sep-2019 23:04:20         at com.atlassian.plugin.util.ContextClassLoaderSettingInvocationHandler.invoke(ContextClassLoaderSettingInvocationHandler.java:26)
10-Sep-2019 23:04:20         at com.sun.proxy.$Proxy401.run(Unknown Source)
10-Sep-2019 23:04:20         at sun.reflect.GeneratedMethodAccessor2260.invoke(Unknown Source)
10-Sep-2019 23:04:20         at sun.reflect.DelegatingMethodAccessorImpl.invoke(DelegatingMethodAccessorImpl.java:43)
10-Sep-2019 23:04:20         at java.lang.reflect.Method.invoke(Method.java:498)
10-Sep-2019 23:04:20         at org.springframework.aop.support.AopUtils.invokeJoinpointUsingReflection(AopUtils.java:302)
10-Sep-2019 23:04:20         at org.eclipse.gemini.blueprint.service.importer.support.internal.aop.ServiceInvoker.doInvoke(ServiceInvoker.java:56)
10-Sep-2019 23:04:20         at org.eclipse.gemini.blueprint.service.importer.support.internal.aop.ServiceInvoker.invoke(ServiceInvoker.java:60)
10-Sep-2019 23:04:20         at org.springframework.aop.framework.ReflectiveMethodInvocation.proceed(ReflectiveMethodInvocation.java:179)
10-Sep-2019 23:04:20         at org.springframework.aop.support.DelegatingIntroductionInterceptor.doProceed(DelegatingIntroductionInterceptor.java:133)
10-Sep-2019 23:04:20         at org.springframework.aop.support.DelegatingIntroductionInterceptor.invoke(DelegatingIntroductionInterceptor.java:121)
10-Sep-2019 23:04:20         at org.springframework.aop.framework.ReflectiveMethodInvocation.proceed(ReflectiveMethodInvocation.java:179)
10-Sep-2019 23:04:20         at org.eclipse.gemini.blueprint.service.util.internal.aop.ServiceTCCLInterceptor.invokeUnprivileged(ServiceTCCLInterceptor.java:70)
10-Sep-2019 23:04:20         at org.eclipse.gemini.blueprint.service.util.internal.aop.ServiceTCCLInterceptor.invoke(ServiceTCCLInterceptor.java:53)
10-Sep-2019 23:04:20         at org.springframework.aop.framework.ReflectiveMethodInvocation.proceed(ReflectiveMethodInvocation.java:179)
10-Sep-2019 23:04:20         at org.eclipse.gemini.blueprint.service.importer.support.LocalBundleContextAdvice.invoke(LocalBundleContextAdvice.java:57)
10-Sep-2019 23:04:20         at org.springframework.aop.framework.ReflectiveMethodInvocation.proceed(ReflectiveMethodInvocation.java:179)
10-Sep-2019 23:04:20         at org.springframework.aop.support.DelegatingIntroductionInterceptor.doProceed(DelegatingIntroductionInterceptor.java:133)
10-Sep-2019 23:04:20         at org.springframework.aop.support.DelegatingIntroductionInterceptor.invoke(DelegatingIntroductionInterceptor.java:121)
10-Sep-2019 23:04:20         at org.springframework.aop.framework.ReflectiveMethodInvocation.proceed(ReflectiveMethodInvocation.java:179)
10-Sep-2019 23:04:20         at org.springframework.aop.framework.JdkDynamicAopProxy.invoke(JdkDynamicAopProxy.java:207)
10-Sep-2019 23:04:20         at com.sun.proxy.$Proxy662.run(Unknown Source)
10-Sep-2019 23:04:20         at com.atlassian.bamboo.plugins.docker.client.DockerCmd.run(DockerCmd.java:51)
10-Sep-2019 23:04:20         at com.atlassian.bamboo.plugins.docker.service.RunService.execute(RunService.java:64)
10-Sep-2019 23:04:20         ... 17 more
10-Sep-2019 23:04:20 Caused by: com.atlassian.utils.process.ProcessException: Error executing /usr/bin/docker run --volume /home/bamboo/xml-data/build-dir/PHPBB3-PR-JOB1:/data --workdir /data --rm -u=991 -t phpbb:php-7.1 /bin/bash -c "phpBB/vendor/bin/phpunit --log-junit build/logs/phpunit.xml"
10-Sep-2019 23:04:20         at com.atlassian.bamboo.docker.DockerContainerServiceImpl.execute(DockerContainerServiceImpl.java:252)
10-Sep-2019 23:04:20         at com.atlassian.bamboo.docker.DockerContainerServiceImpl.run(DockerContainerServiceImpl.java:106)
10-Sep-2019 23:04:20         ... 44 more
10-Sep-2019 23:04:20 Starting task 'Parsing test results produced by script' of type 'com.atlassian.bamboo.plugins.testresultparser:task.testresultparser.junit'
10-Sep-2019 23:04:20 Parsing test results under /home/bamboo/xml-data/build-dir/PHPBB3-PR-JOB1...
10-Sep-2019 23:04:20 Failing task since test cases were expected but none were found.
10-Sep-2019 23:04:20 Finished task 'Parsing test results produced by script' with result: Failed
10-Sep-2019 23:04:20
Substituting variable: ${bamboo.PRnumber} with 5685
10-Sep-2019 23:04:20
Substituting variable: ${bamboo.buildResultsUrl} with https://bamboo.phpbb.com/browse/PHPBB3-PR-JOB1-9577
10-Sep-2019 23:04:20
Substituting variable: ${bamboo.buildResultsUrl} with https://bamboo.phpbb.com/browse/PHPBB3-PR-JOB1-9577
10-Sep-2019 23:04:20 Starting task 'Set result build status' of type 'com.atlassian.bamboo.plugins.scripttask:task.builder.script'
10-Sep-2019 23:04:20
Beginning to execute external process for build 'phpBB3 - Pull Requests - Build and Test Job #9577 (PHPBB3-PR-JOB1-9577)'
... running command line:
/bin/sh /home/bamboo/temp/PHPBB3-PR-JOB1-9577-ScriptBuildTask-8352367018717171412.sh
... in: /home/bamboo/xml-data/build-dir/PHPBB3-PR-JOB1
... using extra environment variables:
bamboo_planRepository_1_branch=3.1.x
bamboo_planRepository_1_branchDisplayName=3.1.x
bamboo_repository_revision_number=dc8ff9da28b8ab4ad11c7ea94cca526f17c87fe5
bamboo_PRref=3.2.x
bamboo_resultsUrl=https://bamboo.phpbb.com/browse/PHPBB3-PR-JOB1-9577
bamboo_capability_system_builder_command_Git=/usr/bin/git
bamboo_repository_75956235_git_username=bantu
bamboo_build_working_directory=/home/bamboo/xml-data/build-dir/PHPBB3-PR-JOB1
bamboo_planRepository_1_name=phpBB Ascraeus
bamboo_buildKey=PHPBB3-PR-JOB1
bamboo_capability_phpbb_tests=true
bamboo_shortPlanName=Pull Requests
bamboo_capability_system_builder_command_fop=/usr/bin/fop
bamboo_capability_dbms_sqlite_2=true
bamboo_planRepository_name=phpBB Ascraeus
bamboo_PRnumber=5685
bamboo_buildNumber=9577
bamboo_repository_75956235_git_repositoryUrl=https://github.com/phpbb/phpbb.git
bamboo_capability_system_builder_phpunit_PHPUnit=/usr/bin/phpunit
bamboo_shortJobName=Build and Test Job
bamboo_buildResultsUrl=https://bamboo.phpbb.com/browse/PHPBB3-PR-JOB1-9577
bamboo_repository_75956235_branch_name=3.1.x
bamboo_planRepository_repositoryUrl=https://github.com/phpbb/phpbb.git
bamboo_agentId=131073
bamboo_planName=phpBB3 - Pull Requests
bamboo_build_commandline_com_atlassian_bamboo_plugins_scripttask_task_builder_script_7=/bin/sh /home/bamboo/temp/PHPBB3-PR-JOB1-9577-ScriptBuildTask-5734615447471524700.sh
bamboo_shortPlanKey=PR
bamboo_shortJobKey=JOB1
bamboo_capability_dbms_mysql_55=true
bamboo_capability_system_jdk_JDK_1_7_0_65=/usr/lib/jvm/java-7-openjdk-amd64
bamboo_planRepository_revision=dc8ff9da28b8ab4ad11c7ea94cca526f17c87fe5
bamboo_buildTimeStamp=2019-09-10T23:02:34.725Z
bamboo_repository_previous_revision_number=dc8ff9da28b8ab4ad11c7ea94cca526f17c87fe5
bamboo_capability_system_jdk_JDK_1_6_0_16=/usr/lib/jvm/java-6-sun-1.6.0.16
bamboo_capability_system_builder_mvn2_Maven_2=/usr/share/maven2
bamboo_planRepository_previousRevision=dc8ff9da28b8ab4ad11c7ea94cca526f17c87fe5
bamboo_build_commandline_com_atlassian_bamboo_plugins_scripttask_task_builder_script_4=/bin/sh /home/bamboo/temp/PHPBB3-PR-JOB1-9577-ScriptBuildTask-5100357543160451971.sh
bamboo_repository_git_branch=3.1.x
bamboo_buildResultKey=PHPBB3-PR-JOB1-9577
bamboo_repository_branch_name=3.1.x
bamboo_buildPlanName=phpBB3 - Pull Requests - Build and Test Job
bamboo_planRepository_1_revision=dc8ff9da28b8ab4ad11c7ea94cca526f17c87fe5
bamboo_repository_name=phpBB Ascraeus
bamboo_buildFailed=true
bamboo_build_commandline_com_atlassian_bamboo_plugins_bamboo_docker_plugin_task_docker_cli_10=/usr/bin/docker run --volume /home/bamboo/xml-data/build-dir/PHPBB3-PR-JOB1:/data --workdir /data --rm -u=991 -t phpbb:php-7.1 /bin/bash -c phpBB/vendor/bin/phpunit --log-junit build/logs/phpunit.xml
bamboo_capability_system_docker_executable=/usr/bin/docker
bamboo_build_commandline_com_atlassian_bamboo_plugins_bamboo_docker_plugin_task_docker_cli_11=/usr/bin/docker run --volume /home/bamboo/xml-data/build-dir/PHPBB3-PR-JOB1:/data --workdir /data/build --rm -u=991 phpbb:php-7.1 ../phpBB/vendor/bin/phing sniff
bamboo_build_commandline_com_atlassian_bamboo_plugins_bamboo_docker_plugin_task_docker_cli_12=/usr/bin/docker run --volume /home/bamboo/xml-data/build-dir/PHPBB3-PR-JOB1:/data --workdir /data/phpBB --rm -e HOME=/home/bamboo -u=991 phpbb:php-7.1 /bin/bash -c php ../composer.phar install --dev; cd ../build; ../phpBB/vendor/bin/phing clean prepare
bamboo_build_commandline_com_atlassian_bamboo_plugins_bamboo_docker_plugin_task_docker_cli_13=/usr/bin/docker build --force-rm=true --tag=phpbb:php-7.1 /home/bamboo/xml-data/build-dir/PHPBB3-PR-JOB1
bamboo_planRepository_branch=3.1.x
bamboo_agentWorkingDirectory=/home/bamboo/xml-data/build-dir
bamboo_jobFailed=true
bamboo_capability_system_git_executable=/usr/bin/git
bamboo_capability_system_builder_phpunit_PHPUnit_3_4=/usr/bin/phpunit
bamboo_repository_git_username=bantu
bamboo_planRepository_1_previousRevision=dc8ff9da28b8ab4ad11c7ea94cca526f17c87fe5
bamboo_repository_75956235_revision_number=dc8ff9da28b8ab4ad11c7ea94cca526f17c87fe5
bamboo_planRepository_branchDisplayName=3.1.x
bamboo_planRepository_1_type=gitv2
bamboo_planRepository_branchName=3.1.x
bamboo_repository_75956235_previous_revision_number=dc8ff9da28b8ab4ad11c7ea94cca526f17c87fe5
bamboo_capability_system_jdk_JDK=/usr/lib/jvm/java-6-sun
bamboo_plan_storageTag=PHPBB3-PR
bamboo_hg_cache_directory=/home/bamboo/xml-data/build-dir/_hg-repositories-cache
bamboo_planRepository_1_username=bantu
bamboo_planRepository_type=gitv2
bamboo_git_cache_directory=/home/bamboo/xml-data/build-dir/_git-repositories-cache
bamboo_ManualBuildTriggerReason_userName=Build Robot
bamboo_repository_git_repositoryUrl=https://github.com/phpbb/phpbb.git
bamboo_repository_75956235_git_branch=3.1.x
bamboo_capability_system_builder_ant_Ant=/usr/share/ant
bamboo_repository_75956235_name=phpBB Ascraeus
bamboo_tmp_directory=/home/bamboo/temp
bamboo_working_directory=/home/bamboo/xml-data/build-dir/PHPBB3-PR-JOB1
bamboo_planKey=PHPBB3-PR
bamboo_capability_local=true
bamboo_planRepository_1_repositoryUrl=https://github.com/phpbb/phpbb.git
bamboo_planRepository_username=bantu
bamboo_capability_system_jdk_JDK_1_6=/usr/lib/jvm/java-6-sun
bamboo_capability_system_jdk_JDK_1_7=/usr/lib/jvm/java-7-openjdk-amd64
bamboo_planRepository_1_branchName=3.1.x
10-Sep-2019 23:04:20 From https://github.com/phpbb/phpbb
10-Sep-2019 23:04:20 * branch            refs/pull/5685/head -> FETCH_HEAD
10-Sep-2019 23:04:20 grep: build/logs/phpunit.xml: No such file or directory
10-Sep-2019 23:04:20 grep: build/logs/phpunit.xml: No such file or directory
10-Sep-2019 23:04:20   % Total    % Received % Xferd  Average Speed   Time    Time     Time  Current
10-Sep-2019 23:04:20                                  Dload  Upload   Total   Spent    Left  Speed
10-Sep-2019 23:04:20
10-Sep-2019 23:04:20   0     0    0     0    0     0      0      0 --:--:-- --:--:-- --:--:--     0
10-Sep-2019 23:04:20 100   273  100    93  100   180    286    553 --:--:-- --:--:-- --:--:--   555
10-Sep-2019 23:04:20 Finished task 'Set result build status' with result: Success
10-Sep-2019 23:04:20 Running post build plugin 'NCover Results Collector'
10-Sep-2019 23:04:20 Running post build plugin 'Artifact Copier'
10-Sep-2019 23:04:20 Running post build plugin 'npm Cache Cleanup'
10-Sep-2019 23:04:20 Running post build plugin 'Clover Results Collector'
10-Sep-2019 23:04:20 Running post build plugin 'Docker Container Cleanup'
10-Sep-2019 23:04:21 Successfully removed working directory at '/home/bamboo/xml-data/build-dir/PHPBB3-PR-JOB1'
10-Sep-2019 23:04:21 Finalising the build...
10-Sep-2019 23:04:21 Stopping timer.
10-Sep-2019 23:04:21 Build PHPBB3-PR-JOB1-9577 completed.
10-Sep-2019 23:04:21 Running on server: post build plugin 'NCover Results Collector'
10-Sep-2019 23:04:21 Running on server: post build plugin 'Build Hanging Detection Configuration'
10-Sep-2019 23:04:21 Running on server: post build plugin 'Clover Delta Calculator'
10-Sep-2019 23:04:21 Running on server: post build plugin 'Maven Dependencies Postprocessor'
10-Sep-2019 23:04:21 All post build plugins have finished
10-Sep-2019 23:04:21 Generating build results summary...
10-Sep-2019 23:04:21 Saving build results to disk...
10-Sep-2019 23:04:21 Logging substituted variables...
10-Sep-2019 23:04:21 Indexing build results...
10-Sep-2019 23:04:21 Finished building PHPBB3-PR-JOB1-9577.
10-Sep-2019 23:04:21
Substituting variable: ${bamboo.PRnumber} with 5685