Tests pending pull requests

Build: #9583 failed

Job: Build and Test Job failed

Stages & jobs

  1. Build and Test

Build log

The build generated 422 lines of output. Download or view full build log

11-Sep-2019 10:02:30 Build phpBB3 - Pull Requests - Build and Test Job #9583 (PHPBB3-PR-JOB1-9583) started building on agent Default Agent
11-Sep-2019 10:02:31
11-Sep-2019 10:02:31 Build working directory is /home/bamboo/xml-data/build-dir/PHPBB3-PR-JOB1
11-Sep-2019 10:02:31 Executing build phpBB3 - Pull Requests - Build and Test Job #9583 (PHPBB3-PR-JOB1-9583)
11-Sep-2019 10:02:31 Starting task 'Checkout develop branch' of type 'com.atlassian.bamboo.plugins.vcs:task.vcs.checkout'
11-Sep-2019 10:02:31 Build always requires a clean checkout
11-Sep-2019 10:02:31 Cleaning build directory '/home/bamboo/xml-data/build-dir/PHPBB3-PR-JOB1'
11-Sep-2019 10:02:31 Checking out into /home/bamboo/xml-data/build-dir/PHPBB3-PR-JOB1
11-Sep-2019 10:02:31 Updating source code to revision: dc8ff9da28b8ab4ad11c7ea94cca526f17c87fe5
11-Sep-2019 10:02:31 Fetching 'refs/heads/3.1.x' from 'https://github.com/phpbb/phpbb.git'.
11-Sep-2019 10:02:32 Checking out revision dc8ff9da28b8ab4ad11c7ea94cca526f17c87fe5.
11-Sep-2019 10:02:32 Creating local git repository in '/home/bamboo/xml-data/build-dir/PHPBB3-PR-JOB1/.git'.
11-Sep-2019 10:02:32 Cloning into '/home/bamboo/xml-data/build-dir/PHPBB3-PR-JOB1'...
11-Sep-2019 10:02:32 done.
11-Sep-2019 10:02:41 Switched to a new branch '3.1.x'
11-Sep-2019 10:02:41 Branch 3.1.x set up to track remote branch 3.1.x from origin.
11-Sep-2019 10:02:41 Updated source code to revision: dc8ff9da28b8ab4ad11c7ea94cca526f17c87fe5
11-Sep-2019 10:02:41 Finished task 'Checkout develop branch' with result: Success
11-Sep-2019 10:02:41 Running pre-build action: VCS Version Collector
11-Sep-2019 10:02:41
Substituting variable: ${bamboo.PRnumber} with 5686
11-Sep-2019 10:02:41
Substituting variable: ${bamboo.buildResultsUrl} with https://bamboo.phpbb.com/browse/PHPBB3-PR-JOB1-9583
11-Sep-2019 10:02:41 Starting task 'Set pending build status' of type 'com.atlassian.bamboo.plugins.scripttask:task.builder.script'
11-Sep-2019 10:02:41
Beginning to execute external process for build 'phpBB3 - Pull Requests - Build and Test Job #9583 (PHPBB3-PR-JOB1-9583)'
... running command line:
/bin/sh /home/bamboo/temp/PHPBB3-PR-JOB1-9583-ScriptBuildTask-5713132527872791860.sh
... in: /home/bamboo/xml-data/build-dir/PHPBB3-PR-JOB1
... using extra environment variables:
bamboo_planRepository_1_branch=3.1.x
bamboo_planRepository_1_branchDisplayName=3.1.x
bamboo_repository_revision_number=dc8ff9da28b8ab4ad11c7ea94cca526f17c87fe5
bamboo_PRref=master
bamboo_resultsUrl=https://bamboo.phpbb.com/browse/PHPBB3-PR-JOB1-9583
bamboo_capability_system_builder_command_Git=/usr/bin/git
bamboo_repository_75956235_git_username=bantu
bamboo_build_working_directory=/home/bamboo/xml-data/build-dir/PHPBB3-PR-JOB1
bamboo_planRepository_1_name=phpBB Ascraeus
bamboo_buildKey=PHPBB3-PR-JOB1
bamboo_capability_phpbb_tests=true
bamboo_shortPlanName=Pull Requests
bamboo_capability_system_builder_command_fop=/usr/bin/fop
bamboo_capability_dbms_sqlite_2=true
bamboo_planRepository_name=phpBB Ascraeus
bamboo_PRnumber=5686
bamboo_buildNumber=9583
bamboo_repository_75956235_git_repositoryUrl=https://github.com/phpbb/phpbb.git
bamboo_capability_system_builder_phpunit_PHPUnit=/usr/bin/phpunit
bamboo_shortJobName=Build and Test Job
bamboo_buildResultsUrl=https://bamboo.phpbb.com/browse/PHPBB3-PR-JOB1-9583
bamboo_repository_75956235_branch_name=3.1.x
bamboo_planRepository_repositoryUrl=https://github.com/phpbb/phpbb.git
bamboo_agentId=131073
bamboo_planName=phpBB3 - Pull Requests
bamboo_shortPlanKey=PR
bamboo_shortJobKey=JOB1
bamboo_capability_dbms_mysql_55=true
bamboo_capability_system_jdk_JDK_1_7_0_65=/usr/lib/jvm/java-7-openjdk-amd64
bamboo_planRepository_revision=dc8ff9da28b8ab4ad11c7ea94cca526f17c87fe5
bamboo_buildTimeStamp=2019-09-11T10:02:30.937Z
bamboo_repository_previous_revision_number=dc8ff9da28b8ab4ad11c7ea94cca526f17c87fe5
bamboo_capability_system_jdk_JDK_1_6_0_16=/usr/lib/jvm/java-6-sun-1.6.0.16
bamboo_capability_system_builder_mvn2_Maven_2=/usr/share/maven2
bamboo_planRepository_previousRevision=dc8ff9da28b8ab4ad11c7ea94cca526f17c87fe5
bamboo_repository_git_branch=3.1.x
bamboo_buildResultKey=PHPBB3-PR-JOB1-9583
bamboo_repository_branch_name=3.1.x
bamboo_buildPlanName=phpBB3 - Pull Requests - Build and Test Job
bamboo_planRepository_1_revision=dc8ff9da28b8ab4ad11c7ea94cca526f17c87fe5
bamboo_repository_name=phpBB Ascraeus
bamboo_buildFailed=false
bamboo_capability_system_docker_executable=/usr/bin/docker
bamboo_planRepository_branch=3.1.x
bamboo_agentWorkingDirectory=/home/bamboo/xml-data/build-dir
bamboo_capability_system_git_executable=/usr/bin/git
bamboo_capability_system_builder_phpunit_PHPUnit_3_4=/usr/bin/phpunit
bamboo_repository_git_username=bantu
bamboo_planRepository_1_previousRevision=dc8ff9da28b8ab4ad11c7ea94cca526f17c87fe5
bamboo_repository_75956235_revision_number=dc8ff9da28b8ab4ad11c7ea94cca526f17c87fe5
bamboo_planRepository_branchDisplayName=3.1.x
bamboo_planRepository_1_type=gitv2
bamboo_planRepository_branchName=3.1.x
bamboo_repository_75956235_previous_revision_number=dc8ff9da28b8ab4ad11c7ea94cca526f17c87fe5
bamboo_capability_system_jdk_JDK=/usr/lib/jvm/java-6-sun
bamboo_plan_storageTag=PHPBB3-PR
bamboo_hg_cache_directory=/home/bamboo/xml-data/build-dir/_hg-repositories-cache
bamboo_planRepository_1_username=bantu
bamboo_planRepository_type=gitv2
bamboo_git_cache_directory=/home/bamboo/xml-data/build-dir/_git-repositories-cache
bamboo_ManualBuildTriggerReason_userName=Build Robot
bamboo_repository_git_repositoryUrl=https://github.com/phpbb/phpbb.git
bamboo_repository_75956235_git_branch=3.1.x
bamboo_capability_system_builder_ant_Ant=/usr/share/ant
bamboo_repository_75956235_name=phpBB Ascraeus
bamboo_tmp_directory=/home/bamboo/temp
bamboo_working_directory=/home/bamboo/xml-data/build-dir/PHPBB3-PR-JOB1
bamboo_planKey=PHPBB3-PR
bamboo_capability_local=true
bamboo_planRepository_1_repositoryUrl=https://github.com/phpbb/phpbb.git
bamboo_planRepository_username=bantu
bamboo_capability_system_jdk_JDK_1_6=/usr/lib/jvm/java-6-sun
bamboo_capability_system_jdk_JDK_1_7=/usr/lib/jvm/java-7-openjdk-amd64
bamboo_planRepository_1_branchName=3.1.x
11-Sep-2019 10:02:45 From https://github.com/phpbb/phpbb
11-Sep-2019 10:02:45 * branch            refs/pull/5686/head -> FETCH_HEAD
11-Sep-2019 10:02:45   % Total    % Received % Xferd  Average Speed   Time    Time     Time  Current
11-Sep-2019 10:02:45                                  Dload  Upload   Total   Spent    Left  Speed
11-Sep-2019 10:02:45
11-Sep-2019 10:02:45   0     0    0     0    0     0      0      0 --:--:-- --:--:-- --:--:--     0
11-Sep-2019 10:02:45 100   275  100    93  100   182    152    298 --:--:-- --:--:-- --:--:--   298
11-Sep-2019 10:02:45 Finished task 'Set pending build status' with result: Success
11-Sep-2019 10:02:45
Substituting variable: ${bamboo.PRnumber} with 5686
11-Sep-2019 10:02:45 Starting task 'Fetch PR' of type 'com.atlassian.bamboo.plugins.scripttask:task.builder.script'
11-Sep-2019 10:02:45
Beginning to execute external process for build 'phpBB3 - Pull Requests - Build and Test Job #9583 (PHPBB3-PR-JOB1-9583)'
... running command line:
/bin/sh /home/bamboo/temp/PHPBB3-PR-JOB1-9583-ScriptBuildTask-309100793189844192.sh
... in: /home/bamboo/xml-data/build-dir/PHPBB3-PR-JOB1
... using extra environment variables:
bamboo_planRepository_1_branch=3.1.x
bamboo_planRepository_1_branchDisplayName=3.1.x
bamboo_repository_revision_number=dc8ff9da28b8ab4ad11c7ea94cca526f17c87fe5
bamboo_PRref=master
bamboo_resultsUrl=https://bamboo.phpbb.com/browse/PHPBB3-PR-JOB1-9583
bamboo_capability_system_builder_command_Git=/usr/bin/git
bamboo_repository_75956235_git_username=bantu
bamboo_build_working_directory=/home/bamboo/xml-data/build-dir/PHPBB3-PR-JOB1
bamboo_planRepository_1_name=phpBB Ascraeus
bamboo_buildKey=PHPBB3-PR-JOB1
bamboo_capability_phpbb_tests=true
bamboo_shortPlanName=Pull Requests
bamboo_capability_system_builder_command_fop=/usr/bin/fop
bamboo_capability_dbms_sqlite_2=true
bamboo_planRepository_name=phpBB Ascraeus
bamboo_PRnumber=5686
bamboo_buildNumber=9583
bamboo_repository_75956235_git_repositoryUrl=https://github.com/phpbb/phpbb.git
bamboo_capability_system_builder_phpunit_PHPUnit=/usr/bin/phpunit
bamboo_shortJobName=Build and Test Job
bamboo_buildResultsUrl=https://bamboo.phpbb.com/browse/PHPBB3-PR-JOB1-9583
bamboo_repository_75956235_branch_name=3.1.x
bamboo_planRepository_repositoryUrl=https://github.com/phpbb/phpbb.git
bamboo_agentId=131073
bamboo_planName=phpBB3 - Pull Requests
bamboo_build_commandline_com_atlassian_bamboo_plugins_scripttask_task_builder_script_7=/bin/sh /home/bamboo/temp/PHPBB3-PR-JOB1-9583-ScriptBuildTask-5713132527872791860.sh
bamboo_shortPlanKey=PR
bamboo_shortJobKey=JOB1
bamboo_capability_dbms_mysql_55=true
bamboo_capability_system_jdk_JDK_1_7_0_65=/usr/lib/jvm/java-7-openjdk-amd64
bamboo_planRepository_revision=dc8ff9da28b8ab4ad11c7ea94cca526f17c87fe5
bamboo_buildTimeStamp=2019-09-11T10:02:30.937Z
bamboo_repository_previous_revision_number=dc8ff9da28b8ab4ad11c7ea94cca526f17c87fe5
bamboo_capability_system_jdk_JDK_1_6_0_16=/usr/lib/jvm/java-6-sun-1.6.0.16
bamboo_capability_system_builder_mvn2_Maven_2=/usr/share/maven2
bamboo_planRepository_previousRevision=dc8ff9da28b8ab4ad11c7ea94cca526f17c87fe5
bamboo_repository_git_branch=3.1.x
bamboo_buildResultKey=PHPBB3-PR-JOB1-9583
bamboo_repository_branch_name=3.1.x
bamboo_buildPlanName=phpBB3 - Pull Requests - Build and Test Job
bamboo_planRepository_1_revision=dc8ff9da28b8ab4ad11c7ea94cca526f17c87fe5
bamboo_repository_name=phpBB Ascraeus
bamboo_buildFailed=false
bamboo_capability_system_docker_executable=/usr/bin/docker
bamboo_planRepository_branch=3.1.x
bamboo_agentWorkingDirectory=/home/bamboo/xml-data/build-dir
bamboo_capability_system_git_executable=/usr/bin/git
bamboo_capability_system_builder_phpunit_PHPUnit_3_4=/usr/bin/phpunit
bamboo_repository_git_username=bantu
bamboo_planRepository_1_previousRevision=dc8ff9da28b8ab4ad11c7ea94cca526f17c87fe5
bamboo_repository_75956235_revision_number=dc8ff9da28b8ab4ad11c7ea94cca526f17c87fe5
bamboo_planRepository_branchDisplayName=3.1.x
bamboo_planRepository_1_type=gitv2
bamboo_planRepository_branchName=3.1.x
bamboo_repository_75956235_previous_revision_number=dc8ff9da28b8ab4ad11c7ea94cca526f17c87fe5
bamboo_capability_system_jdk_JDK=/usr/lib/jvm/java-6-sun
bamboo_plan_storageTag=PHPBB3-PR
bamboo_hg_cache_directory=/home/bamboo/xml-data/build-dir/_hg-repositories-cache
bamboo_planRepository_1_username=bantu
bamboo_planRepository_type=gitv2
bamboo_git_cache_directory=/home/bamboo/xml-data/build-dir/_git-repositories-cache
bamboo_ManualBuildTriggerReason_userName=Build Robot
bamboo_repository_git_repositoryUrl=https://github.com/phpbb/phpbb.git
bamboo_repository_75956235_git_branch=3.1.x
bamboo_capability_system_builder_ant_Ant=/usr/share/ant
bamboo_repository_75956235_name=phpBB Ascraeus
bamboo_tmp_directory=/home/bamboo/temp
bamboo_working_directory=/home/bamboo/xml-data/build-dir/PHPBB3-PR-JOB1
bamboo_planKey=PHPBB3-PR
bamboo_capability_local=true
bamboo_planRepository_1_repositoryUrl=https://github.com/phpbb/phpbb.git
bamboo_planRepository_username=bantu
bamboo_capability_system_jdk_JDK_1_6=/usr/lib/jvm/java-6-sun
bamboo_capability_system_jdk_JDK_1_7=/usr/lib/jvm/java-7-openjdk-amd64
bamboo_planRepository_1_branchName=3.1.x
11-Sep-2019 10:02:49 From https://github.com/phpbb/phpbb
11-Sep-2019 10:02:49 * branch            refs/pull/5686/merge -> FETCH_HEAD
11-Sep-2019 10:02:50 Note: checking out 'FETCH_HEAD'.
11-Sep-2019 10:02:50
11-Sep-2019 10:02:50 You are in 'detached HEAD' state. You can look around, make experimental
11-Sep-2019 10:02:50 changes and commit them, and you can discard any commits you make in this
11-Sep-2019 10:02:50 state without impacting any branches by performing another checkout.
11-Sep-2019 10:02:50
11-Sep-2019 10:02:50 If you want to create a new branch to retain commits you create, you may
11-Sep-2019 10:02:50 do so (now or later) by using -b with the checkout command again. Example:
11-Sep-2019 10:02:50
11-Sep-2019 10:02:50   git checkout -b new_branch_name
11-Sep-2019 10:02:50
11-Sep-2019 10:02:50 HEAD is now at e1016be... Merge 44043786300af08ff9f8ae33d4dd8d5036f4e461 into e123ca826c843765383e13cfbb412ac14e4bd2a3
11-Sep-2019 10:02:50 Finished task 'Fetch PR' with result: Success
11-Sep-2019 10:02:50 Skipping execution of task 'Prepare directory' as it is disabled
11-Sep-2019 10:02:50
Substituting variable: ${bamboo.working.directory} with /home/bamboo/xml-data/build-dir/PHPBB3-PR-JOB1
11-Sep-2019 10:02:50 Starting task 'Build image' of type 'com.atlassian.bamboo.plugins.bamboo-docker-plugin:task.docker.cli'
11-Sep-2019 10:02:50
Beginning to execute external process for build 'phpBB3 - Pull Requests - Build and Test Job #9583 (PHPBB3-PR-JOB1-9583)'
... running command line:
/usr/bin/docker build --force-rm=true --tag=phpbb:php-7.1 /home/bamboo/xml-data/build-dir/PHPBB3-PR-JOB1
... in: /home/bamboo/xml-data/build-dir/PHPBB3-PR-JOB1
... using extra environment variables:
bamboo_planRepository_1_branch=3.1.x
bamboo_planRepository_1_branchDisplayName=3.1.x
bamboo_repository_revision_number=dc8ff9da28b8ab4ad11c7ea94cca526f17c87fe5
bamboo_PRref=master
bamboo_resultsUrl=https://bamboo.phpbb.com/browse/PHPBB3-PR-JOB1-9583
bamboo_capability_system_builder_command_Git=/usr/bin/git
bamboo_repository_75956235_git_username=bantu
bamboo_build_working_directory=/home/bamboo/xml-data/build-dir/PHPBB3-PR-JOB1
bamboo_planRepository_1_name=phpBB Ascraeus
bamboo_buildKey=PHPBB3-PR-JOB1
bamboo_capability_phpbb_tests=true
bamboo_shortPlanName=Pull Requests
bamboo_capability_system_builder_command_fop=/usr/bin/fop
bamboo_capability_dbms_sqlite_2=true
bamboo_planRepository_name=phpBB Ascraeus
bamboo_PRnumber=5686
bamboo_buildNumber=9583
bamboo_repository_75956235_git_repositoryUrl=https://github.com/phpbb/phpbb.git
bamboo_capability_system_builder_phpunit_PHPUnit=/usr/bin/phpunit
bamboo_shortJobName=Build and Test Job
bamboo_buildResultsUrl=https://bamboo.phpbb.com/browse/PHPBB3-PR-JOB1-9583
bamboo_repository_75956235_branch_name=3.1.x
bamboo_planRepository_repositoryUrl=https://github.com/phpbb/phpbb.git
bamboo_agentId=131073
bamboo_planName=phpBB3 - Pull Requests
bamboo_build_commandline_com_atlassian_bamboo_plugins_scripttask_task_builder_script_7=/bin/sh /home/bamboo/temp/PHPBB3-PR-JOB1-9583-ScriptBuildTask-5713132527872791860.sh
bamboo_shortPlanKey=PR
bamboo_shortJobKey=JOB1
bamboo_capability_dbms_mysql_55=true
bamboo_capability_system_jdk_JDK_1_7_0_65=/usr/lib/jvm/java-7-openjdk-amd64
bamboo_planRepository_revision=dc8ff9da28b8ab4ad11c7ea94cca526f17c87fe5
bamboo_buildTimeStamp=2019-09-11T10:02:30.937Z
bamboo_repository_previous_revision_number=dc8ff9da28b8ab4ad11c7ea94cca526f17c87fe5
bamboo_capability_system_jdk_JDK_1_6_0_16=/usr/lib/jvm/java-6-sun-1.6.0.16
bamboo_capability_system_builder_mvn2_Maven_2=/usr/share/maven2
bamboo_planRepository_previousRevision=dc8ff9da28b8ab4ad11c7ea94cca526f17c87fe5
bamboo_build_commandline_com_atlassian_bamboo_plugins_scripttask_task_builder_script_4=/bin/sh /home/bamboo/temp/PHPBB3-PR-JOB1-9583-ScriptBuildTask-309100793189844192.sh
bamboo_repository_git_branch=3.1.x
bamboo_buildResultKey=PHPBB3-PR-JOB1-9583
bamboo_repository_branch_name=3.1.x
bamboo_buildPlanName=phpBB3 - Pull Requests - Build and Test Job
bamboo_planRepository_1_revision=dc8ff9da28b8ab4ad11c7ea94cca526f17c87fe5
bamboo_repository_name=phpBB Ascraeus
bamboo_buildFailed=false
bamboo_capability_system_docker_executable=/usr/bin/docker
bamboo_planRepository_branch=3.1.x
bamboo_agentWorkingDirectory=/home/bamboo/xml-data/build-dir
bamboo_capability_system_git_executable=/usr/bin/git
bamboo_capability_system_builder_phpunit_PHPUnit_3_4=/usr/bin/phpunit
bamboo_repository_git_username=bantu
bamboo_planRepository_1_previousRevision=dc8ff9da28b8ab4ad11c7ea94cca526f17c87fe5
bamboo_repository_75956235_revision_number=dc8ff9da28b8ab4ad11c7ea94cca526f17c87fe5
bamboo_planRepository_branchDisplayName=3.1.x
bamboo_planRepository_1_type=gitv2
bamboo_planRepository_branchName=3.1.x
bamboo_repository_75956235_previous_revision_number=dc8ff9da28b8ab4ad11c7ea94cca526f17c87fe5
bamboo_capability_system_jdk_JDK=/usr/lib/jvm/java-6-sun
bamboo_plan_storageTag=PHPBB3-PR
bamboo_hg_cache_directory=/home/bamboo/xml-data/build-dir/_hg-repositories-cache
bamboo_planRepository_1_username=bantu
bamboo_planRepository_type=gitv2
bamboo_git_cache_directory=/home/bamboo/xml-data/build-dir/_git-repositories-cache
bamboo_ManualBuildTriggerReason_userName=Build Robot
bamboo_repository_git_repositoryUrl=https://github.com/phpbb/phpbb.git
bamboo_repository_75956235_git_branch=3.1.x
bamboo_capability_system_builder_ant_Ant=/usr/share/ant
bamboo_repository_75956235_name=phpBB Ascraeus
bamboo_tmp_directory=/home/bamboo/temp
bamboo_working_directory=/home/bamboo/xml-data/build-dir/PHPBB3-PR-JOB1
bamboo_planKey=PHPBB3-PR
bamboo_capability_local=true
bamboo_planRepository_1_repositoryUrl=https://github.com/phpbb/phpbb.git
bamboo_planRepository_username=bantu
bamboo_capability_system_jdk_JDK_1_6=/usr/lib/jvm/java-6-sun
bamboo_capability_system_jdk_JDK_1_7=/usr/lib/jvm/java-7-openjdk-amd64
bamboo_planRepository_1_branchName=3.1.x
11-Sep-2019 10:02:51 Sending build context to Docker daemon  42.94MB
11-Sep-2019 10:02:51
11-Sep-2019 10:02:51 Step 1/5 : FROM php:7.1
11-Sep-2019 10:02:51 ---> 733744c7fb19
11-Sep-2019 10:02:51 Step 2/5 : RUN apt-get update && apt-get install -y         git         zlib1g-dev         bzip2         zip         && docker-php-ext-install -j$(nproc) zip
11-Sep-2019 10:02:51 ---> Using cache
11-Sep-2019 10:02:51 ---> 922a485f7d56
11-Sep-2019 10:02:51 Step 3/5 : RUN pecl install xdebug-2.6.1
11-Sep-2019 10:02:51 ---> Using cache
11-Sep-2019 10:02:51 ---> 9d18315d07da
11-Sep-2019 10:02:51 Step 4/5 : RUN docker-php-ext-enable xdebug
11-Sep-2019 10:02:51 ---> Using cache
11-Sep-2019 10:02:51 ---> c478ba6cd87c
11-Sep-2019 10:02:51 Step 5/5 : RUN echo "memory_limit = 1536M" >> /usr/local/etc/php/conf.d/memory.ini
11-Sep-2019 10:02:51 ---> Using cache
11-Sep-2019 10:02:51 ---> a809ad3aa1fa
11-Sep-2019 10:02:52 Successfully built a809ad3aa1fa
11-Sep-2019 10:02:52 Successfully tagged phpbb:php-7.1
11-Sep-2019 10:02:52 Built Docker image 'phpbb:php-7.1'
11-Sep-2019 10:02:52 Finished task 'Build image' with result: Success
11-Sep-2019 10:02:52
Substituting variable: ${bamboo.working.directory} with /home/bamboo/xml-data/build-dir/PHPBB3-PR-JOB1
11-Sep-2019 10:02:52 Starting task 'Prepare directory' of type 'com.atlassian.bamboo.plugins.bamboo-docker-plugin:task.docker.cli'
11-Sep-2019 10:02:52 Running image name (phpbb:php-7.1)
11-Sep-2019 10:02:52
Beginning to execute external process for build 'phpBB3 - Pull Requests - Build and Test Job #9583 (PHPBB3-PR-JOB1-9583)'
... running command line:
/usr/bin/docker run --volume /home/bamboo/xml-data/build-dir/PHPBB3-PR-JOB1:/data --workdir /data/phpBB --rm -e HOME=/home/bamboo -u=991 phpbb:php-7.1 /bin/bash -c php ../composer.phar install --dev; cd ../build; ../phpBB/vendor/bin/phing clean prepare
... in: /home/bamboo/xml-data/build-dir/PHPBB3-PR-JOB1
... using extra environment variables:
bamboo_planRepository_1_branch=3.1.x
bamboo_planRepository_1_branchDisplayName=3.1.x
bamboo_repository_revision_number=dc8ff9da28b8ab4ad11c7ea94cca526f17c87fe5
bamboo_PRref=master
bamboo_resultsUrl=https://bamboo.phpbb.com/browse/PHPBB3-PR-JOB1-9583
bamboo_capability_system_builder_command_Git=/usr/bin/git
bamboo_repository_75956235_git_username=bantu
bamboo_build_working_directory=/home/bamboo/xml-data/build-dir/PHPBB3-PR-JOB1
bamboo_planRepository_1_name=phpBB Ascraeus
bamboo_buildKey=PHPBB3-PR-JOB1
bamboo_capability_phpbb_tests=true
bamboo_shortPlanName=Pull Requests
bamboo_capability_system_builder_command_fop=/usr/bin/fop
bamboo_capability_dbms_sqlite_2=true
bamboo_planRepository_name=phpBB Ascraeus
bamboo_PRnumber=5686
bamboo_buildNumber=9583
bamboo_repository_75956235_git_repositoryUrl=https://github.com/phpbb/phpbb.git
bamboo_capability_system_builder_phpunit_PHPUnit=/usr/bin/phpunit
bamboo_shortJobName=Build and Test Job
bamboo_buildResultsUrl=https://bamboo.phpbb.com/browse/PHPBB3-PR-JOB1-9583
bamboo_repository_75956235_branch_name=3.1.x
bamboo_planRepository_repositoryUrl=https://github.com/phpbb/phpbb.git
bamboo_agentId=131073
bamboo_planName=phpBB3 - Pull Requests
bamboo_build_commandline_com_atlassian_bamboo_plugins_scripttask_task_builder_script_7=/bin/sh /home/bamboo/temp/PHPBB3-PR-JOB1-9583-ScriptBuildTask-5713132527872791860.sh
bamboo_shortPlanKey=PR
bamboo_shortJobKey=JOB1
bamboo_capability_dbms_mysql_55=true
bamboo_capability_system_jdk_JDK_1_7_0_65=/usr/lib/jvm/java-7-openjdk-amd64
bamboo_planRepository_revision=dc8ff9da28b8ab4ad11c7ea94cca526f17c87fe5
bamboo_buildTimeStamp=2019-09-11T10:02:30.937Z
bamboo_repository_previous_revision_number=dc8ff9da28b8ab4ad11c7ea94cca526f17c87fe5
bamboo_capability_system_jdk_JDK_1_6_0_16=/usr/lib/jvm/java-6-sun-1.6.0.16
bamboo_capability_system_builder_mvn2_Maven_2=/usr/share/maven2
bamboo_planRepository_previousRevision=dc8ff9da28b8ab4ad11c7ea94cca526f17c87fe5
bamboo_build_commandline_com_atlassian_bamboo_plugins_scripttask_task_builder_script_4=/bin/sh /home/bamboo/temp/PHPBB3-PR-JOB1-9583-ScriptBuildTask-309100793189844192.sh
bamboo_repository_git_branch=3.1.x
bamboo_buildResultKey=PHPBB3-PR-JOB1-9583
bamboo_repository_branch_name=3.1.x
bamboo_buildPlanName=phpBB3 - Pull Requests - Build and Test Job
bamboo_planRepository_1_revision=dc8ff9da28b8ab4ad11c7ea94cca526f17c87fe5
bamboo_repository_name=phpBB Ascraeus
bamboo_buildFailed=false
bamboo_capability_system_docker_executable=/usr/bin/docker
bamboo_build_commandline_com_atlassian_bamboo_plugins_bamboo_docker_plugin_task_docker_cli_13=/usr/bin/docker build --force-rm=true --tag=phpbb:php-7.1 /home/bamboo/xml-data/build-dir/PHPBB3-PR-JOB1
bamboo_planRepository_branch=3.1.x
bamboo_agentWorkingDirectory=/home/bamboo/xml-data/build-dir
bamboo_capability_system_git_executable=/usr/bin/git
bamboo_capability_system_builder_phpunit_PHPUnit_3_4=/usr/bin/phpunit
bamboo_repository_git_username=bantu
bamboo_planRepository_1_previousRevision=dc8ff9da28b8ab4ad11c7ea94cca526f17c87fe5
bamboo_repository_75956235_revision_number=dc8ff9da28b8ab4ad11c7ea94cca526f17c87fe5
bamboo_planRepository_branchDisplayName=3.1.x
bamboo_planRepository_1_type=gitv2
bamboo_planRepository_branchName=3.1.x
bamboo_repository_75956235_previous_revision_number=dc8ff9da28b8ab4ad11c7ea94cca526f17c87fe5
bamboo_capability_system_jdk_JDK=/usr/lib/jvm/java-6-sun
bamboo_plan_storageTag=PHPBB3-PR
bamboo_hg_cache_directory=/home/bamboo/xml-data/build-dir/_hg-repositories-cache
bamboo_planRepository_1_username=bantu
bamboo_planRepository_type=gitv2
bamboo_git_cache_directory=/home/bamboo/xml-data/build-dir/_git-repositories-cache
bamboo_ManualBuildTriggerReason_userName=Build Robot
bamboo_repository_git_repositoryUrl=https://github.com/phpbb/phpbb.git
bamboo_repository_75956235_git_branch=3.1.x
bamboo_capability_system_builder_ant_Ant=/usr/share/ant
bamboo_repository_75956235_name=phpBB Ascraeus
bamboo_tmp_directory=/home/bamboo/temp
bamboo_working_directory=/home/bamboo/xml-data/build-dir/PHPBB3-PR-JOB1
bamboo_planKey=PHPBB3-PR
bamboo_capability_local=true
bamboo_planRepository_1_repositoryUrl=https://github.com/phpbb/phpbb.git
bamboo_planRepository_username=bantu
bamboo_capability_system_jdk_JDK_1_6=/usr/lib/jvm/java-6-sun
bamboo_capability_system_jdk_JDK_1_7=/usr/lib/jvm/java-7-openjdk-amd64
bamboo_planRepository_1_branchName=3.1.x
11-Sep-2019 10:02:54 Cannot create cache directory /home/bamboo/.composer/cache/repo/https---repo.packagist.org/, or directory is not writable. Proceeding without cache
11-Sep-2019 10:02:54 Cannot create cache directory /home/bamboo/.composer/cache/files/, or directory is not writable. Proceeding without cache
11-Sep-2019 10:02:54 You are using the deprecated option "dev". Dev packages are installed by default now.
11-Sep-2019 10:02:54 Loading composer repositories with package information
11-Sep-2019 10:02:54 Installing dependencies (including require-dev) from lock file
11-Sep-2019 10:02:54 Package operations: 82 installs, 0 updates, 0 removals
11-Sep-2019 10:02:54   - Installing composer/installers (v1.6.0): Downloading (connecting...)Downloading (0%)           Downloading (5%)Downloading (40%)Downloading (45%)Downloading (50%)Downloading (55%)Downloading (60%)Downloading (65%)Downloading (70%)Downloading (100%)
11-Sep-2019 10:02:55   - Installing ocramius/package-versions (1.4.0): Downloading (connecting...)Downloading (0%)           Downloading (30%)Downloading (60%)Downloading (90%)Downloading (100%)
11-Sep-2019 10:02:55   - Installing bantu/ini-get-wrapper (v1.0.1): Downloading (connecting...)Downloading (100%)         
11-Sep-2019 10:02:56   - Installing symfony/process (v3.4.30): Downloading (connecting...)Downloading (0%)           Downloading (5%)Downloading (35%)Downloading (40%)Downloading (45%)Downloading (50%)Downloading (55%)Downloading (60%)Downloading (65%)Downloading (95%)Downloading (100%)
11-Sep-2019 10:02:57   - Installing symfony/finder (v3.4.30): Downloading (connecting...)Downloading (0%)           Downloading (5%)Downloading (50%)Downloading (65%)Downloading (70%)Downloading (75%)Downloading (100%)
11-Sep-2019 10:02:57   - Installing symfony/polyfill-ctype (v1.11.0): Downloading (connecting...)Downloading (0%)           Downloading (100%)
11-Sep-2019 10:02:57   - Installing symfony/filesystem (v3.4.30): Downloading (connecting...)Downloading (100%)         
11-Sep-2019 10:02:58   - Installing symfony/polyfill-mbstring (v1.11.0): Downloading (connecting...)Downloading (0%)           Downloading (30%)Downloading (55%)Downloading (100%)
11-Sep-2019 10:02:58   - Installing psr/log (1.1.0): Downloading (connecting...)Downloading (0%)           Downloading (65%)Downloading (100%)
11-Sep-2019 10:02:59   - Installing symfony/debug (v3.4.30): Downloading (connecting...)Downloading (0%)           Downloading (5%)Downloading (25%)Downloading (30%)Downloading (40%)Downloading (55%)Downloading (60%)Downloading (75%)Downloading (80%)Downloading (95%)Downloading (100%)
11-Sep-2019 10:03:00   - Installing symfony/console (v3.4.30): Downloading (connecting...)Downloading (0%)           Downloading (5%)Downloading (10%)Downloading (15%)Downloading (20%)Downloading (25%)Downloading (30%)Downloading (35%)Downloading (40%)Downloading (45%)Downloading (50%)Downloading (55%)Downloading (60%)Downloading (65%)Downloading (70%)Downloading (75%)Downloading (80%)Downloading (85%)Downloading (90%)Downloading (95%)Downloading (100%)
11-Sep-2019 10:03:00   - Installing seld/phar-utils (1.0.1): Downloading (connecting...)Downloading (0%)           Downloading (30%)Downloading (60%)Downloading (90%)Downloading (100%)
11-Sep-2019 10:03:01   - Installing seld/jsonlint (1.7.1): Downloading (connecting...)Downloading (0%)           Downloading (15%)Downloading (50%)Downloading (100%)
11-Sep-2019 10:03:01   - Installing justinrainbow/json-schema (5.2.8): Downloading (connecting...)Downloading (0%)           Downloading (5%)Downloading (25%)Downloading (40%)Downloading (55%)Downloading (70%)Downloading (75%)Downloading (95%)Downloading (100%)
11-Sep-2019 10:03:02   - Installing composer/xdebug-handler (1.3.3): Downloading (connecting...)Downloading (0%)           Downloading (85%)Downloading (100%)
11-Sep-2019 10:03:02   - Installing composer/spdx-licenses (1.5.2): Downloading (connecting...)Downloading (0%)           Downloading (10%)Downloading (20%)Downloading (30%)Downloading (40%)Downloading (50%)Downloading (60%)Downloading (65%)Downloading (75%)Downloading (85%)Downloading (95%)Downloading (100%)
11-Sep-2019 10:03:03   - Installing composer/semver (1.5.0): Downloading (connecting...)Downloading (0%)           Downloading (35%)Downloading (85%)Downloading (100%)
11-Sep-2019 10:03:03   - Installing composer/ca-bundle (1.1.4): Downloading (connecting...)Downloading (0%)           Downloading (5%)Downloading (10%)Downloading (15%)Downloading (20%)Downloading (25%)Downloading (30%)Downloading (35%)Downloading (40%)Downloading (45%)Downloading (50%)Downloading (55%)Downloading (60%)Downloading (65%)Downloading (70%)Downloading (75%)Downloading (80%)Downloading (85%)Downloading (90%)Downloading (95%)Downloading (100%)
11-Sep-2019 10:03:04   - Installing composer/composer (1.8.6): Downloading (connecting...)Downloading (100%)         
11-Sep-2019 10:03:05   - Installing google/recaptcha (1.2.2): Downloading (connecting...)Downloading (0%)           Downloading (5%)Downloading (10%)Downloading (35%)Downloading (40%)Downloading (45%)Downloading (50%)Downloading (80%)Downloading (85%)Downloading (90%)Downloading (95%)Downloading (100%)
11-Sep-2019 10:03:05   - Installing guzzlehttp/promises (v1.3.1): Downloading (connecting...)Downloading (0%)           Downloading (30%)Downloading (45%)Downloading (75%)Downloading (85%)Downloading (100%)
11-Sep-2019 10:03:05   - Installing ralouphie/getallheaders (3.0.3): Downloading (connecting...)Downloading (0%)           Downloading (100%)
11-Sep-2019 10:03:06   - Installing psr/http-message (1.0.1): Downloading (connecting...)Downloading (0%)           Downloading (95%)Downloading (100%)
11-Sep-2019 10:03:06   - Installing guzzlehttp/psr7 (1.6.1): Downloading (connecting...)Downloading (0%)           Downloading (5%)Downloading (10%)Downloading (20%)Downloading (25%)Downloading (30%)Downloading (35%)Downloading (40%)Downloading (50%)Downloading (55%)Downloading (60%)Downloading (70%)Downloading (75%)Downloading (80%)Downloading (85%)Downloading (90%)Downloading (100%)
11-Sep-2019 10:03:07   - Installing lusitanian/oauth (v0.8.11): Downloading (connecting...)Downloading (100%)         
11-Sep-2019 10:03:07   - Installing marc1706/fast-image-size (v1.1.4): Downloading (connecting...)Downloading (0%)           Downloading (45%)Downloading (90%)Downloading (100%)
11-Sep-2019 10:03:08   - Installing patchwork/utf8 (v1.3.1): Downloading (connecting...)Downloading (0%)           Downloading (5%)Downloading (10%)Downloading (15%)Downloading (20%)Downloading (25%)Downloading (30%)Downloading (35%)Downloading (40%)Downloading (45%)Downloading (50%)Downloading (55%)Downloading (60%)Downloading (65%)Downloading (70%)Downloading (75%)Downloading (80%)Downloading (85%)Downloading (90%)Downloading (95%)Downloading (100%)
11-Sep-2019 10:03:08   - Installing psr/container (1.0.0): Downloading (connecting...)Downloading (0%)           Downloading (75%)Downloading (100%)
11-Sep-2019 10:03:09   - Installing s9e/regexp-builder (1.4.3): Downloading (connecting...)Downloading (100%)         
11-Sep-2019 10:03:09   - Installing s9e/text-formatter (2.1.0): Downloading (connecting...)Downloading (100%)         
11-Sep-2019 10:03:10   - Installing symfony/config (v3.4.30): Downloading (connecting...)Downloading (100%)         
11-Sep-2019 10:03:11   - Installing paragonie/random_compat (v2.0.18): Downloading (connecting...)Downloading (0%)           Downloading (25%)Downloading (50%)Downloading (75%)Downloading (100%)
11-Sep-2019 10:03:11   - Installing symfony/polyfill-php70 (v1.11.0): Downloading (connecting...)Downloading (0%)           Downloading (85%)Downloading (100%)
11-Sep-2019 10:03:12   - Installing symfony/http-foundation (v3.4.30): Downloading (connecting...)Downloading (0%)           Downloading (5%)Downloading (10%)Downloading (15%)Downloading (20%)Downloading (25%)Downloading (30%)Downloading (35%)Downloading (40%)Downloading (45%)Downloading (50%)Downloading (55%)Downloading (60%)Downloading (70%)Downloading (75%)Downloading (80%)Downloading (85%)Downloading (90%)Downloading (95%)Downloading (100%)
11-Sep-2019 10:03:12   - Installing symfony/event-dispatcher (v3.4.30): Downloading (connecting...)Downloading (0%)           Downloading (5%)Downloading (45%)Downloading (50%)Downloading (65%)Downloading (70%)Downloading (100%)
11-Sep-2019 10:03:13   - Installing symfony/http-kernel (v3.4.30): Downloading (connecting...)Downloading (0%)           Downloading (5%)Downloading (10%)Downloading (15%)Downloading (20%)Downloading (25%)Downloading (30%)Downloading (35%)Downloading (40%)Downloading (45%)Downloading (50%)Downloading (55%)Downloading (60%)Downloading (65%)Downloading (70%)Downloading (75%)Downloading (80%)Downloading (85%)Downloading (90%)Downloading (95%)Downloading (100%)
11-Sep-2019 10:03:13   - Installing symfony/dependency-injection (v3.4.30): Downloading (connecting...)Downloading (100%)         
11-Sep-2019 10:03:14   - Installing zendframework/zend-eventmanager (3.2.1): Downloading (connecting...)Downloading (0%)           Downloading (15%)Downloading (25%)Downloading (45%)Downloading (70%)Downloading (85%)Downloading (90%)Downloading (100%)
11-Sep-2019 10:03:14   - Installing zendframework/zend-code (3.3.1): Downloading (connecting...)Downloading (0%)           Downloading (5%)Downloading (10%)Downloading (15%)Downloading (20%)Downloading (25%)Downloading (30%)Downloading (35%)Downloading (40%)Downloading (45%)Downloading (50%)Downloading (55%)Downloading (60%)Downloading (65%)Downloading (70%)Downloading (75%)Downloading (80%)Downloading (85%)Downloading (90%)Downloading (95%)Downloading (100%)
11-Sep-2019 10:03:15   - Installing ocramius/proxy-manager (2.1.1): Downloading (connecting...)Downloading (100%)         
11-Sep-2019 10:03:16   - Installing symfony/proxy-manager-bridge (v3.4.30): Downloading (connecting...)Downloading (0%)           Downloading (25%)Downloading (50%)Downloading (100%)
11-Sep-2019 10:03:16   - Installing symfony/routing (v3.4.30): Downloading (connecting...)Downloading (0%)           Downloading (5%)Downloading (10%)Downloading (15%)Downloading (20%)Downloading (25%)Downloading (30%)Downloading (35%)Downloading (40%)Downloading (45%)Downloading (50%)Downloading (55%)Downloading (60%)Downloading (65%)Downloading (70%)Downloading (75%)Downloading (80%)Downloading (85%)Downloading (90%)Downloading (95%)Downloading (100%)
11-Sep-2019 10:03:17   - Installing twig/twig (v2.11.3): Downloading (connecting...)Downloading (0%)           Downloading (5%)Downloading (10%)Downloading (15%)Downloading (20%)Downloading (25%)Downloading (30%)Downloading (35%)Downloading (40%)Downloading (45%)Downloading (50%)Downloading (55%)Downloading (70%)Downloading (75%)Downloading (80%)Downloading (85%)Downloading (90%)Downloading (100%)
11-Sep-2019 10:03:18   - Installing symfony/twig-bridge (v3.4.30): Downloading (connecting...)Downloading (0%)           Downloading (5%)Downloading (15%)Downloading (20%)Downloading (25%)Downloading (30%)Downloading (35%)Downloading (40%)Downloading (45%)Downloading (50%)Downloading (55%)Downloading (60%)Downloading (65%)Downloading (75%)Downloading (80%)Downloading (85%)Downloading (90%)Downloading (95%)Downloading (100%)
11-Sep-2019 10:03:18   - Installing symfony/dom-crawler (v3.4.30): Downloading (connecting...)Downloading (100%)         
11-Sep-2019 10:03:19   - Installing symfony/css-selector (v3.4.30): Downloading (connecting...)Downloading (0%)           Downloading (5%)Downloading (10%)Downloading (15%)Downloading (20%)Downloading (25%)Downloading (30%)Downloading (35%)Downloading (40%)Downloading (45%)Downloading (50%)Downloading (55%)Downloading (60%)Downloading (100%)
11-Sep-2019 10:03:19   - Installing symfony/browser-kit (v3.4.30): Downloading (connecting...)Downloading (0%)           Downloading (5%)Downloading (70%)Downloading (100%)
11-Sep-2019 10:03:20   - Installing guzzlehttp/guzzle (6.3.3): Downloading (connecting...)Downloading (0%)           Downloading (5%)Downloading (10%)Downloading (20%)Downloading (25%)Downloading (30%)Downloading (35%)Downloading (40%)Downloading (45%)Downloading (55%)Downloading (60%)Downloading (70%)Downloading (75%)Downloading (80%)Downloading (90%)Downloading (95%)Downloading (100%)
11-Sep-2019 10:03:20   - Installing fabpot/goutte (v3.2.3): Downloading (connecting...)Downloading (0%)           Downloading (40%)Downloading (100%)
11-Sep-2019 10:03:21   - Installing facebook/webdriver (1.7.1): Downloading (connecting...)Downloading (0%)           Downloading (5%)Downloading (10%)Downloading (15%)Downloading (20%)Downloading (25%)Downloading (30%)Downloading (35%)Downloading (40%)Downloading (45%)Downloading (50%)Downloading (55%)Downloading (60%)Downloading (65%)Downloading (70%)Downloading (75%)Downloading (80%)Downloading (85%)Downloading (90%)Downloading (95%)Downloading (100%)
11-Sep-2019 10:03:21   - Installing symfony/yaml (v3.4.30): Downloading (connecting...)Downloading (100%)         
11-Sep-2019 10:03:22   - Installing laravel/homestead (v7.20.0): Downloading (connecting...)Downloading (0%)           Downloading (10%)Downloading (20%)Downloading (35%)Downloading (45%)Downloading (55%)Downloading (65%)Downloading (75%)Downloading (85%)Downloading (100%)
11-Sep-2019 10:03:23   - Installing phing/phing (2.16.1): Downloading (connecting...)Downloading (0%)           Downloading (5%)Downloading (10%)Downloading (15%)Downloading (20%)Downloading (25%)Downloading (30%)Downloading (35%)Downloading (40%)Downloading (45%)Downloading (50%)Downloading (55%)Downloading (60%)Downloading (65%)Downloading (70%)Downloading (75%)Downloading (80%)Downloading (85%)Downloading (90%)Downloading (95%)Downloading (100%)
11-Sep-2019 10:03:23   - Installing webmozart/assert (1.4.0): Downloading (connecting...)Downloading (0%)           Downloading (65%)Downloading (85%)Downloading (100%)
11-Sep-2019 10:03:24   - Installing phpdocumentor/reflection-common (1.0.1): Downloading (connecting...)Downloading (0%)           Downloading (100%)
11-Sep-2019 10:03:24   - Installing phpdocumentor/type-resolver (0.4.0): Downloading (connecting...)Downloading (0%)           Downloading (5%)Downloading (100%)
11-Sep-2019 10:03:25   - Installing phpdocumentor/reflection-docblock (4.3.1): Downloading (connecting...)Downloading (0%)           Downloading (5%)Downloading (10%)Downloading (15%)Downloading (55%)Downloading (60%)Downloading (65%)Downloading (70%)Downloading (75%)Downloading (80%)Downloading (85%)Downloading (90%)Downloading (95%)Downloading (100%)
11-Sep-2019 10:03:25   - Installing sebastian/version (2.0.1): Downloading (connecting...)Downloading (0%)           Downloading (100%)
11-Sep-2019 10:03:26   - Installing sebastian/resource-operations (2.0.1): Downloading (connecting...)Downloading (0%)           Downloading (25%)Downloading (45%)Downloading (70%)Downloading (85%)Downloading (100%)
11-Sep-2019 10:03:26   - Installing sebastian/recursion-context (3.0.0): Downloading (connecting...)Downloading (0%)           Downloading (35%)Downloading (70%)Downloading (100%)
11-Sep-2019 10:03:26   - Installing sebastian/object-reflector (1.1.1): Downloading (connecting...)Downloading (0%)           Downloading (65%)Downloading (100%)
11-Sep-2019 10:03:27   - Installing sebastian/object-enumerator (3.0.3): Downloading (connecting...)Downloading (0%)           Downloading (95%)Downloading (100%)
11-Sep-2019 10:03:27   - Installing sebastian/global-state (2.0.0): Downloading (connecting...)Downloading (0%)           Downloading (20%)Downloading (65%)Downloading (85%)Downloading (95%)Downloading (100%)
11-Sep-2019 10:03:28   - Installing sebastian/exporter (3.1.0): Downloading (connecting...)Downloading (0%)           Downloading (85%)Downloading (100%)
11-Sep-2019 10:03:28   - Installing sebastian/environment (4.2.2): Downloading (connecting...)Downloading (0%)           Downloading (35%)Downloading (75%)Downloading (100%)
11-Sep-2019 10:03:29   - Installing sebastian/diff (3.0.2): Downloading (connecting...)Downloading (0%)           Downloading (20%)Downloading (40%)Downloading (50%)Downloading (55%)Downloading (70%)Downloading (75%)Downloading (90%)Downloading (95%)Downloading (100%)
11-Sep-2019 10:03:29   - Installing sebastian/comparator (3.0.2): Downloading (connecting...)Downloading (0%)           Downloading (20%)Downloading (30%)Downloading (55%)Downloading (80%)Downloading (85%)Downloading (100%)
11-Sep-2019 10:03:30   - Installing phpunit/php-timer (2.1.2): Downloading (connecting...)Downloading (0%)           Downloading (35%)Downloading (70%)Downloading (100%)
11-Sep-2019 10:03:30   - Installing phpunit/php-text-template (1.2.1): Downloading (connecting...)Downloading (0%)           Downloading (35%)Downloading (100%)
11-Sep-2019 10:03:30   - Installing phpunit/php-file-iterator (2.0.2): Downloading (connecting...)Downloading (0%)           Downloading (35%)Downloading (70%)Downloading (100%)
11-Sep-2019 10:03:31   - Installing theseer/tokenizer (1.1.3): Downloading (connecting...)Downloading (0%)           Downloading (15%)Downloading (30%)Downloading (100%)
11-Sep-2019 10:03:31   - Installing sebastian/code-unit-reverse-lookup (1.0.1): Downloading (connecting...)Downloading (0%)           Downloading (55%)Downloading (100%)
11-Sep-2019 10:03:32   - Installing phpunit/php-token-stream (3.1.0): Downloading (connecting...)Downloading (0%)           Downloading (5%)Downloading (35%)Downloading (40%)Downloading (45%)Downloading (100%)
11-Sep-2019 10:03:32   - Installing phpunit/php-code-coverage (6.1.4): Downloading (connecting...)Downloading (0%)           Downloading (5%)Downloading (10%)Downloading (15%)Downloading (20%)Downloading (25%)Downloading (30%)Downloading (35%)Downloading (40%)Downloading (45%)Downloading (50%)Downloading (55%)Downloading (60%)Downloading (65%)Downloading (70%)Downloading (75%)Downloading (80%)Downloading (85%)Downloading (90%)Downloading (95%)Downloading (100%)
11-Sep-2019 10:03:33   - Installing doctrine/instantiator (1.2.0): Downloading (connecting...)Downloading (0%)           Downloading (100%)
11-Sep-2019 10:03:33   - Installing phpspec/prophecy (1.8.1): Downloading (connecting...)Downloading (0%)           Downloading (10%)Downloading (20%)Downloading (35%)Downloading (45%)Downloading (55%)Downloading (65%)Downloading (70%)Downloading (75%)Downloading (80%)Downloading (85%)Downloading (90%)Downloading (95%)Downloading (100%)
11-Sep-2019 10:03:34   - Installing phar-io/version (2.0.1): Downloading (connecting...)Downloading (0%)           Downloading (5%)Downloading (10%)Downloading (65%)Downloading (100%)
11-Sep-2019 10:03:34   - Installing phar-io/manifest (1.0.3): Downloading (connecting...)Downloading (0%)           Downloading (10%)Downloading (15%)Downloading (25%)Downloading (35%)Downloading (40%)Downloading (50%)Downloading (60%)Downloading (70%)Downloading (80%)Downloading (85%)Downloading (95%)Downloading (100%)
11-Sep-2019 10:03:35   - Installing myclabs/deep-copy (1.9.1): Downloading (connecting...)Downloading (0%)           Downloading (15%)Downloading (20%)Downloading (35%)Downloading (45%)Downloading (50%)Downloading (65%)Downloading (80%)Downloading (85%)Downloading (100%)
11-Sep-2019 10:03:36   - Installing phpunit/phpunit (7.5.14): Downloading (connecting...)Downloading (0%)           Downloading (5%)Downloading (10%)Downloading (15%)Downloading (20%)Downloading (25%)Downloading (30%)Downloading (35%)Downloading (40%)Downloading (45%)Downloading (50%)Downloading (55%)Downloading (60%)Downloading (65%)Downloading (70%)Downloading (75%)Downloading (80%)Downloading (90%)Downloading (95%)Downloading (100%)
11-Sep-2019 10:03:36   - Installing phpunit/dbunit (4.0.0): Downloading (connecting...)Downloading (100%)         
11-Sep-2019 10:03:37   - Installing squizlabs/php_codesniffer (3.4.2): Downloading (connecting...)Downloading (0%)           Downloading (5%)Downloading (10%)Downloading (15%)Downloading (20%)Downloading (25%)Downloading (30%)Downloading (35%)Downloading (40%)Downloading (45%)Downloading (50%)Downloading (55%)Downloading (60%)Downloading (65%)Downloading (70%)Downloading (75%)Downloading (80%)Downloading (85%)Downloading (90%)Downloading (95%)Downloading (100%)
11-Sep-2019 10:03:38 symfony/console suggests installing symfony/lock
11-Sep-2019 10:03:38 guzzlehttp/psr7 suggests installing zendframework/zend-httphandlerrunner (Emit PSR-7 responses)
11-Sep-2019 10:03:38 lusitanian/oauth suggests installing predis/predis (Allows using the Redis storage backend.)
11-Sep-2019 10:03:38 patchwork/utf8 suggests installing ext-intl (Use Intl for best performance)
11-Sep-2019 10:03:38 patchwork/utf8 suggests installing ext-wfio (Use WFIO for UTF-8 filesystem access on Windows)
11-Sep-2019 10:03:38 s9e/text-formatter suggests installing ext-intl (Allows international URLs to be accepted by the URL filter)
11-Sep-2019 10:03:38 s9e/text-formatter suggests installing ext-xsl (Enables the XSLT renderer)
11-Sep-2019 10:03:38 paragonie/random_compat suggests installing ext-libsodium (Provides a modern crypto API that can be used to generate random bytes.)
11-Sep-2019 10:03:38 symfony/http-kernel suggests installing symfony/var-dumper
11-Sep-2019 10:03:38 symfony/dependency-injection suggests installing symfony/expression-language (For using expressions in service container configuration)
11-Sep-2019 10:03:38 zendframework/zend-eventmanager suggests installing container-interop/container-interop (^1.1.0, to use the lazy listeners feature)
11-Sep-2019 10:03:38 zendframework/zend-eventmanager suggests installing zendframework/zend-stdlib (^2.7.3 || ^3.0, to use the FilterChain feature)
11-Sep-2019 10:03:38 zendframework/zend-code suggests installing doctrine/annotations (Doctrine\Common\Annotations >=1.0 for annotation features)
11-Sep-2019 10:03:38 zendframework/zend-code suggests installing zendframework/zend-stdlib (Zend\Stdlib component)
11-Sep-2019 10:03:38 ocramius/proxy-manager suggests installing ocramius/generated-hydrator (To have very fast object to array to object conversion for ghost objects)
11-Sep-2019 10:03:38 ocramius/proxy-manager suggests installing zendframework/zend-json (To have the JsonRpc adapter (Remote Object feature))
11-Sep-2019 10:03:38 ocramius/proxy-manager suggests installing zendframework/zend-soap (To have the Soap adapter (Remote Object feature))
11-Sep-2019 10:03:38 ocramius/proxy-manager suggests installing zendframework/zend-xmlrpc (To have the XmlRpc adapter (Remote Object feature))
11-Sep-2019 10:03:38 symfony/routing suggests installing doctrine/annotations (For using the annotation loader)
11-Sep-2019 10:03:38 symfony/routing suggests installing symfony/expression-language (For using expression matching)
11-Sep-2019 10:03:38 symfony/twig-bridge suggests installing symfony/asset (For using the AssetExtension)
11-Sep-2019 10:03:38 symfony/twig-bridge suggests installing symfony/expression-language (For using the ExpressionExtension)
11-Sep-2019 10:03:38 symfony/twig-bridge suggests installing symfony/form (For using the FormExtension)
11-Sep-2019 10:03:38 symfony/twig-bridge suggests installing symfony/security (For using the SecurityExtension)
11-Sep-2019 10:03:38 symfony/twig-bridge suggests installing symfony/stopwatch (For using the StopwatchExtension)
11-Sep-2019 10:03:38 symfony/twig-bridge suggests installing symfony/templating (For using the TwigEngine)
11-Sep-2019 10:03:38 symfony/twig-bridge suggests installing symfony/translation (For using the TranslationExtension)
11-Sep-2019 10:03:38 symfony/twig-bridge suggests installing symfony/var-dumper (For using the DumpExtension)
11-Sep-2019 10:03:38 symfony/twig-bridge suggests installing symfony/web-link (For using the WebLinkExtension)
11-Sep-2019 10:03:38 facebook/webdriver suggests installing ext-SimpleXML (For Firefox profile creation)
11-Sep-2019 10:03:38 phing/phing suggests installing pdepend/pdepend (PHP version of JDepend)
11-Sep-2019 10:03:38 phing/phing suggests installing pear/archive_tar (Tar file management class)
11-Sep-2019 10:03:38 phing/phing suggests installing pear/versioncontrol_git (A library that provides OO interface to handle Git repository)
11-Sep-2019 10:03:38 phing/phing suggests installing pear/versioncontrol_svn (A simple OO-style interface for Subversion, the free/open-source version control system)
11-Sep-2019 10:03:38 phing/phing suggests installing phpdocumentor/phpdocumentor (Documentation Generator for PHP)
11-Sep-2019 10:03:38 phing/phing suggests installing phploc/phploc (A tool for quickly measuring the size of a PHP project)
11-Sep-2019 10:03:38 phing/phing suggests installing phpmd/phpmd (PHP version of PMD tool)
11-Sep-2019 10:03:38 phing/phing suggests installing sebastian/phpcpd (Copy/Paste Detector (CPD) for PHP code)
11-Sep-2019 10:03:38 phing/phing suggests installing siad007/versioncontrol_hg (A library for interfacing with Mercurial repositories.)
11-Sep-2019 10:03:38 phing/phing suggests installing tedivm/jshrink (Javascript Minifier built in PHP)
11-Sep-2019 10:03:38 sebastian/global-state suggests installing ext-uopz (*)
11-Sep-2019 10:03:38 phpunit/phpunit suggests installing ext-soap (*)
11-Sep-2019 10:03:38 phpunit/phpunit suggests installing phpunit/php-invoker (^2.0)
11-Sep-2019 10:03:38 Package phpunit/dbunit is abandoned, you should avoid using it. No replacement was suggested.
11-Sep-2019 10:03:38 Generating autoload files
11-Sep-2019 10:03:38 ocramius/package-versions:  Generating version class...
11-Sep-2019 10:03:38 ocramius/package-versions: ...done generating version class
11-Sep-2019 10:03:38 Buildfile: /data/build/build.xml
11-Sep-2019 10:03:38
11-Sep-2019 10:03:38 phpBB > clean:
11-Sep-2019 10:03:38
11-Sep-2019 10:03:38    [delete] Directory /data/build/logs does not exist or is not a directory.
11-Sep-2019 10:03:38    [delete] Directory /data/build/api does not exist or is not a directory.
11-Sep-2019 10:03:38    [delete] Directory /data/build/codebrowser does not exist or is not a directory.
11-Sep-2019 10:03:38    [delete] Directory /data/build/coverage does not exist or is not a directory.
11-Sep-2019 10:03:38    [delete] Directory /data/build/cpd does not exist or is not a directory.
11-Sep-2019 10:03:38    [delete] Directory /data/build/dependencies does not exist or is not a directory.
11-Sep-2019 10:03:38    [delete] Directory /data/build/new_version does not exist or is not a directory.
11-Sep-2019 10:03:38    [delete] Directory /data/build/old_versions does not exist or is not a directory.
11-Sep-2019 10:03:38    [delete] Directory /data/build/save does not exist or is not a directory.
11-Sep-2019 10:03:38
11-Sep-2019 10:03:38 phpBB > prepare:
11-Sep-2019 10:03:38
11-Sep-2019 10:03:38     [mkdir] Created dir: /data/build/logs
11-Sep-2019 10:03:38     [mkdir] Created dir: /data/build/api
11-Sep-2019 10:03:38     [mkdir] Created dir: /data/build/codebrowser
11-Sep-2019 10:03:38     [mkdir] Created dir: /data/build/coverage
11-Sep-2019 10:03:38     [mkdir] Created dir: /data/build/cpd
11-Sep-2019 10:03:38     [mkdir] Created dir: /data/build/dependencies
11-Sep-2019 10:03:38     [mkdir] Created dir: /data/build/new_version
11-Sep-2019 10:03:38     [mkdir] Created dir: /data/build/new_version/files
11-Sep-2019 10:03:38     [mkdir] Created dir: /data/build/new_version/patches
11-Sep-2019 10:03:38     [mkdir] Created dir: /data/build/new_version/release_files
11-Sep-2019 10:03:38     [mkdir] Created dir: /data/build/new_version/update
11-Sep-2019 10:03:38     [mkdir] Created dir: /data/build/old_versions
11-Sep-2019 10:03:38     [mkdir] Created dir: /data/build/save
11-Sep-2019 10:03:38
11-Sep-2019 10:03:38 BUILD FINISHED
11-Sep-2019 10:03:38
11-Sep-2019 10:03:38 Total time: 0.0972 seconds
11-Sep-2019 10:03:38
11-Sep-2019 10:03:39 Finished task 'Prepare directory' with result: Success
11-Sep-2019 10:03:39 Skipping execution of task 'Run sniffs' as it is disabled
11-Sep-2019 10:03:39
Substituting variable: ${bamboo.working.directory} with /home/bamboo/xml-data/build-dir/PHPBB3-PR-JOB1
11-Sep-2019 10:03:39 Starting task 'Run sniffs' of type 'com.atlassian.bamboo.plugins.bamboo-docker-plugin:task.docker.cli'
11-Sep-2019 10:03:39 Running image name (phpbb:php-7.1)
11-Sep-2019 10:03:39
Beginning to execute external process for build 'phpBB3 - Pull Requests - Build and Test Job #9583 (PHPBB3-PR-JOB1-9583)'
... running command line:
/usr/bin/docker run --volume /home/bamboo/xml-data/build-dir/PHPBB3-PR-JOB1:/data --workdir /data/build --rm -u=991 phpbb:php-7.1 ../phpBB/vendor/bin/phing sniff
... in: /home/bamboo/xml-data/build-dir/PHPBB3-PR-JOB1
... using extra environment variables:
bamboo_planRepository_1_branch=3.1.x
bamboo_planRepository_1_branchDisplayName=3.1.x
bamboo_repository_revision_number=dc8ff9da28b8ab4ad11c7ea94cca526f17c87fe5
bamboo_PRref=master
bamboo_resultsUrl=https://bamboo.phpbb.com/browse/PHPBB3-PR-JOB1-9583
bamboo_capability_system_builder_command_Git=/usr/bin/git
bamboo_repository_75956235_git_username=bantu
bamboo_build_working_directory=/home/bamboo/xml-data/build-dir/PHPBB3-PR-JOB1
bamboo_planRepository_1_name=phpBB Ascraeus
bamboo_buildKey=PHPBB3-PR-JOB1
bamboo_capability_phpbb_tests=true
bamboo_shortPlanName=Pull Requests
bamboo_capability_system_builder_command_fop=/usr/bin/fop
bamboo_capability_dbms_sqlite_2=true
bamboo_planRepository_name=phpBB Ascraeus
bamboo_PRnumber=5686
bamboo_buildNumber=9583
bamboo_repository_75956235_git_repositoryUrl=https://github.com/phpbb/phpbb.git
bamboo_capability_system_builder_phpunit_PHPUnit=/usr/bin/phpunit
bamboo_shortJobName=Build and Test Job
bamboo_buildResultsUrl=https://bamboo.phpbb.com/browse/PHPBB3-PR-JOB1-9583
bamboo_repository_75956235_branch_name=3.1.x
bamboo_planRepository_repositoryUrl=https://github.com/phpbb/phpbb.git
bamboo_agentId=131073
bamboo_planName=phpBB3 - Pull Requests
bamboo_build_commandline_com_atlassian_bamboo_plugins_scripttask_task_builder_script_7=/bin/sh /home/bamboo/temp/PHPBB3-PR-JOB1-9583-ScriptBuildTask-5713132527872791860.sh
bamboo_shortPlanKey=PR
bamboo_shortJobKey=JOB1
bamboo_capability_dbms_mysql_55=true
bamboo_capability_system_jdk_JDK_1_7_0_65=/usr/lib/jvm/java-7-openjdk-amd64
bamboo_planRepository_revision=dc8ff9da28b8ab4ad11c7ea94cca526f17c87fe5
bamboo_buildTimeStamp=2019-09-11T10:02:30.937Z
bamboo_repository_previous_revision_number=dc8ff9da28b8ab4ad11c7ea94cca526f17c87fe5
bamboo_capability_system_jdk_JDK_1_6_0_16=/usr/lib/jvm/java-6-sun-1.6.0.16
bamboo_capability_system_builder_mvn2_Maven_2=/usr/share/maven2
bamboo_planRepository_previousRevision=dc8ff9da28b8ab4ad11c7ea94cca526f17c87fe5
bamboo_build_commandline_com_atlassian_bamboo_plugins_scripttask_task_builder_script_4=/bin/sh /home/bamboo/temp/PHPBB3-PR-JOB1-9583-ScriptBuildTask-309100793189844192.sh
bamboo_repository_git_branch=3.1.x
bamboo_buildResultKey=PHPBB3-PR-JOB1-9583
bamboo_repository_branch_name=3.1.x
bamboo_buildPlanName=phpBB3 - Pull Requests - Build and Test Job
bamboo_planRepository_1_revision=dc8ff9da28b8ab4ad11c7ea94cca526f17c87fe5
bamboo_repository_name=phpBB Ascraeus
bamboo_buildFailed=false
bamboo_capability_system_docker_executable=/usr/bin/docker
bamboo_build_commandline_com_atlassian_bamboo_plugins_bamboo_docker_plugin_task_docker_cli_12=/usr/bin/docker run --volume /home/bamboo/xml-data/build-dir/PHPBB3-PR-JOB1:/data --workdir /data/phpBB --rm -e HOME=/home/bamboo -u=991 phpbb:php-7.1 /bin/bash -c php ../composer.phar install --dev; cd ../build; ../phpBB/vendor/bin/phing clean prepare
bamboo_build_commandline_com_atlassian_bamboo_plugins_bamboo_docker_plugin_task_docker_cli_13=/usr/bin/docker build --force-rm=true --tag=phpbb:php-7.1 /home/bamboo/xml-data/build-dir/PHPBB3-PR-JOB1
bamboo_planRepository_branch=3.1.x
bamboo_agentWorkingDirectory=/home/bamboo/xml-data/build-dir
bamboo_capability_system_git_executable=/usr/bin/git
bamboo_capability_system_builder_phpunit_PHPUnit_3_4=/usr/bin/phpunit
bamboo_repository_git_username=bantu
bamboo_planRepository_1_previousRevision=dc8ff9da28b8ab4ad11c7ea94cca526f17c87fe5
bamboo_repository_75956235_revision_number=dc8ff9da28b8ab4ad11c7ea94cca526f17c87fe5
bamboo_planRepository_branchDisplayName=3.1.x
bamboo_planRepository_1_type=gitv2
bamboo_planRepository_branchName=3.1.x
bamboo_repository_75956235_previous_revision_number=dc8ff9da28b8ab4ad11c7ea94cca526f17c87fe5
bamboo_capability_system_jdk_JDK=/usr/lib/jvm/java-6-sun
bamboo_plan_storageTag=PHPBB3-PR
bamboo_hg_cache_directory=/home/bamboo/xml-data/build-dir/_hg-repositories-cache
bamboo_planRepository_1_username=bantu
bamboo_planRepository_type=gitv2
bamboo_git_cache_directory=/home/bamboo/xml-data/build-dir/_git-repositories-cache
bamboo_ManualBuildTriggerReason_userName=Build Robot
bamboo_repository_git_repositoryUrl=https://github.com/phpbb/phpbb.git
bamboo_repository_75956235_git_branch=3.1.x
bamboo_capability_system_builder_ant_Ant=/usr/share/ant
bamboo_repository_75956235_name=phpBB Ascraeus
bamboo_tmp_directory=/home/bamboo/temp
bamboo_working_directory=/home/bamboo/xml-data/build-dir/PHPBB3-PR-JOB1
bamboo_planKey=PHPBB3-PR
bamboo_capability_local=true
bamboo_planRepository_1_repositoryUrl=https://github.com/phpbb/phpbb.git
bamboo_planRepository_username=bantu
bamboo_capability_system_jdk_JDK_1_6=/usr/lib/jvm/java-6-sun
bamboo_capability_system_jdk_JDK_1_7=/usr/lib/jvm/java-7-openjdk-amd64
bamboo_planRepository_1_branchName=3.1.x
11-Sep-2019 10:03:40 Buildfile: /data/build/build.xml
11-Sep-2019 10:03:40
11-Sep-2019 10:03:40 phpBB > sniff:
11-Sep-2019 10:03:40
11-Sep-2019 10:03:46 ............................................................  60 / 775 (8%)
11-Sep-2019 10:03:47 ............................................................ 120 / 775 (15%)
11-Sep-2019 10:03:47 ............................................................ 180 / 775 (23%)
11-Sep-2019 10:03:48 ............................................................ 240 / 775 (31%)
11-Sep-2019 10:03:50 ............................................................ 300 / 775 (39%)
11-Sep-2019 10:03:54 ............................................................ 360 / 775 (46%)
11-Sep-2019 10:03:58 ............................................................ 420 / 775 (54%)
11-Sep-2019 10:04:01 ............................................................ 480 / 775 (62%)
11-Sep-2019 10:04:05 ............................................................ 540 / 775 (70%)
11-Sep-2019 10:04:08 ............................................................ 600 / 775 (77%)
11-Sep-2019 10:04:11 ............................................................ 660 / 775 (85%)
11-Sep-2019 10:04:14 ........E................................................... 720 / 775 (93%)
11-Sep-2019 10:04:16 .......................................................      775 / 775 (100%)
11-Sep-2019 10:04:16
11-Sep-2019 10:04:16
11-Sep-2019 10:04:16
11-Sep-2019 10:04:16 FILE: /data/phpBB/phpbb/content_visibility.php
11-Sep-2019 10:04:16 ----------------------------------------------------------------------
11-Sep-2019 10:04:16 FOUND 5 ERRORS AFFECTING 5 LINES
11-Sep-2019 10:04:16 ----------------------------------------------------------------------
11-Sep-2019 10:04:16 149 | ERROR | [x] Whitespace found at end of line
11-Sep-2019 10:04:16      |       |     (Squiz.WhiteSpace.SuperfluousWhitespace.EndLine)
11-Sep-2019 10:04:16 150 | ERROR | [x] Whitespace found at end of line
11-Sep-2019 10:04:16      |       |     (Squiz.WhiteSpace.SuperfluousWhitespace.EndLine)
11-Sep-2019 10:04:16 151 | ERROR | [x] Whitespace found at end of line
11-Sep-2019 10:04:16      |       |     (Squiz.WhiteSpace.SuperfluousWhitespace.EndLine)
11-Sep-2019 10:04:16 152 | ERROR | [x] Whitespace found at end of line
11-Sep-2019 10:04:16      |       |     (Squiz.WhiteSpace.SuperfluousWhitespace.EndLine)
11-Sep-2019 10:04:16 153 | ERROR | [x] Whitespace found at end of line
11-Sep-2019 10:04:16      |       |     (Squiz.WhiteSpace.SuperfluousWhitespace.EndLine)
11-Sep-2019 10:04:16 ----------------------------------------------------------------------
11-Sep-2019 10:04:16 PHPCBF CAN FIX THE 5 MARKED SNIFF VIOLATIONS AUTOMATICALLY
11-Sep-2019 10:04:16 ----------------------------------------------------------------------
11-Sep-2019 10:04:16
11-Sep-2019 10:04:16 Time: 36.27 secs; Memory: 50.01MB
11-Sep-2019 10:04:16
11-Sep-2019 10:04:16       [php] Calling PHP function: preg_replace()
11-Sep-2019 10:04:21 ....E.......................................................  60 / 209 (29%)
11-Sep-2019 10:04:33 ............................................................ 120 / 209 (57%)
11-Sep-2019 10:04:42 ............................................................ 180 / 209 (86%)
11-Sep-2019 10:04:47 .............................                                209 / 209 (100%)
11-Sep-2019 10:04:47
11-Sep-2019 10:04:47
11-Sep-2019 10:04:47
11-Sep-2019 10:04:47 FILE: /data/phpBB/viewforum.php
11-Sep-2019 10:04:47 ----------------------------------------------------------------------
11-Sep-2019 10:04:47 FOUND 3 ERRORS AFFECTING 3 LINES
11-Sep-2019 10:04:47 ----------------------------------------------------------------------
11-Sep-2019 10:04:47 902 | ERROR | [x] Tabs must be used to indent lines; spaces are not
11-Sep-2019 10:04:47      |       |     allowed
11-Sep-2019 10:04:47      |       |     (Generic.WhiteSpace.DisallowSpaceIndent.SpacesUsed)
11-Sep-2019 10:04:47 903 | ERROR | [x] Tabs must be used to indent lines; spaces are not
11-Sep-2019 10:04:47      |       |     allowed
11-Sep-2019 10:04:47      |       |     (Generic.WhiteSpace.DisallowSpaceIndent.SpacesUsed)
11-Sep-2019 10:04:47 904 | ERROR | [ ] Opening brace indented incorrectly; expected 8
11-Sep-2019 10:04:47      |       |     spaces, found 2
11-Sep-2019 10:04:47      |       |     (..phpbb_Sniffs_ControlStructures_OpeningBraceBsdAllman.BraceIndent)
11-Sep-2019 10:04:47 ----------------------------------------------------------------------
11-Sep-2019 10:04:47 PHPCBF CAN FIX THE 2 MARKED SNIFF VIOLATIONS AUTOMATICALLY
11-Sep-2019 10:04:47 ----------------------------------------------------------------------
11-Sep-2019 10:04:47
11-Sep-2019 10:04:47 Time: 30.93 secs; Memory: 40.01MB
11-Sep-2019 10:04:47
11-Sep-2019 10:04:47
11-Sep-2019 10:04:47
11-Sep-2019 10:04:47 Time: 31ms; Memory: 4MB
11-Sep-2019 10:04:47
11-Sep-2019 10:04:47
11-Sep-2019 10:04:47 BUILD FAILED
11-Sep-2019 10:04:47 /data/build/build.xml:116:6: /data/build/build.xml:123:46: PHP Code Sniffer failed.
11-Sep-2019 10:04:47
11-Sep-2019 10:04:47 Total time: 1 minute  7.43 seconds
11-Sep-2019 10:04:47
11-Sep-2019 10:04:47 Error occurred while running Task 'Run sniffs(11)' of type com.atlassian.bamboo.plugins.bamboo-docker-plugin:task.docker.cli.
11-Sep-2019 10:04:47 com.atlassian.bamboo.task.TaskException: Failed to execute task
11-Sep-2019 10:04:47         at com.atlassian.bamboo.plugins.docker.service.RunService.execute(RunService.java:75)
11-Sep-2019 10:04:47         at com.atlassian.bamboo.plugins.docker.tasks.cli.DockerCliTask.execute(DockerCliTask.java:70)
11-Sep-2019 10:04:47         at com.atlassian.bamboo.task.TaskExecutorImpl.lambda$executeTasks$3(TaskExecutorImpl.java:285)
11-Sep-2019 10:04:47         at com.atlassian.bamboo.task.TaskExecutorImpl.executeTaskWithPrePostActions(TaskExecutorImpl.java:224)
11-Sep-2019 10:04:47         at com.atlassian.bamboo.task.TaskExecutorImpl.executeTasks(TaskExecutorImpl.java:285)
11-Sep-2019 10:04:47         at com.atlassian.bamboo.task.TaskExecutorImpl.execute(TaskExecutorImpl.java:112)
11-Sep-2019 10:04:47         at com.atlassian.bamboo.build.pipeline.tasks.ExecuteBuildTask.call(ExecuteBuildTask.java:71)
11-Sep-2019 10:04:47         at com.atlassian.bamboo.v2.build.agent.DefaultBuildAgent.executeBuildPhase(DefaultBuildAgent.java:203)
11-Sep-2019 10:04:47         at com.atlassian.bamboo.v2.build.agent.DefaultBuildAgent.build(DefaultBuildAgent.java:175)
11-Sep-2019 10:04:47         at com.atlassian.bamboo.v2.build.agent.BuildAgentControllerImpl.lambda$waitAndPerformBuild$0(BuildAgentControllerImpl.java:122)
11-Sep-2019 10:04:47         at com.atlassian.bamboo.variable.CustomVariableContextImpl.withVariableSubstitutor(CustomVariableContextImpl.java:185)
11-Sep-2019 10:04:47         at com.atlassian.bamboo.v2.build.agent.BuildAgentControllerImpl.waitAndPerformBuild(BuildAgentControllerImpl.java:117)
11-Sep-2019 10:04:47         at com.atlassian.bamboo.v2.build.agent.DefaultBuildAgent$1.run(DefaultBuildAgent.java:126)
11-Sep-2019 10:04:47         at com.atlassian.bamboo.utils.BambooRunnables$1.run(BambooRunnables.java:48)
11-Sep-2019 10:04:47         at com.atlassian.bamboo.security.ImpersonationHelper.runWith(ImpersonationHelper.java:26)
11-Sep-2019 10:04:47         at com.atlassian.bamboo.security.ImpersonationHelper.runWithSystemAuthority(ImpersonationHelper.java:17)
11-Sep-2019 10:04:47         at com.atlassian.bamboo.security.ImpersonationHelper$1.run(ImpersonationHelper.java:41)
11-Sep-2019 10:04:47         at java.lang.Thread.run(Thread.java:748)
11-Sep-2019 10:04:47 Caused by: com.atlassian.bamboo.docker.DockerException: Error running Docker run command
11-Sep-2019 10:04:47         at com.atlassian.bamboo.docker.DockerContainerServiceImpl.run(DockerContainerServiceImpl.java:118)
11-Sep-2019 10:04:47         at sun.reflect.GeneratedMethodAccessor2260.invoke(Unknown Source)
11-Sep-2019 10:04:47         at sun.reflect.DelegatingMethodAccessorImpl.invoke(DelegatingMethodAccessorImpl.java:43)
11-Sep-2019 10:04:47         at java.lang.reflect.Method.invoke(Method.java:498)
11-Sep-2019 10:04:47         at com.atlassian.plugin.util.ContextClassLoaderSettingInvocationHandler.invoke(ContextClassLoaderSettingInvocationHandler.java:26)
11-Sep-2019 10:04:47         at com.sun.proxy.$Proxy401.run(Unknown Source)
11-Sep-2019 10:04:47         at sun.reflect.GeneratedMethodAccessor2260.invoke(Unknown Source)
11-Sep-2019 10:04:47         at sun.reflect.DelegatingMethodAccessorImpl.invoke(DelegatingMethodAccessorImpl.java:43)
11-Sep-2019 10:04:47         at java.lang.reflect.Method.invoke(Method.java:498)
11-Sep-2019 10:04:47         at org.springframework.aop.support.AopUtils.invokeJoinpointUsingReflection(AopUtils.java:302)
11-Sep-2019 10:04:47         at org.eclipse.gemini.blueprint.service.importer.support.internal.aop.ServiceInvoker.doInvoke(ServiceInvoker.java:56)
11-Sep-2019 10:04:47         at org.eclipse.gemini.blueprint.service.importer.support.internal.aop.ServiceInvoker.invoke(ServiceInvoker.java:60)
11-Sep-2019 10:04:47         at org.springframework.aop.framework.ReflectiveMethodInvocation.proceed(ReflectiveMethodInvocation.java:179)
11-Sep-2019 10:04:47         at org.springframework.aop.support.DelegatingIntroductionInterceptor.doProceed(DelegatingIntroductionInterceptor.java:133)
11-Sep-2019 10:04:47         at org.springframework.aop.support.DelegatingIntroductionInterceptor.invoke(DelegatingIntroductionInterceptor.java:121)
11-Sep-2019 10:04:47         at org.springframework.aop.framework.ReflectiveMethodInvocation.proceed(ReflectiveMethodInvocation.java:179)
11-Sep-2019 10:04:47         at org.eclipse.gemini.blueprint.service.util.internal.aop.ServiceTCCLInterceptor.invokeUnprivileged(ServiceTCCLInterceptor.java:70)
11-Sep-2019 10:04:47         at org.eclipse.gemini.blueprint.service.util.internal.aop.ServiceTCCLInterceptor.invoke(ServiceTCCLInterceptor.java:53)
11-Sep-2019 10:04:47         at org.springframework.aop.framework.ReflectiveMethodInvocation.proceed(ReflectiveMethodInvocation.java:179)
11-Sep-2019 10:04:47         at org.eclipse.gemini.blueprint.service.importer.support.LocalBundleContextAdvice.invoke(LocalBundleContextAdvice.java:57)
11-Sep-2019 10:04:47         at org.springframework.aop.framework.ReflectiveMethodInvocation.proceed(ReflectiveMethodInvocation.java:179)
11-Sep-2019 10:04:47         at org.springframework.aop.support.DelegatingIntroductionInterceptor.doProceed(DelegatingIntroductionInterceptor.java:133)
11-Sep-2019 10:04:47         at org.springframework.aop.support.DelegatingIntroductionInterceptor.invoke(DelegatingIntroductionInterceptor.java:121)
11-Sep-2019 10:04:47         at org.springframework.aop.framework.ReflectiveMethodInvocation.proceed(ReflectiveMethodInvocation.java:179)
11-Sep-2019 10:04:47         at org.springframework.aop.framework.JdkDynamicAopProxy.invoke(JdkDynamicAopProxy.java:207)
11-Sep-2019 10:04:47         at com.sun.proxy.$Proxy662.run(Unknown Source)
11-Sep-2019 10:04:47         at com.atlassian.bamboo.plugins.docker.client.DockerCmd.run(DockerCmd.java:51)
11-Sep-2019 10:04:47         at com.atlassian.bamboo.plugins.docker.service.RunService.execute(RunService.java:64)
11-Sep-2019 10:04:47         ... 17 more
11-Sep-2019 10:04:47 Caused by: com.atlassian.utils.process.ProcessException: Error executing /usr/bin/docker run --volume /home/bamboo/xml-data/build-dir/PHPBB3-PR-JOB1:/data --workdir /data/build --rm -u=991 phpbb:php-7.1 ../phpBB/vendor/bin/phing sniff
11-Sep-2019 10:04:47         at com.atlassian.bamboo.docker.DockerContainerServiceImpl.execute(DockerContainerServiceImpl.java:252)
11-Sep-2019 10:04:47         at com.atlassian.bamboo.docker.DockerContainerServiceImpl.run(DockerContainerServiceImpl.java:106)
11-Sep-2019 10:04:47         ... 44 more
11-Sep-2019 10:04:47 Starting task 'Parsing test results produced by script' of type 'com.atlassian.bamboo.plugins.testresultparser:task.testresultparser.junit'
11-Sep-2019 10:04:47 Parsing test results under /home/bamboo/xml-data/build-dir/PHPBB3-PR-JOB1...
11-Sep-2019 10:04:47 Failing task since test cases were expected but none were found.
11-Sep-2019 10:04:47 Finished task 'Parsing test results produced by script' with result: Failed
11-Sep-2019 10:04:47
Substituting variable: ${bamboo.PRnumber} with 5686
11-Sep-2019 10:04:47
Substituting variable: ${bamboo.buildResultsUrl} with https://bamboo.phpbb.com/browse/PHPBB3-PR-JOB1-9583
11-Sep-2019 10:04:47
Substituting variable: ${bamboo.buildResultsUrl} with https://bamboo.phpbb.com/browse/PHPBB3-PR-JOB1-9583
11-Sep-2019 10:04:47 Starting task 'Set result build status' of type 'com.atlassian.bamboo.plugins.scripttask:task.builder.script'
11-Sep-2019 10:04:47
Beginning to execute external process for build 'phpBB3 - Pull Requests - Build and Test Job #9583 (PHPBB3-PR-JOB1-9583)'
... running command line:
/bin/sh /home/bamboo/temp/PHPBB3-PR-JOB1-9583-ScriptBuildTask-746136832888671276.sh
... in: /home/bamboo/xml-data/build-dir/PHPBB3-PR-JOB1
... using extra environment variables:
bamboo_planRepository_1_branch=3.1.x
bamboo_planRepository_1_branchDisplayName=3.1.x
bamboo_repository_revision_number=dc8ff9da28b8ab4ad11c7ea94cca526f17c87fe5
bamboo_PRref=master
bamboo_resultsUrl=https://bamboo.phpbb.com/browse/PHPBB3-PR-JOB1-9583
bamboo_capability_system_builder_command_Git=/usr/bin/git
bamboo_repository_75956235_git_username=bantu
bamboo_build_working_directory=/home/bamboo/xml-data/build-dir/PHPBB3-PR-JOB1
bamboo_planRepository_1_name=phpBB Ascraeus
bamboo_buildKey=PHPBB3-PR-JOB1
bamboo_capability_phpbb_tests=true
bamboo_shortPlanName=Pull Requests
bamboo_capability_system_builder_command_fop=/usr/bin/fop
bamboo_capability_dbms_sqlite_2=true
bamboo_planRepository_name=phpBB Ascraeus
bamboo_PRnumber=5686
bamboo_buildNumber=9583
bamboo_repository_75956235_git_repositoryUrl=https://github.com/phpbb/phpbb.git
bamboo_capability_system_builder_phpunit_PHPUnit=/usr/bin/phpunit
bamboo_shortJobName=Build and Test Job
bamboo_buildResultsUrl=https://bamboo.phpbb.com/browse/PHPBB3-PR-JOB1-9583
bamboo_repository_75956235_branch_name=3.1.x
bamboo_planRepository_repositoryUrl=https://github.com/phpbb/phpbb.git
bamboo_agentId=131073
bamboo_planName=phpBB3 - Pull Requests
bamboo_build_commandline_com_atlassian_bamboo_plugins_scripttask_task_builder_script_7=/bin/sh /home/bamboo/temp/PHPBB3-PR-JOB1-9583-ScriptBuildTask-5713132527872791860.sh
bamboo_shortPlanKey=PR
bamboo_shortJobKey=JOB1
bamboo_capability_dbms_mysql_55=true
bamboo_capability_system_jdk_JDK_1_7_0_65=/usr/lib/jvm/java-7-openjdk-amd64
bamboo_planRepository_revision=dc8ff9da28b8ab4ad11c7ea94cca526f17c87fe5
bamboo_buildTimeStamp=2019-09-11T10:02:30.937Z
bamboo_repository_previous_revision_number=dc8ff9da28b8ab4ad11c7ea94cca526f17c87fe5
bamboo_capability_system_jdk_JDK_1_6_0_16=/usr/lib/jvm/java-6-sun-1.6.0.16
bamboo_capability_system_builder_mvn2_Maven_2=/usr/share/maven2
bamboo_planRepository_previousRevision=dc8ff9da28b8ab4ad11c7ea94cca526f17c87fe5
bamboo_build_commandline_com_atlassian_bamboo_plugins_scripttask_task_builder_script_4=/bin/sh /home/bamboo/temp/PHPBB3-PR-JOB1-9583-ScriptBuildTask-309100793189844192.sh
bamboo_repository_git_branch=3.1.x
bamboo_buildResultKey=PHPBB3-PR-JOB1-9583
bamboo_repository_branch_name=3.1.x
bamboo_buildPlanName=phpBB3 - Pull Requests - Build and Test Job
bamboo_planRepository_1_revision=dc8ff9da28b8ab4ad11c7ea94cca526f17c87fe5
bamboo_repository_name=phpBB Ascraeus
bamboo_buildFailed=true
bamboo_capability_system_docker_executable=/usr/bin/docker
bamboo_build_commandline_com_atlassian_bamboo_plugins_bamboo_docker_plugin_task_docker_cli_11=/usr/bin/docker run --volume /home/bamboo/xml-data/build-dir/PHPBB3-PR-JOB1:/data --workdir /data/build --rm -u=991 phpbb:php-7.1 ../phpBB/vendor/bin/phing sniff
bamboo_build_commandline_com_atlassian_bamboo_plugins_bamboo_docker_plugin_task_docker_cli_12=/usr/bin/docker run --volume /home/bamboo/xml-data/build-dir/PHPBB3-PR-JOB1:/data --workdir /data/phpBB --rm -e HOME=/home/bamboo -u=991 phpbb:php-7.1 /bin/bash -c php ../composer.phar install --dev; cd ../build; ../phpBB/vendor/bin/phing clean prepare
bamboo_build_commandline_com_atlassian_bamboo_plugins_bamboo_docker_plugin_task_docker_cli_13=/usr/bin/docker build --force-rm=true --tag=phpbb:php-7.1 /home/bamboo/xml-data/build-dir/PHPBB3-PR-JOB1
bamboo_planRepository_branch=3.1.x
bamboo_agentWorkingDirectory=/home/bamboo/xml-data/build-dir
bamboo_jobFailed=true
bamboo_capability_system_git_executable=/usr/bin/git
bamboo_capability_system_builder_phpunit_PHPUnit_3_4=/usr/bin/phpunit
bamboo_repository_git_username=bantu
bamboo_planRepository_1_previousRevision=dc8ff9da28b8ab4ad11c7ea94cca526f17c87fe5
bamboo_repository_75956235_revision_number=dc8ff9da28b8ab4ad11c7ea94cca526f17c87fe5
bamboo_planRepository_branchDisplayName=3.1.x
bamboo_planRepository_1_type=gitv2
bamboo_planRepository_branchName=3.1.x
bamboo_repository_75956235_previous_revision_number=dc8ff9da28b8ab4ad11c7ea94cca526f17c87fe5
bamboo_capability_system_jdk_JDK=/usr/lib/jvm/java-6-sun
bamboo_plan_storageTag=PHPBB3-PR
bamboo_hg_cache_directory=/home/bamboo/xml-data/build-dir/_hg-repositories-cache
bamboo_planRepository_1_username=bantu
bamboo_planRepository_type=gitv2
bamboo_git_cache_directory=/home/bamboo/xml-data/build-dir/_git-repositories-cache
bamboo_ManualBuildTriggerReason_userName=Build Robot
bamboo_repository_git_repositoryUrl=https://github.com/phpbb/phpbb.git
bamboo_repository_75956235_git_branch=3.1.x
bamboo_capability_system_builder_ant_Ant=/usr/share/ant
bamboo_repository_75956235_name=phpBB Ascraeus
bamboo_tmp_directory=/home/bamboo/temp
bamboo_working_directory=/home/bamboo/xml-data/build-dir/PHPBB3-PR-JOB1
bamboo_planKey=PHPBB3-PR
bamboo_capability_local=true
bamboo_planRepository_1_repositoryUrl=https://github.com/phpbb/phpbb.git
bamboo_planRepository_username=bantu
bamboo_capability_system_jdk_JDK_1_6=/usr/lib/jvm/java-6-sun
bamboo_capability_system_jdk_JDK_1_7=/usr/lib/jvm/java-7-openjdk-amd64
bamboo_planRepository_1_branchName=3.1.x
11-Sep-2019 10:04:48 From https://github.com/phpbb/phpbb
11-Sep-2019 10:04:48 * branch            refs/pull/5686/head -> FETCH_HEAD
11-Sep-2019 10:04:48 grep: build/logs/phpunit.xml: No such file or directory
11-Sep-2019 10:04:48 grep: build/logs/phpunit.xml: No such file or directory
11-Sep-2019 10:04:48   % Total    % Received % Xferd  Average Speed   Time    Time     Time  Current
11-Sep-2019 10:04:48                                  Dload  Upload   Total   Spent    Left  Speed
11-Sep-2019 10:04:48
11-Sep-2019 10:04:48   0     0    0     0    0     0      0      0 --:--:-- --:--:-- --:--:--     0
11-Sep-2019 10:04:48 100   273  100    93  100   180    309    598 --:--:-- --:--:-- --:--:--   600
11-Sep-2019 10:04:48 Finished task 'Set result build status' with result: Success
11-Sep-2019 10:04:48 Running post build plugin 'NCover Results Collector'
11-Sep-2019 10:04:48 Running post build plugin 'Artifact Copier'
11-Sep-2019 10:04:48 Running post build plugin 'npm Cache Cleanup'
11-Sep-2019 10:04:48 Running post build plugin 'Clover Results Collector'
11-Sep-2019 10:04:48 Running post build plugin 'Docker Container Cleanup'
11-Sep-2019 10:04:49 Successfully removed working directory at '/home/bamboo/xml-data/build-dir/PHPBB3-PR-JOB1'
11-Sep-2019 10:04:49 Finalising the build...
11-Sep-2019 10:04:49 Stopping timer.
11-Sep-2019 10:04:49 Build PHPBB3-PR-JOB1-9583 completed.
11-Sep-2019 10:04:49 Running on server: post build plugin 'NCover Results Collector'
11-Sep-2019 10:04:49 Running on server: post build plugin 'Build Hanging Detection Configuration'
11-Sep-2019 10:04:49 Running on server: post build plugin 'Clover Delta Calculator'
11-Sep-2019 10:04:49 Running on server: post build plugin 'Maven Dependencies Postprocessor'
11-Sep-2019 10:04:49 All post build plugins have finished
11-Sep-2019 10:04:49 Generating build results summary...
11-Sep-2019 10:04:49 Saving build results to disk...
11-Sep-2019 10:04:49 Logging substituted variables...
11-Sep-2019 10:04:49 Indexing build results...
11-Sep-2019 10:04:49 Finished building PHPBB3-PR-JOB1-9583.
11-Sep-2019 10:04:49
Substituting variable: ${bamboo.PRnumber} with 5686