Tests pending pull requests

Build: #9632 failed

Job: Build and Test Job failed

Stages & jobs

  1. Build and Test

Build log

The build generated 390 lines of output. Download or view full build log

04-Oct-2019 12:13:05 Build phpBB3 - Pull Requests - Build and Test Job #9632 (PHPBB3-PR-JOB1-9632) started building on agent Default Agent
04-Oct-2019 12:13:05
04-Oct-2019 12:13:05 Build working directory is /home/bamboo/xml-data/build-dir/PHPBB3-PR-JOB1
04-Oct-2019 12:13:05 Executing build phpBB3 - Pull Requests - Build and Test Job #9632 (PHPBB3-PR-JOB1-9632)
04-Oct-2019 12:13:05 Starting task 'Checkout develop branch' of type 'com.atlassian.bamboo.plugins.vcs:task.vcs.checkout'
04-Oct-2019 12:13:05 Build always requires a clean checkout
04-Oct-2019 12:13:05 Cleaning build directory '/home/bamboo/xml-data/build-dir/PHPBB3-PR-JOB1'
04-Oct-2019 12:13:05 Checking out into /home/bamboo/xml-data/build-dir/PHPBB3-PR-JOB1
04-Oct-2019 12:13:05 Updating source code to revision: dc8ff9da28b8ab4ad11c7ea94cca526f17c87fe5
04-Oct-2019 12:13:05 Fetching 'refs/heads/3.1.x' from 'https://github.com/phpbb/phpbb.git'.
04-Oct-2019 12:13:06 Checking out revision dc8ff9da28b8ab4ad11c7ea94cca526f17c87fe5.
04-Oct-2019 12:13:06 Creating local git repository in '/home/bamboo/xml-data/build-dir/PHPBB3-PR-JOB1/.git'.
04-Oct-2019 12:13:06 Cloning into '/home/bamboo/xml-data/build-dir/PHPBB3-PR-JOB1'...
04-Oct-2019 12:13:06 done.
04-Oct-2019 12:13:08 Switched to a new branch '3.1.x'
04-Oct-2019 12:13:08 Branch 3.1.x set up to track remote branch 3.1.x from origin.
04-Oct-2019 12:13:08 Updated source code to revision: dc8ff9da28b8ab4ad11c7ea94cca526f17c87fe5
04-Oct-2019 12:13:08 Finished task 'Checkout develop branch' with result: Success
04-Oct-2019 12:13:08 Running pre-build action: VCS Version Collector
04-Oct-2019 12:13:08
Substituting variable: ${bamboo.PRnumber} with 5703
04-Oct-2019 12:13:08
Substituting variable: ${bamboo.buildResultsUrl} with https://bamboo.phpbb.com/browse/PHPBB3-PR-JOB1-9632
04-Oct-2019 12:13:08 Starting task 'Set pending build status' of type 'com.atlassian.bamboo.plugins.scripttask:task.builder.script'
04-Oct-2019 12:13:08
Beginning to execute external process for build 'phpBB3 - Pull Requests - Build and Test Job #9632 (PHPBB3-PR-JOB1-9632)'
... running command line:
/bin/sh /home/bamboo/temp/PHPBB3-PR-JOB1-9632-ScriptBuildTask-103605683388361967.sh
... in: /home/bamboo/xml-data/build-dir/PHPBB3-PR-JOB1
... using extra environment variables:
bamboo_planRepository_1_branch=3.1.x
bamboo_planRepository_1_branchDisplayName=3.1.x
bamboo_repository_revision_number=dc8ff9da28b8ab4ad11c7ea94cca526f17c87fe5
bamboo_PRref=3.2.x
bamboo_resultsUrl=https://bamboo.phpbb.com/browse/PHPBB3-PR-JOB1-9632
bamboo_capability_system_builder_command_Git=/usr/bin/git
bamboo_repository_75956235_git_username=bantu
bamboo_build_working_directory=/home/bamboo/xml-data/build-dir/PHPBB3-PR-JOB1
bamboo_planRepository_1_name=phpBB Ascraeus
bamboo_buildKey=PHPBB3-PR-JOB1
bamboo_capability_phpbb_tests=true
bamboo_shortPlanName=Pull Requests
bamboo_capability_system_builder_command_fop=/usr/bin/fop
bamboo_capability_dbms_sqlite_2=true
bamboo_planRepository_name=phpBB Ascraeus
bamboo_PRnumber=5703
bamboo_buildNumber=9632
bamboo_repository_75956235_git_repositoryUrl=https://github.com/phpbb/phpbb.git
bamboo_capability_system_builder_phpunit_PHPUnit=/usr/bin/phpunit
bamboo_shortJobName=Build and Test Job
bamboo_buildResultsUrl=https://bamboo.phpbb.com/browse/PHPBB3-PR-JOB1-9632
bamboo_repository_75956235_branch_name=3.1.x
bamboo_planRepository_repositoryUrl=https://github.com/phpbb/phpbb.git
bamboo_agentId=131073
bamboo_planName=phpBB3 - Pull Requests
bamboo_shortPlanKey=PR
bamboo_shortJobKey=JOB1
bamboo_capability_dbms_mysql_55=true
bamboo_capability_system_jdk_JDK_1_7_0_65=/usr/lib/jvm/java-7-openjdk-amd64
bamboo_planRepository_revision=dc8ff9da28b8ab4ad11c7ea94cca526f17c87fe5
bamboo_buildTimeStamp=2019-10-04T12:13:05.337Z
bamboo_repository_previous_revision_number=dc8ff9da28b8ab4ad11c7ea94cca526f17c87fe5
bamboo_capability_system_jdk_JDK_1_6_0_16=/usr/lib/jvm/java-6-sun-1.6.0.16
bamboo_capability_system_builder_mvn2_Maven_2=/usr/share/maven2
bamboo_planRepository_previousRevision=dc8ff9da28b8ab4ad11c7ea94cca526f17c87fe5
bamboo_repository_git_branch=3.1.x
bamboo_buildResultKey=PHPBB3-PR-JOB1-9632
bamboo_repository_branch_name=3.1.x
bamboo_buildPlanName=phpBB3 - Pull Requests - Build and Test Job
bamboo_planRepository_1_revision=dc8ff9da28b8ab4ad11c7ea94cca526f17c87fe5
bamboo_repository_name=phpBB Ascraeus
bamboo_buildFailed=false
bamboo_capability_system_docker_executable=/usr/bin/docker
bamboo_planRepository_branch=3.1.x
bamboo_agentWorkingDirectory=/home/bamboo/xml-data/build-dir
bamboo_capability_system_git_executable=/usr/bin/git
bamboo_capability_system_builder_phpunit_PHPUnit_3_4=/usr/bin/phpunit
bamboo_repository_git_username=bantu
bamboo_planRepository_1_previousRevision=dc8ff9da28b8ab4ad11c7ea94cca526f17c87fe5
bamboo_repository_75956235_revision_number=dc8ff9da28b8ab4ad11c7ea94cca526f17c87fe5
bamboo_planRepository_branchDisplayName=3.1.x
bamboo_planRepository_1_type=gitv2
bamboo_planRepository_branchName=3.1.x
bamboo_repository_75956235_previous_revision_number=dc8ff9da28b8ab4ad11c7ea94cca526f17c87fe5
bamboo_capability_system_jdk_JDK=/usr/lib/jvm/java-6-sun
bamboo_plan_storageTag=PHPBB3-PR
bamboo_hg_cache_directory=/home/bamboo/xml-data/build-dir/_hg-repositories-cache
bamboo_planRepository_1_username=bantu
bamboo_planRepository_type=gitv2
bamboo_git_cache_directory=/home/bamboo/xml-data/build-dir/_git-repositories-cache
bamboo_ManualBuildTriggerReason_userName=Build Robot
bamboo_repository_git_repositoryUrl=https://github.com/phpbb/phpbb.git
bamboo_repository_75956235_git_branch=3.1.x
bamboo_capability_system_builder_ant_Ant=/usr/share/ant
bamboo_repository_75956235_name=phpBB Ascraeus
bamboo_tmp_directory=/home/bamboo/temp
bamboo_working_directory=/home/bamboo/xml-data/build-dir/PHPBB3-PR-JOB1
bamboo_planKey=PHPBB3-PR
bamboo_capability_local=true
bamboo_planRepository_1_repositoryUrl=https://github.com/phpbb/phpbb.git
bamboo_planRepository_username=bantu
bamboo_capability_system_jdk_JDK_1_6=/usr/lib/jvm/java-6-sun
bamboo_capability_system_jdk_JDK_1_7=/usr/lib/jvm/java-7-openjdk-amd64
bamboo_planRepository_1_branchName=3.1.x
04-Oct-2019 12:13:09 From https://github.com/phpbb/phpbb
04-Oct-2019 12:13:09 * branch            refs/pull/5703/head -> FETCH_HEAD
04-Oct-2019 12:13:09   % Total    % Received % Xferd  Average Speed   Time    Time     Time  Current
04-Oct-2019 12:13:09                                  Dload  Upload   Total   Spent    Left  Speed
04-Oct-2019 12:13:09
04-Oct-2019 12:13:09   0     0    0     0    0     0      0      0 --:--:-- --:--:-- --:--:--     0
04-Oct-2019 12:13:09 100   275  100    93  100   182    302    592 --:--:-- --:--:-- --:--:--   594
04-Oct-2019 12:13:09 Finished task 'Set pending build status' with result: Success
04-Oct-2019 12:13:09
Substituting variable: ${bamboo.PRnumber} with 5703
04-Oct-2019 12:13:09 Starting task 'Fetch PR' of type 'com.atlassian.bamboo.plugins.scripttask:task.builder.script'
04-Oct-2019 12:13:09
Beginning to execute external process for build 'phpBB3 - Pull Requests - Build and Test Job #9632 (PHPBB3-PR-JOB1-9632)'
... running command line:
/bin/sh /home/bamboo/temp/PHPBB3-PR-JOB1-9632-ScriptBuildTask-116930823601058291.sh
... in: /home/bamboo/xml-data/build-dir/PHPBB3-PR-JOB1
... using extra environment variables:
bamboo_planRepository_1_branch=3.1.x
bamboo_planRepository_1_branchDisplayName=3.1.x
bamboo_repository_revision_number=dc8ff9da28b8ab4ad11c7ea94cca526f17c87fe5
bamboo_PRref=3.2.x
bamboo_resultsUrl=https://bamboo.phpbb.com/browse/PHPBB3-PR-JOB1-9632
bamboo_capability_system_builder_command_Git=/usr/bin/git
bamboo_repository_75956235_git_username=bantu
bamboo_build_working_directory=/home/bamboo/xml-data/build-dir/PHPBB3-PR-JOB1
bamboo_planRepository_1_name=phpBB Ascraeus
bamboo_buildKey=PHPBB3-PR-JOB1
bamboo_capability_phpbb_tests=true
bamboo_shortPlanName=Pull Requests
bamboo_capability_system_builder_command_fop=/usr/bin/fop
bamboo_capability_dbms_sqlite_2=true
bamboo_planRepository_name=phpBB Ascraeus
bamboo_PRnumber=5703
bamboo_buildNumber=9632
bamboo_repository_75956235_git_repositoryUrl=https://github.com/phpbb/phpbb.git
bamboo_capability_system_builder_phpunit_PHPUnit=/usr/bin/phpunit
bamboo_shortJobName=Build and Test Job
bamboo_buildResultsUrl=https://bamboo.phpbb.com/browse/PHPBB3-PR-JOB1-9632
bamboo_repository_75956235_branch_name=3.1.x
bamboo_planRepository_repositoryUrl=https://github.com/phpbb/phpbb.git
bamboo_agentId=131073
bamboo_planName=phpBB3 - Pull Requests
bamboo_build_commandline_com_atlassian_bamboo_plugins_scripttask_task_builder_script_7=/bin/sh /home/bamboo/temp/PHPBB3-PR-JOB1-9632-ScriptBuildTask-103605683388361967.sh
bamboo_shortPlanKey=PR
bamboo_shortJobKey=JOB1
bamboo_capability_dbms_mysql_55=true
bamboo_capability_system_jdk_JDK_1_7_0_65=/usr/lib/jvm/java-7-openjdk-amd64
bamboo_planRepository_revision=dc8ff9da28b8ab4ad11c7ea94cca526f17c87fe5
bamboo_buildTimeStamp=2019-10-04T12:13:05.337Z
bamboo_repository_previous_revision_number=dc8ff9da28b8ab4ad11c7ea94cca526f17c87fe5
bamboo_capability_system_jdk_JDK_1_6_0_16=/usr/lib/jvm/java-6-sun-1.6.0.16
bamboo_capability_system_builder_mvn2_Maven_2=/usr/share/maven2
bamboo_planRepository_previousRevision=dc8ff9da28b8ab4ad11c7ea94cca526f17c87fe5
bamboo_repository_git_branch=3.1.x
bamboo_buildResultKey=PHPBB3-PR-JOB1-9632
bamboo_repository_branch_name=3.1.x
bamboo_buildPlanName=phpBB3 - Pull Requests - Build and Test Job
bamboo_planRepository_1_revision=dc8ff9da28b8ab4ad11c7ea94cca526f17c87fe5
bamboo_repository_name=phpBB Ascraeus
bamboo_buildFailed=false
bamboo_capability_system_docker_executable=/usr/bin/docker
bamboo_planRepository_branch=3.1.x
bamboo_agentWorkingDirectory=/home/bamboo/xml-data/build-dir
bamboo_capability_system_git_executable=/usr/bin/git
bamboo_capability_system_builder_phpunit_PHPUnit_3_4=/usr/bin/phpunit
bamboo_repository_git_username=bantu
bamboo_planRepository_1_previousRevision=dc8ff9da28b8ab4ad11c7ea94cca526f17c87fe5
bamboo_repository_75956235_revision_number=dc8ff9da28b8ab4ad11c7ea94cca526f17c87fe5
bamboo_planRepository_branchDisplayName=3.1.x
bamboo_planRepository_1_type=gitv2
bamboo_planRepository_branchName=3.1.x
bamboo_repository_75956235_previous_revision_number=dc8ff9da28b8ab4ad11c7ea94cca526f17c87fe5
bamboo_capability_system_jdk_JDK=/usr/lib/jvm/java-6-sun
bamboo_plan_storageTag=PHPBB3-PR
bamboo_hg_cache_directory=/home/bamboo/xml-data/build-dir/_hg-repositories-cache
bamboo_planRepository_1_username=bantu
bamboo_planRepository_type=gitv2
bamboo_git_cache_directory=/home/bamboo/xml-data/build-dir/_git-repositories-cache
bamboo_ManualBuildTriggerReason_userName=Build Robot
bamboo_repository_git_repositoryUrl=https://github.com/phpbb/phpbb.git
bamboo_repository_75956235_git_branch=3.1.x
bamboo_capability_system_builder_ant_Ant=/usr/share/ant
bamboo_repository_75956235_name=phpBB Ascraeus
bamboo_tmp_directory=/home/bamboo/temp
bamboo_working_directory=/home/bamboo/xml-data/build-dir/PHPBB3-PR-JOB1
bamboo_planKey=PHPBB3-PR
bamboo_capability_local=true
bamboo_planRepository_1_repositoryUrl=https://github.com/phpbb/phpbb.git
bamboo_planRepository_username=bantu
bamboo_capability_system_jdk_JDK_1_6=/usr/lib/jvm/java-6-sun
bamboo_capability_system_jdk_JDK_1_7=/usr/lib/jvm/java-7-openjdk-amd64
bamboo_planRepository_1_branchName=3.1.x
04-Oct-2019 12:13:10 From https://github.com/phpbb/phpbb
04-Oct-2019 12:13:10 * branch            refs/pull/5703/merge -> FETCH_HEAD
04-Oct-2019 12:13:11 Note: checking out 'FETCH_HEAD'.
04-Oct-2019 12:13:11
04-Oct-2019 12:13:11 You are in 'detached HEAD' state. You can look around, make experimental
04-Oct-2019 12:13:11 changes and commit them, and you can discard any commits you make in this
04-Oct-2019 12:13:11 state without impacting any branches by performing another checkout.
04-Oct-2019 12:13:11
04-Oct-2019 12:13:11 If you want to create a new branch to retain commits you create, you may
04-Oct-2019 12:13:11 do so (now or later) by using -b with the checkout command again. Example:
04-Oct-2019 12:13:11
04-Oct-2019 12:13:11   git checkout -b new_branch_name
04-Oct-2019 12:13:11
04-Oct-2019 12:13:11 HEAD is now at 59fd852... Merge 9fb48121d2b20a0fd14c11c2f4bdedc04ae88ac2 into 9217b85c68bbe18a4357a6ca187d2dda17fee803
04-Oct-2019 12:13:11 Finished task 'Fetch PR' with result: Success
04-Oct-2019 12:13:11 Skipping execution of task 'Prepare directory' as it is disabled
04-Oct-2019 12:13:11
Substituting variable: ${bamboo.working.directory} with /home/bamboo/xml-data/build-dir/PHPBB3-PR-JOB1
04-Oct-2019 12:13:11 Starting task 'Build image' of type 'com.atlassian.bamboo.plugins.bamboo-docker-plugin:task.docker.cli'
04-Oct-2019 12:13:11
Beginning to execute external process for build 'phpBB3 - Pull Requests - Build and Test Job #9632 (PHPBB3-PR-JOB1-9632)'
... running command line:
/usr/bin/docker build --force-rm=true --tag=phpbb:php-7.1 /home/bamboo/xml-data/build-dir/PHPBB3-PR-JOB1
... in: /home/bamboo/xml-data/build-dir/PHPBB3-PR-JOB1
... using extra environment variables:
bamboo_planRepository_1_branch=3.1.x
bamboo_planRepository_1_branchDisplayName=3.1.x
bamboo_repository_revision_number=dc8ff9da28b8ab4ad11c7ea94cca526f17c87fe5
bamboo_PRref=3.2.x
bamboo_resultsUrl=https://bamboo.phpbb.com/browse/PHPBB3-PR-JOB1-9632
bamboo_capability_system_builder_command_Git=/usr/bin/git
bamboo_repository_75956235_git_username=bantu
bamboo_build_working_directory=/home/bamboo/xml-data/build-dir/PHPBB3-PR-JOB1
bamboo_planRepository_1_name=phpBB Ascraeus
bamboo_buildKey=PHPBB3-PR-JOB1
bamboo_capability_phpbb_tests=true
bamboo_shortPlanName=Pull Requests
bamboo_capability_system_builder_command_fop=/usr/bin/fop
bamboo_capability_dbms_sqlite_2=true
bamboo_planRepository_name=phpBB Ascraeus
bamboo_PRnumber=5703
bamboo_buildNumber=9632
bamboo_repository_75956235_git_repositoryUrl=https://github.com/phpbb/phpbb.git
bamboo_capability_system_builder_phpunit_PHPUnit=/usr/bin/phpunit
bamboo_shortJobName=Build and Test Job
bamboo_buildResultsUrl=https://bamboo.phpbb.com/browse/PHPBB3-PR-JOB1-9632
bamboo_repository_75956235_branch_name=3.1.x
bamboo_planRepository_repositoryUrl=https://github.com/phpbb/phpbb.git
bamboo_agentId=131073
bamboo_planName=phpBB3 - Pull Requests
bamboo_build_commandline_com_atlassian_bamboo_plugins_scripttask_task_builder_script_7=/bin/sh /home/bamboo/temp/PHPBB3-PR-JOB1-9632-ScriptBuildTask-103605683388361967.sh
bamboo_shortPlanKey=PR
bamboo_shortJobKey=JOB1
bamboo_capability_dbms_mysql_55=true
bamboo_capability_system_jdk_JDK_1_7_0_65=/usr/lib/jvm/java-7-openjdk-amd64
bamboo_planRepository_revision=dc8ff9da28b8ab4ad11c7ea94cca526f17c87fe5
bamboo_buildTimeStamp=2019-10-04T12:13:05.337Z
bamboo_repository_previous_revision_number=dc8ff9da28b8ab4ad11c7ea94cca526f17c87fe5
bamboo_capability_system_jdk_JDK_1_6_0_16=/usr/lib/jvm/java-6-sun-1.6.0.16
bamboo_capability_system_builder_mvn2_Maven_2=/usr/share/maven2
bamboo_planRepository_previousRevision=dc8ff9da28b8ab4ad11c7ea94cca526f17c87fe5
bamboo_build_commandline_com_atlassian_bamboo_plugins_scripttask_task_builder_script_4=/bin/sh /home/bamboo/temp/PHPBB3-PR-JOB1-9632-ScriptBuildTask-116930823601058291.sh
bamboo_repository_git_branch=3.1.x
bamboo_buildResultKey=PHPBB3-PR-JOB1-9632
bamboo_repository_branch_name=3.1.x
bamboo_buildPlanName=phpBB3 - Pull Requests - Build and Test Job
bamboo_planRepository_1_revision=dc8ff9da28b8ab4ad11c7ea94cca526f17c87fe5
bamboo_repository_name=phpBB Ascraeus
bamboo_buildFailed=false
bamboo_capability_system_docker_executable=/usr/bin/docker
bamboo_planRepository_branch=3.1.x
bamboo_agentWorkingDirectory=/home/bamboo/xml-data/build-dir
bamboo_capability_system_git_executable=/usr/bin/git
bamboo_capability_system_builder_phpunit_PHPUnit_3_4=/usr/bin/phpunit
bamboo_repository_git_username=bantu
bamboo_planRepository_1_previousRevision=dc8ff9da28b8ab4ad11c7ea94cca526f17c87fe5
bamboo_repository_75956235_revision_number=dc8ff9da28b8ab4ad11c7ea94cca526f17c87fe5
bamboo_planRepository_branchDisplayName=3.1.x
bamboo_planRepository_1_type=gitv2
bamboo_planRepository_branchName=3.1.x
bamboo_repository_75956235_previous_revision_number=dc8ff9da28b8ab4ad11c7ea94cca526f17c87fe5
bamboo_capability_system_jdk_JDK=/usr/lib/jvm/java-6-sun
bamboo_plan_storageTag=PHPBB3-PR
bamboo_hg_cache_directory=/home/bamboo/xml-data/build-dir/_hg-repositories-cache
bamboo_planRepository_1_username=bantu
bamboo_planRepository_type=gitv2
bamboo_git_cache_directory=/home/bamboo/xml-data/build-dir/_git-repositories-cache
bamboo_ManualBuildTriggerReason_userName=Build Robot
bamboo_repository_git_repositoryUrl=https://github.com/phpbb/phpbb.git
bamboo_repository_75956235_git_branch=3.1.x
bamboo_capability_system_builder_ant_Ant=/usr/share/ant
bamboo_repository_75956235_name=phpBB Ascraeus
bamboo_tmp_directory=/home/bamboo/temp
bamboo_working_directory=/home/bamboo/xml-data/build-dir/PHPBB3-PR-JOB1
bamboo_planKey=PHPBB3-PR
bamboo_capability_local=true
bamboo_planRepository_1_repositoryUrl=https://github.com/phpbb/phpbb.git
bamboo_planRepository_username=bantu
bamboo_capability_system_jdk_JDK_1_6=/usr/lib/jvm/java-6-sun
bamboo_capability_system_jdk_JDK_1_7=/usr/lib/jvm/java-7-openjdk-amd64
bamboo_planRepository_1_branchName=3.1.x
04-Oct-2019 12:13:11 Sending build context to Docker daemon  19.99MB
04-Oct-2019 12:13:11
04-Oct-2019 12:13:12 Step 1/5 : FROM php:7.1
04-Oct-2019 12:13:12 ---> e94fb1312478
04-Oct-2019 12:13:12 Step 2/5 : RUN apt-get update && apt-get install -y         git         zlib1g-dev         bzip2         zip         && docker-php-ext-install -j$(nproc) zip
04-Oct-2019 12:13:12 ---> Using cache
04-Oct-2019 12:13:12 ---> 4671a3ca02e6
04-Oct-2019 12:13:12 Step 3/5 : RUN pecl install xdebug-2.6.1
04-Oct-2019 12:13:12 ---> Using cache
04-Oct-2019 12:13:12 ---> c7766c47373c
04-Oct-2019 12:13:12 Step 4/5 : RUN docker-php-ext-enable xdebug
04-Oct-2019 12:13:12 ---> Using cache
04-Oct-2019 12:13:12 ---> 2392b708ba49
04-Oct-2019 12:13:12 Step 5/5 : RUN echo "memory_limit = 1536M" >> /usr/local/etc/php/conf.d/memory.ini
04-Oct-2019 12:13:12 ---> Using cache
04-Oct-2019 12:13:12 ---> e03caf393a75
04-Oct-2019 12:13:12 Successfully built e03caf393a75
04-Oct-2019 12:13:12 Successfully tagged phpbb:php-7.1
04-Oct-2019 12:13:12 Built Docker image 'phpbb:php-7.1'
04-Oct-2019 12:13:12 Finished task 'Build image' with result: Success
04-Oct-2019 12:13:12
Substituting variable: ${bamboo.working.directory} with /home/bamboo/xml-data/build-dir/PHPBB3-PR-JOB1
04-Oct-2019 12:13:12 Starting task 'Prepare directory' of type 'com.atlassian.bamboo.plugins.bamboo-docker-plugin:task.docker.cli'
04-Oct-2019 12:13:12 Running image name (phpbb:php-7.1)
04-Oct-2019 12:13:12
Beginning to execute external process for build 'phpBB3 - Pull Requests - Build and Test Job #9632 (PHPBB3-PR-JOB1-9632)'
... running command line:
/usr/bin/docker run --volume /home/bamboo/xml-data/build-dir/PHPBB3-PR-JOB1:/data --workdir /data/phpBB --rm -e HOME=/home/bamboo -u=991 phpbb:php-7.1 /bin/bash -c php ../composer.phar install --dev; cd ../build; ../phpBB/vendor/bin/phing clean prepare
... in: /home/bamboo/xml-data/build-dir/PHPBB3-PR-JOB1
... using extra environment variables:
bamboo_planRepository_1_branch=3.1.x
bamboo_planRepository_1_branchDisplayName=3.1.x
bamboo_repository_revision_number=dc8ff9da28b8ab4ad11c7ea94cca526f17c87fe5
bamboo_PRref=3.2.x
bamboo_resultsUrl=https://bamboo.phpbb.com/browse/PHPBB3-PR-JOB1-9632
bamboo_capability_system_builder_command_Git=/usr/bin/git
bamboo_repository_75956235_git_username=bantu
bamboo_build_working_directory=/home/bamboo/xml-data/build-dir/PHPBB3-PR-JOB1
bamboo_planRepository_1_name=phpBB Ascraeus
bamboo_buildKey=PHPBB3-PR-JOB1
bamboo_capability_phpbb_tests=true
bamboo_shortPlanName=Pull Requests
bamboo_capability_system_builder_command_fop=/usr/bin/fop
bamboo_capability_dbms_sqlite_2=true
bamboo_planRepository_name=phpBB Ascraeus
bamboo_PRnumber=5703
bamboo_buildNumber=9632
bamboo_repository_75956235_git_repositoryUrl=https://github.com/phpbb/phpbb.git
bamboo_capability_system_builder_phpunit_PHPUnit=/usr/bin/phpunit
bamboo_shortJobName=Build and Test Job
bamboo_buildResultsUrl=https://bamboo.phpbb.com/browse/PHPBB3-PR-JOB1-9632
bamboo_repository_75956235_branch_name=3.1.x
bamboo_planRepository_repositoryUrl=https://github.com/phpbb/phpbb.git
bamboo_agentId=131073
bamboo_planName=phpBB3 - Pull Requests
bamboo_build_commandline_com_atlassian_bamboo_plugins_scripttask_task_builder_script_7=/bin/sh /home/bamboo/temp/PHPBB3-PR-JOB1-9632-ScriptBuildTask-103605683388361967.sh
bamboo_shortPlanKey=PR
bamboo_shortJobKey=JOB1
bamboo_capability_dbms_mysql_55=true
bamboo_capability_system_jdk_JDK_1_7_0_65=/usr/lib/jvm/java-7-openjdk-amd64
bamboo_planRepository_revision=dc8ff9da28b8ab4ad11c7ea94cca526f17c87fe5
bamboo_buildTimeStamp=2019-10-04T12:13:05.337Z
bamboo_repository_previous_revision_number=dc8ff9da28b8ab4ad11c7ea94cca526f17c87fe5
bamboo_capability_system_jdk_JDK_1_6_0_16=/usr/lib/jvm/java-6-sun-1.6.0.16
bamboo_capability_system_builder_mvn2_Maven_2=/usr/share/maven2
bamboo_planRepository_previousRevision=dc8ff9da28b8ab4ad11c7ea94cca526f17c87fe5
bamboo_build_commandline_com_atlassian_bamboo_plugins_scripttask_task_builder_script_4=/bin/sh /home/bamboo/temp/PHPBB3-PR-JOB1-9632-ScriptBuildTask-116930823601058291.sh
bamboo_repository_git_branch=3.1.x
bamboo_buildResultKey=PHPBB3-PR-JOB1-9632
bamboo_repository_branch_name=3.1.x
bamboo_buildPlanName=phpBB3 - Pull Requests - Build and Test Job
bamboo_planRepository_1_revision=dc8ff9da28b8ab4ad11c7ea94cca526f17c87fe5
bamboo_repository_name=phpBB Ascraeus
bamboo_buildFailed=false
bamboo_capability_system_docker_executable=/usr/bin/docker
bamboo_build_commandline_com_atlassian_bamboo_plugins_bamboo_docker_plugin_task_docker_cli_13=/usr/bin/docker build --force-rm=true --tag=phpbb:php-7.1 /home/bamboo/xml-data/build-dir/PHPBB3-PR-JOB1
bamboo_planRepository_branch=3.1.x
bamboo_agentWorkingDirectory=/home/bamboo/xml-data/build-dir
bamboo_capability_system_git_executable=/usr/bin/git
bamboo_capability_system_builder_phpunit_PHPUnit_3_4=/usr/bin/phpunit
bamboo_repository_git_username=bantu
bamboo_planRepository_1_previousRevision=dc8ff9da28b8ab4ad11c7ea94cca526f17c87fe5
bamboo_repository_75956235_revision_number=dc8ff9da28b8ab4ad11c7ea94cca526f17c87fe5
bamboo_planRepository_branchDisplayName=3.1.x
bamboo_planRepository_1_type=gitv2
bamboo_planRepository_branchName=3.1.x
bamboo_repository_75956235_previous_revision_number=dc8ff9da28b8ab4ad11c7ea94cca526f17c87fe5
bamboo_capability_system_jdk_JDK=/usr/lib/jvm/java-6-sun
bamboo_plan_storageTag=PHPBB3-PR
bamboo_hg_cache_directory=/home/bamboo/xml-data/build-dir/_hg-repositories-cache
bamboo_planRepository_1_username=bantu
bamboo_planRepository_type=gitv2
bamboo_git_cache_directory=/home/bamboo/xml-data/build-dir/_git-repositories-cache
bamboo_ManualBuildTriggerReason_userName=Build Robot
bamboo_repository_git_repositoryUrl=https://github.com/phpbb/phpbb.git
bamboo_repository_75956235_git_branch=3.1.x
bamboo_capability_system_builder_ant_Ant=/usr/share/ant
bamboo_repository_75956235_name=phpBB Ascraeus
bamboo_tmp_directory=/home/bamboo/temp
bamboo_working_directory=/home/bamboo/xml-data/build-dir/PHPBB3-PR-JOB1
bamboo_planKey=PHPBB3-PR
bamboo_capability_local=true
bamboo_planRepository_1_repositoryUrl=https://github.com/phpbb/phpbb.git
bamboo_planRepository_username=bantu
bamboo_capability_system_jdk_JDK_1_6=/usr/lib/jvm/java-6-sun
bamboo_capability_system_jdk_JDK_1_7=/usr/lib/jvm/java-7-openjdk-amd64
bamboo_planRepository_1_branchName=3.1.x
04-Oct-2019 12:13:12 Cannot create cache directory /home/bamboo/.composer/cache/repo/https---repo.packagist.org/, or directory is not writable. Proceeding without cache
04-Oct-2019 12:13:12 Cannot create cache directory /home/bamboo/.composer/cache/files/, or directory is not writable. Proceeding without cache
04-Oct-2019 12:13:13 You are using the deprecated option "dev". Dev packages are installed by default now.
04-Oct-2019 12:13:13 Loading composer repositories with package information
04-Oct-2019 12:13:13 Installing dependencies (including require-dev) from lock file
04-Oct-2019 12:13:13 Package operations: 66 installs, 0 updates, 0 removals
04-Oct-2019 12:13:13   - Installing bantu/ini-get-wrapper (v1.0.1): Downloading (connecting...)Downloading (100%)         
04-Oct-2019 12:13:14   - Installing google/recaptcha (1.1.2): Downloading (connecting...)Downloading (100%)         
04-Oct-2019 12:13:15   - Installing react/promise (v2.7.1): Downloading (connecting...)Downloading (0%)           Downloading (5%)Downloading (30%)Downloading (35%)Downloading (60%)Downloading (65%)Downloading (85%)Downloading (90%)Downloading (95%)Downloading (100%)
04-Oct-2019 12:13:15   - Installing guzzlehttp/streams (3.0.0): Downloading (connecting...)Downloading (0%)           Downloading (25%)Downloading (35%)Downloading (50%)Downloading (60%)Downloading (65%)Downloading (90%)Downloading (100%)
04-Oct-2019 12:13:16   - Installing guzzlehttp/ringphp (1.1.1): Downloading (connecting...)Downloading (0%)           Downloading (10%)Downloading (25%)Downloading (40%)Downloading (50%)Downloading (55%)Downloading (65%)Downloading (75%)Downloading (90%)Downloading (100%)
04-Oct-2019 12:13:17   - Installing lusitanian/oauth (v0.8.11): Downloading (connecting...)Downloading (0%)           Downloading (5%)Downloading (10%)Downloading (15%)Downloading (20%)Downloading (30%)Downloading (35%)Downloading (45%)Downloading (50%)Downloading (55%)Downloading (60%)Downloading (65%)Downloading (70%)Downloading (75%)Downloading (80%)Downloading (85%)Downloading (90%)Downloading (95%)Downloading (100%)
04-Oct-2019 12:13:17   - Installing marc1706/fast-image-size (v1.1.4): Downloading (connecting...)Downloading (100%)         
04-Oct-2019 12:13:18   - Installing paragonie/random_compat (v2.0.18): Downloading (connecting...)Downloading (0%)           Downloading (25%)Downloading (60%)Downloading (85%)Downloading (100%)
04-Oct-2019 12:13:19   - Installing patchwork/utf8 (v1.3.1): Downloading (connecting...)Downloading (0%)           Downloading (5%)Downloading (10%)Downloading (15%)Downloading (20%)Downloading (25%)Downloading (30%)Downloading (35%)Downloading (40%)Downloading (45%)Downloading (50%)Downloading (55%)Downloading (60%)Downloading (65%)Downloading (70%)Downloading (75%)Downloading (80%)Downloading (85%)Downloading (90%)Downloading (95%)Downloading (100%)
04-Oct-2019 12:13:20   - Installing s9e/text-formatter (1.4.5): Downloading (connecting...)Downloading (100%)         
04-Oct-2019 12:13:21   - Installing symfony/polyfill-ctype (v1.11.0): Downloading (connecting...)Downloading (0%)           Downloading (100%)
04-Oct-2019 12:13:21   - Installing symfony/filesystem (v2.8.50): Downloading (connecting...)Downloading (0%)           Downloading (40%)Downloading (45%)Downloading (85%)Downloading (100%)
04-Oct-2019 12:13:22   - Installing symfony/config (v2.8.50): Downloading (connecting...)Downloading (100%)         
04-Oct-2019 12:13:23   - Installing ircmaxell/password-compat (v1.0.4): Downloading (connecting...)Downloading (0%)           Downloading (100%)
04-Oct-2019 12:13:23   - Installing symfony/polyfill-php55 (v1.11.0): Downloading (connecting...)Downloading (0%)           Downloading (80%)Downloading (100%)
04-Oct-2019 12:13:24   - Installing symfony/polyfill-php54 (v1.11.0): Downloading (connecting...)Downloading (100%)         
04-Oct-2019 12:13:24   - Installing symfony/polyfill-mbstring (v1.11.0): Downloading (connecting...)Downloading (0%)           Downloading (30%)Downloading (55%)Downloading (100%)
04-Oct-2019 12:13:25   - Installing symfony/http-foundation (v2.8.50): Downloading (connecting...)Downloading (0%)           Downloading (5%)Downloading (10%)Downloading (15%)Downloading (20%)Downloading (25%)Downloading (30%)Downloading (35%)Downloading (40%)Downloading (45%)Downloading (50%)Downloading (55%)Downloading (60%)Downloading (65%)Downloading (70%)Downloading (75%)Downloading (80%)Downloading (85%)Downloading (90%)Downloading (95%)Downloading (100%)
04-Oct-2019 12:13:25   - Installing symfony/event-dispatcher (v2.8.50): Downloading (connecting...)Downloading (0%)           Downloading (5%)Downloading (10%)Downloading (45%)Downloading (50%)Downloading (55%)Downloading (60%)Downloading (100%)
04-Oct-2019 12:13:26   - Installing psr/log (1.1.0): Downloading (connecting...)Downloading (0%)           Downloading (65%)Downloading (100%)
04-Oct-2019 12:13:27   - Installing symfony/debug (v2.8.50): Downloading (connecting...)Downloading (0%)           Downloading (15%)Downloading (25%)Downloading (35%)Downloading (45%)Downloading (50%)Downloading (60%)Downloading (75%)Downloading (85%)Downloading (90%)Downloading (100%)
04-Oct-2019 12:13:27   - Installing symfony/http-kernel (v2.8.51): Downloading (connecting...)Downloading (100%)         
04-Oct-2019 12:13:28   - Installing symfony/dependency-injection (v2.8.50): Downloading (connecting...)Downloading (0%)           Downloading (5%)Downloading (10%)Downloading (15%)Downloading (20%)Downloading (25%)Downloading (30%)Downloading (35%)Downloading (40%)Downloading (45%)Downloading (50%)Downloading (55%)Downloading (60%)Downloading (65%)Downloading (70%)Downloading (75%)Downloading (80%)Downloading (85%)Downloading (90%)Downloading (95%)Downloading (100%)
04-Oct-2019 12:13:29   - Installing zendframework/zend-stdlib (2.5.1): Downloading (connecting...)Downloading (0%)           Downloading (10%)Downloading (15%)Downloading (20%)Downloading (25%)Downloading (30%)Downloading (40%)Downloading (50%)Downloading (60%)Downloading (65%)Downloading (70%)Downloading (75%)Downloading (80%)Downloading (85%)Downloading (90%)Downloading (100%)
04-Oct-2019 12:13:30   - Installing zendframework/zend-eventmanager (2.5.1): Downloading (connecting...)Downloading (100%)         
04-Oct-2019 12:13:31   - Installing zendframework/zend-code (2.5.1): Downloading (connecting...)Downloading (100%)         
04-Oct-2019 12:13:32   - Installing ocramius/proxy-manager (1.0.2): Downloading (connecting...)Downloading (0%)           Downloading (5%)Downloading (10%)Downloading (15%)Downloading (20%)Downloading (25%)Downloading (30%)Downloading (35%)Downloading (40%)Downloading (45%)Downloading (50%)Downloading (55%)Downloading (65%)Downloading (70%)Downloading (80%)Downloading (85%)Downloading (95%)Downloading (100%)
04-Oct-2019 12:13:32   - Installing symfony/proxy-manager-bridge (v2.8.50): Downloading (connecting...)Downloading (100%)         
04-Oct-2019 12:13:33   - Installing symfony/routing (v2.8.50): Downloading (connecting...)Downloading (100%)         
04-Oct-2019 12:13:34   - Installing twig/twig (v1.42.2): Downloading (connecting...)Downloading (0%)           Downloading (5%)Downloading (10%)Downloading (15%)Downloading (20%)Downloading (25%)Downloading (30%)Downloading (35%)Downloading (40%)Downloading (45%)Downloading (50%)Downloading (55%)Downloading (60%)Downloading (65%)Downloading (70%)Downloading (75%)Downloading (80%)Downloading (85%)Downloading (90%)Downloading (95%)Downloading (100%)
04-Oct-2019 12:13:35   - Installing symfony/twig-bridge (v2.8.50): Downloading (connecting...)Downloading (100%)         
04-Oct-2019 12:13:36   - Installing symfony/dom-crawler (v2.8.50): Downloading (connecting...)Downloading (0%)           Downloading (15%)Downloading (20%)Downloading (35%)Downloading (45%)Downloading (65%)Downloading (90%)Downloading (95%)Downloading (100%)
04-Oct-2019 12:13:36   - Installing symfony/css-selector (v2.8.50): Downloading (connecting...)Downloading (0%)           Downloading (5%)Downloading (10%)Downloading (30%)Downloading (50%)Downloading (55%)Downloading (60%)Downloading (65%)Downloading (70%)Downloading (85%)Downloading (90%)Downloading (95%)Downloading (100%)
04-Oct-2019 12:13:37   - Installing symfony/browser-kit (v2.8.50): Downloading (connecting...)Downloading (100%)         
04-Oct-2019 12:13:38   - Installing guzzlehttp/guzzle (5.3.3): Downloading (connecting...)Downloading (0%)           Downloading (5%)Downloading (10%)Downloading (15%)Downloading (20%)Downloading (25%)Downloading (30%)Downloading (35%)Downloading (40%)Downloading (45%)Downloading (50%)Downloading (55%)Downloading (60%)Downloading (65%)Downloading (70%)Downloading (75%)Downloading (80%)Downloading (85%)Downloading (90%)Downloading (95%)Downloading (100%)
04-Oct-2019 12:13:39   - Installing fabpot/goutte (v2.0.4): Downloading (connecting...)Downloading (0%)           Downloading (15%)Downloading (30%)Downloading (100%)
04-Oct-2019 12:13:39   - Installing facebook/webdriver (1.1.3): Downloading (connecting...)Downloading (100%)         
04-Oct-2019 12:13:40   - Installing symfony/process (v2.8.50): Downloading (connecting...)Downloading (0%)           Downloading (15%)Downloading (20%)Downloading (35%)Downloading (40%)Downloading (55%)Downloading (70%)Downloading (85%)Downloading (100%)
04-Oct-2019 12:13:41   - Installing symfony/console (v2.8.50): Downloading (connecting...)Downloading (0%)           Downloading (5%)Downloading (10%)Downloading (15%)Downloading (20%)Downloading (25%)Downloading (30%)Downloading (35%)Downloading (40%)Downloading (45%)Downloading (50%)Downloading (55%)Downloading (60%)Downloading (65%)Downloading (70%)Downloading (75%)Downloading (80%)Downloading (85%)Downloading (90%)Downloading (95%)Downloading (100%)
04-Oct-2019 12:13:42   - Installing laravel/homestead (v2.2.2): Downloading (connecting...)Downloading (100%)         
04-Oct-2019 12:13:43   - Installing phing/phing (2.4.14): Downloading (connecting...)Downloading (100%)         
04-Oct-2019 12:13:44   - Installing phpdocumentor/reflection-docblock (2.0.5): Downloading (connecting...)Downloading (0%)           Downloading (25%)Downloading (30%)Downloading (45%)Downloading (60%)Downloading (65%)Downloading (80%)Downloading (95%)Downloading (100%)
04-Oct-2019 12:13:44   - Installing symfony/yaml (v2.8.50): Downloading (connecting...)Downloading (0%)           Downloading (15%)Downloading (20%)Downloading (35%)Downloading (40%)Downloading (45%)Downloading (50%)Downloading (65%)Downloading (70%)Downloading (85%)Downloading (95%)Downloading (100%)
04-Oct-2019 12:13:45   - Installing sebastian/version (1.0.6): Downloading (connecting...)Downloading (0%)           Downloading (100%)
04-Oct-2019 12:13:45   - Installing sebastian/global-state (1.1.1): Downloading (connecting...)Downloading (0%)           Downloading (40%)Downloading (80%)Downloading (100%)
04-Oct-2019 12:13:46   - Installing sebastian/recursion-context (1.0.5): Downloading (connecting...)Downloading (0%)           Downloading (35%)Downloading (70%)Downloading (100%)
04-Oct-2019 12:13:47   - Installing sebastian/exporter (1.2.2): Downloading (connecting...)Downloading (0%)           Downloading (95%)Downloading (100%)
04-Oct-2019 12:13:47   - Installing sebastian/environment (1.3.8): Downloading (connecting...)Downloading (0%)           Downloading (15%)Downloading (30%)Downloading (45%)Downloading (60%)Downloading (75%)Downloading (100%)
04-Oct-2019 12:13:48   - Installing sebastian/diff (1.4.3): Downloading (connecting...)Downloading (0%)           Downloading (35%)Downloading (55%)Downloading (90%)Downloading (95%)Downloading (100%)
04-Oct-2019 12:13:49   - Installing sebastian/comparator (1.2.4): Downloading (connecting...)Downloading (0%)           Downloading (10%)Downloading (55%)Downloading (65%)Downloading (75%)Downloading (100%)
04-Oct-2019 12:13:49   - Installing phpunit/php-text-template (1.2.1): Downloading (connecting...)Downloading (0%)           Downloading (35%)Downloading (100%)
04-Oct-2019 12:13:50   - Installing doctrine/instantiator (1.0.5): Downloading (connecting...)Downloading (0%)           Downloading (15%)Downloading (30%)Downloading (45%)Downloading (60%)Downloading (85%)Downloading (100%)
04-Oct-2019 12:13:50   - Installing phpunit/phpunit-mock-objects (2.3.8): Downloading (connecting...)Downloading (0%)           Downloading (5%)Downloading (20%)Downloading (25%)Downloading (35%)Downloading (40%)Downloading (45%)Downloading (50%)Downloading (55%)Downloading (65%)Downloading (70%)Downloading (75%)Downloading (80%)Downloading (90%)Downloading (95%)Downloading (100%)
04-Oct-2019 12:13:51   - Installing phpunit/php-timer (1.0.9): Downloading (connecting...)Downloading (0%)           Downloading (45%)Downloading (90%)Downloading (100%)
04-Oct-2019 12:13:51   - Installing phpunit/php-file-iterator (1.4.5): Downloading (connecting...)Downloading (0%)           Downloading (100%)
04-Oct-2019 12:13:52   - Installing phpunit/php-token-stream (1.4.12): Downloading (connecting...)Downloading (0%)           Downloading (5%)Downloading (10%)Downloading (15%)Downloading (20%)Downloading (100%)
04-Oct-2019 12:13:53   - Installing phpunit/php-code-coverage (2.2.4): Downloading (connecting...)Downloading (0%)           Downloading (5%)Downloading (10%)Downloading (15%)Downloading (20%)Downloading (25%)Downloading (30%)Downloading (35%)Downloading (40%)Downloading (45%)Downloading (50%)Downloading (55%)Downloading (60%)Downloading (65%)Downloading (70%)Downloading (75%)Downloading (85%)Downloading (100%)
04-Oct-2019 12:13:53   - Installing phpspec/prophecy (1.8.1): Downloading (connecting...)Downloading (0%)           Downloading (15%)Downloading (25%)Downloading (35%)Downloading (40%)Downloading (50%)Downloading (60%)Downloading (65%)Downloading (75%)Downloading (85%)Downloading (90%)Downloading (95%)Downloading (100%)
04-Oct-2019 12:13:54   - Installing phpunit/phpunit (4.8.36): Downloading (connecting...)Downloading (0%)           Downloading (5%)Downloading (10%)Downloading (15%)Downloading (20%)Downloading (25%)Downloading (30%)Downloading (35%)Downloading (40%)Downloading (45%)Downloading (50%)Downloading (55%)Downloading (60%)Downloading (65%)Downloading (70%)Downloading (75%)Downloading (80%)Downloading (85%)Downloading (90%)Downloading (95%)Downloading (100%)
04-Oct-2019 12:13:55   - Installing phpunit/dbunit (1.3.2): Downloading (connecting...)Downloading (100%)         
04-Oct-2019 12:13:56   - Installing symfony/finder (v2.8.50): Downloading (connecting...)Downloading (100%)         
04-Oct-2019 12:13:57   - Installing pimple/pimple (v1.0.2): Downloading (connecting...)Downloading (100%)         
04-Oct-2019 12:13:57   - Installing nikic/php-parser (v0.9.5): Downloading (connecting...)Downloading (0%)           Downloading (5%)Downloading (10%)Downloading (15%)Downloading (20%)Downloading (25%)Downloading (30%)Downloading (35%)Downloading (40%)Downloading (45%)Downloading (50%)Downloading (55%)Downloading (60%)Downloading (65%)Downloading (70%)Downloading (75%)Downloading (80%)Downloading (85%)Downloading (90%)Downloading (95%)Downloading (100%)
04-Oct-2019 12:13:58   - Installing michelf/php-markdown (1.8.0): Downloading (connecting...)Downloading (0%)           Downloading (10%)Downloading (35%)Downloading (45%)Downloading (75%)Downloading (85%)Downloading (100%)
04-Oct-2019 12:13:59   - Installing sami/sami (v1.4.1): Downloading (connecting...)Downloading (100%)         
04-Oct-2019 12:14:00   - Installing squizlabs/php_codesniffer (2.9.2): Downloading (connecting...)Downloading (0%)           Downloading (5%)Downloading (10%)Downloading (15%)Downloading (20%)Downloading (25%)Downloading (30%)Downloading (35%)Downloading (40%)Downloading (45%)Downloading (50%)Downloading (55%)Downloading (60%)Downloading (65%)Downloading (80%)Downloading (85%)Downloading (90%)Downloading (95%)Downloading (100%)
04-Oct-2019 12:14:00 lusitanian/oauth suggests installing predis/predis (Allows using the Redis storage backend.)
04-Oct-2019 12:14:00 paragonie/random_compat suggests installing ext-libsodium (Provides a modern crypto API that can be used to generate random bytes.)
04-Oct-2019 12:14:00 patchwork/utf8 suggests installing ext-intl (Use Intl for best performance)
04-Oct-2019 12:14:00 patchwork/utf8 suggests installing ext-wfio (Use WFIO for UTF-8 filesystem access on Windows)
04-Oct-2019 12:14:00 s9e/text-formatter suggests installing ext-intl (Allows international URLs to be accepted by the URL filter)
04-Oct-2019 12:14:00 s9e/text-formatter suggests installing ext-xsl (Enables the XSLT renderer)
04-Oct-2019 12:14:00 symfony/http-kernel suggests installing symfony/class-loader
04-Oct-2019 12:14:00 symfony/http-kernel suggests installing symfony/var-dumper
04-Oct-2019 12:14:00 symfony/dependency-injection suggests installing symfony/expression-language (For using expressions in service container configuration)
04-Oct-2019 12:14:00 zendframework/zend-stdlib suggests installing zendframework/zend-filter (To support naming strategy hydrator usage)
04-Oct-2019 12:14:00 zendframework/zend-stdlib suggests installing zendframework/zend-serializer (Zend\Serializer component)
04-Oct-2019 12:14:00 zendframework/zend-stdlib suggests installing zendframework/zend-servicemanager (To support hydrator plugin manager usage)
04-Oct-2019 12:14:00 zendframework/zend-code suggests installing doctrine/common (Doctrine\Common >=2.1 for annotation features)
04-Oct-2019 12:14:00 ocramius/proxy-manager suggests installing ocramius/generated-hydrator (To have very fast object to array to object conversion for ghost objects)
04-Oct-2019 12:14:00 ocramius/proxy-manager suggests installing zendframework/zend-json (To have the JsonRpc adapter (Remote Object feature))
04-Oct-2019 12:14:00 ocramius/proxy-manager suggests installing zendframework/zend-soap (To have the Soap adapter (Remote Object feature))
04-Oct-2019 12:14:00 ocramius/proxy-manager suggests installing zendframework/zend-xmlrpc (To have the XmlRpc adapter (Remote Object feature))
04-Oct-2019 12:14:00 symfony/routing suggests installing doctrine/annotations (For using the annotation loader)
04-Oct-2019 12:14:00 symfony/routing suggests installing symfony/expression-language (For using expression matching)
04-Oct-2019 12:14:00 symfony/twig-bridge suggests installing symfony/asset (For using the AssetExtension)
04-Oct-2019 12:14:00 symfony/twig-bridge suggests installing symfony/expression-language (For using the ExpressionExtension)
04-Oct-2019 12:14:00 symfony/twig-bridge suggests installing symfony/form (For using the FormExtension)
04-Oct-2019 12:14:00 symfony/twig-bridge suggests installing symfony/security (For using the SecurityExtension)
04-Oct-2019 12:14:00 symfony/twig-bridge suggests installing symfony/stopwatch (For using the StopwatchExtension)
04-Oct-2019 12:14:00 symfony/twig-bridge suggests installing symfony/templating (For using the TwigEngine)
04-Oct-2019 12:14:00 symfony/twig-bridge suggests installing symfony/translation (For using the TranslationExtension)
04-Oct-2019 12:14:00 symfony/twig-bridge suggests installing symfony/var-dumper (For using the DumpExtension)
04-Oct-2019 12:14:00 facebook/webdriver suggests installing phpdocumentor/phpdocumentor (2.*)
04-Oct-2019 12:14:00 symfony/console suggests installing psr/log-implementation (For using the console logger)
04-Oct-2019 12:14:00 phpdocumentor/reflection-docblock suggests installing dflydev/markdown (~1.0)
04-Oct-2019 12:14:00 phpdocumentor/reflection-docblock suggests installing erusev/parsedown (~1.0)
04-Oct-2019 12:14:00 sebastian/global-state suggests installing ext-uopz (*)
04-Oct-2019 12:14:00 phpunit/phpunit-mock-objects suggests installing ext-soap (*)
04-Oct-2019 12:14:00 phpunit/phpunit suggests installing phpunit/php-invoker (~1.1)
04-Oct-2019 12:14:00 Package phpunit/phpunit-mock-objects is abandoned, you should avoid using it. No replacement was suggested.
04-Oct-2019 12:14:00 Package phpunit/dbunit is abandoned, you should avoid using it. No replacement was suggested.
04-Oct-2019 12:14:00 Package sami/sami is abandoned, you should avoid using it. No replacement was suggested.
04-Oct-2019 12:14:00 Generating autoload files
04-Oct-2019 12:14:01
04-Oct-2019 12:14:01 Notice: A non well formed numeric value encountered in /data/phpBB/vendor/phing/phing/classes/phing/Phing.php on line 1305
04-Oct-2019 12:14:01
04-Oct-2019 12:14:01 Call Stack:
04-Oct-2019 12:14:01     0.0003     352256   1. {main}() /data/phpBB/vendor/phing/phing/bin/phing:0
04-Oct-2019 12:14:01     0.0006     359304   2. require_once('/data/phpBB/vendor/phing/phing/bin/phing.php') /data/phpBB/vendor/phing/phing/bin/phing:18
04-Oct-2019 12:14:01     0.0292    3352736   3. Phing::startup() /data/phpBB/vendor/phing/phing/bin/phing.php:33
04-Oct-2019 12:14:01     0.0295    3426768   4. Phing::setIni() /data/phpBB/vendor/phing/phing/classes/phing/Phing.php:1393
04-Oct-2019 12:14:01     0.0295    3427008   5. Phing::convertShorthand() /data/phpBB/vendor/phing/phing/classes/phing/Phing.php:1335
04-Oct-2019 12:14:01
04-Oct-2019 12:14:01 Buildfile: /data/build/build.xml
04-Oct-2019 12:14:01
04-Oct-2019 12:14:01 phpBB > clean:
04-Oct-2019 12:14:01
04-Oct-2019 12:14:01    [delete] Directory /data/build/logs does not exist or is not a directory.
04-Oct-2019 12:14:01    [delete] Directory /data/build/api does not exist or is not a directory.
04-Oct-2019 12:14:01    [delete] Directory /data/build/codebrowser does not exist or is not a directory.
04-Oct-2019 12:14:01    [delete] Directory /data/build/coverage does not exist or is not a directory.
04-Oct-2019 12:14:01    [delete] Directory /data/build/cpd does not exist or is not a directory.
04-Oct-2019 12:14:01    [delete] Directory /data/build/dependencies does not exist or is not a directory.
04-Oct-2019 12:14:01    [delete] Directory /data/build/new_version does not exist or is not a directory.
04-Oct-2019 12:14:01    [delete] Directory /data/build/old_versions does not exist or is not a directory.
04-Oct-2019 12:14:01    [delete] Directory /data/build/save does not exist or is not a directory.
04-Oct-2019 12:14:01
04-Oct-2019 12:14:01 phpBB > prepare:
04-Oct-2019 12:14:01
04-Oct-2019 12:14:01     [mkdir] Created dir: /data/build/logs
04-Oct-2019 12:14:01     [mkdir] Created dir: /data/build/api
04-Oct-2019 12:14:01     [mkdir] Created dir: /data/build/codebrowser
04-Oct-2019 12:14:01     [mkdir] Created dir: /data/build/coverage
04-Oct-2019 12:14:01     [mkdir] Created dir: /data/build/cpd
04-Oct-2019 12:14:01     [mkdir] Created dir: /data/build/dependencies
04-Oct-2019 12:14:01     [mkdir] Created dir: /data/build/new_version
04-Oct-2019 12:14:01     [mkdir] Created dir: /data/build/new_version/files
04-Oct-2019 12:14:01     [mkdir] Created dir: /data/build/new_version/patches
04-Oct-2019 12:14:01     [mkdir] Created dir: /data/build/new_version/release_files
04-Oct-2019 12:14:01     [mkdir] Created dir: /data/build/new_version/update
04-Oct-2019 12:14:01     [mkdir] Created dir: /data/build/old_versions
04-Oct-2019 12:14:01     [mkdir] Created dir: /data/build/save
04-Oct-2019 12:14:01
04-Oct-2019 12:14:01 BUILD FINISHED
04-Oct-2019 12:14:01
04-Oct-2019 12:14:01 Total time: 0.0764 seconds
04-Oct-2019 12:14:01
04-Oct-2019 12:14:01 Finished task 'Prepare directory' with result: Success
04-Oct-2019 12:14:01 Skipping execution of task 'Run sniffs' as it is disabled
04-Oct-2019 12:14:01
Substituting variable: ${bamboo.working.directory} with /home/bamboo/xml-data/build-dir/PHPBB3-PR-JOB1
04-Oct-2019 12:14:01 Starting task 'Run sniffs' of type 'com.atlassian.bamboo.plugins.bamboo-docker-plugin:task.docker.cli'
04-Oct-2019 12:14:01 Running image name (phpbb:php-7.1)
04-Oct-2019 12:14:01
Beginning to execute external process for build 'phpBB3 - Pull Requests - Build and Test Job #9632 (PHPBB3-PR-JOB1-9632)'
... running command line:
/usr/bin/docker run --volume /home/bamboo/xml-data/build-dir/PHPBB3-PR-JOB1:/data --workdir /data/build --rm -u=991 phpbb:php-7.1 ../phpBB/vendor/bin/phing sniff
... in: /home/bamboo/xml-data/build-dir/PHPBB3-PR-JOB1
... using extra environment variables:
bamboo_planRepository_1_branch=3.1.x
bamboo_planRepository_1_branchDisplayName=3.1.x
bamboo_repository_revision_number=dc8ff9da28b8ab4ad11c7ea94cca526f17c87fe5
bamboo_PRref=3.2.x
bamboo_resultsUrl=https://bamboo.phpbb.com/browse/PHPBB3-PR-JOB1-9632
bamboo_capability_system_builder_command_Git=/usr/bin/git
bamboo_repository_75956235_git_username=bantu
bamboo_build_working_directory=/home/bamboo/xml-data/build-dir/PHPBB3-PR-JOB1
bamboo_planRepository_1_name=phpBB Ascraeus
bamboo_buildKey=PHPBB3-PR-JOB1
bamboo_capability_phpbb_tests=true
bamboo_shortPlanName=Pull Requests
bamboo_capability_system_builder_command_fop=/usr/bin/fop
bamboo_capability_dbms_sqlite_2=true
bamboo_planRepository_name=phpBB Ascraeus
bamboo_PRnumber=5703
bamboo_buildNumber=9632
bamboo_repository_75956235_git_repositoryUrl=https://github.com/phpbb/phpbb.git
bamboo_capability_system_builder_phpunit_PHPUnit=/usr/bin/phpunit
bamboo_shortJobName=Build and Test Job
bamboo_buildResultsUrl=https://bamboo.phpbb.com/browse/PHPBB3-PR-JOB1-9632
bamboo_repository_75956235_branch_name=3.1.x
bamboo_planRepository_repositoryUrl=https://github.com/phpbb/phpbb.git
bamboo_agentId=131073
bamboo_planName=phpBB3 - Pull Requests
bamboo_build_commandline_com_atlassian_bamboo_plugins_scripttask_task_builder_script_7=/bin/sh /home/bamboo/temp/PHPBB3-PR-JOB1-9632-ScriptBuildTask-103605683388361967.sh
bamboo_shortPlanKey=PR
bamboo_shortJobKey=JOB1
bamboo_capability_dbms_mysql_55=true
bamboo_capability_system_jdk_JDK_1_7_0_65=/usr/lib/jvm/java-7-openjdk-amd64
bamboo_planRepository_revision=dc8ff9da28b8ab4ad11c7ea94cca526f17c87fe5
bamboo_buildTimeStamp=2019-10-04T12:13:05.337Z
bamboo_repository_previous_revision_number=dc8ff9da28b8ab4ad11c7ea94cca526f17c87fe5
bamboo_capability_system_jdk_JDK_1_6_0_16=/usr/lib/jvm/java-6-sun-1.6.0.16
bamboo_capability_system_builder_mvn2_Maven_2=/usr/share/maven2
bamboo_planRepository_previousRevision=dc8ff9da28b8ab4ad11c7ea94cca526f17c87fe5
bamboo_build_commandline_com_atlassian_bamboo_plugins_scripttask_task_builder_script_4=/bin/sh /home/bamboo/temp/PHPBB3-PR-JOB1-9632-ScriptBuildTask-116930823601058291.sh
bamboo_repository_git_branch=3.1.x
bamboo_buildResultKey=PHPBB3-PR-JOB1-9632
bamboo_repository_branch_name=3.1.x
bamboo_buildPlanName=phpBB3 - Pull Requests - Build and Test Job
bamboo_planRepository_1_revision=dc8ff9da28b8ab4ad11c7ea94cca526f17c87fe5
bamboo_repository_name=phpBB Ascraeus
bamboo_buildFailed=false
bamboo_capability_system_docker_executable=/usr/bin/docker
bamboo_build_commandline_com_atlassian_bamboo_plugins_bamboo_docker_plugin_task_docker_cli_12=/usr/bin/docker run --volume /home/bamboo/xml-data/build-dir/PHPBB3-PR-JOB1:/data --workdir /data/phpBB --rm -e HOME=/home/bamboo -u=991 phpbb:php-7.1 /bin/bash -c php ../composer.phar install --dev; cd ../build; ../phpBB/vendor/bin/phing clean prepare
bamboo_build_commandline_com_atlassian_bamboo_plugins_bamboo_docker_plugin_task_docker_cli_13=/usr/bin/docker build --force-rm=true --tag=phpbb:php-7.1 /home/bamboo/xml-data/build-dir/PHPBB3-PR-JOB1
bamboo_planRepository_branch=3.1.x
bamboo_agentWorkingDirectory=/home/bamboo/xml-data/build-dir
bamboo_capability_system_git_executable=/usr/bin/git
bamboo_capability_system_builder_phpunit_PHPUnit_3_4=/usr/bin/phpunit
bamboo_repository_git_username=bantu
bamboo_planRepository_1_previousRevision=dc8ff9da28b8ab4ad11c7ea94cca526f17c87fe5
bamboo_repository_75956235_revision_number=dc8ff9da28b8ab4ad11c7ea94cca526f17c87fe5
bamboo_planRepository_branchDisplayName=3.1.x
bamboo_planRepository_1_type=gitv2
bamboo_planRepository_branchName=3.1.x
bamboo_repository_75956235_previous_revision_number=dc8ff9da28b8ab4ad11c7ea94cca526f17c87fe5
bamboo_capability_system_jdk_JDK=/usr/lib/jvm/java-6-sun
bamboo_plan_storageTag=PHPBB3-PR
bamboo_hg_cache_directory=/home/bamboo/xml-data/build-dir/_hg-repositories-cache
bamboo_planRepository_1_username=bantu
bamboo_planRepository_type=gitv2
bamboo_git_cache_directory=/home/bamboo/xml-data/build-dir/_git-repositories-cache
bamboo_ManualBuildTriggerReason_userName=Build Robot
bamboo_repository_git_repositoryUrl=https://github.com/phpbb/phpbb.git
bamboo_repository_75956235_git_branch=3.1.x
bamboo_capability_system_builder_ant_Ant=/usr/share/ant
bamboo_repository_75956235_name=phpBB Ascraeus
bamboo_tmp_directory=/home/bamboo/temp
bamboo_working_directory=/home/bamboo/xml-data/build-dir/PHPBB3-PR-JOB1
bamboo_planKey=PHPBB3-PR
bamboo_capability_local=true
bamboo_planRepository_1_repositoryUrl=https://github.com/phpbb/phpbb.git
bamboo_planRepository_username=bantu
bamboo_capability_system_jdk_JDK_1_6=/usr/lib/jvm/java-6-sun
bamboo_capability_system_jdk_JDK_1_7=/usr/lib/jvm/java-7-openjdk-amd64
bamboo_planRepository_1_branchName=3.1.x
04-Oct-2019 12:14:01
04-Oct-2019 12:14:01 Notice: A non well formed numeric value encountered in /data/phpBB/vendor/phing/phing/classes/phing/Phing.php on line 1305
04-Oct-2019 12:14:01
04-Oct-2019 12:14:01 Call Stack:
04-Oct-2019 12:14:01     0.0002     351120   1. {main}() /data/phpBB/vendor/phing/phing/bin/phing:0
04-Oct-2019 12:14:01     0.0004     358168   2. require_once('/data/phpBB/vendor/phing/phing/bin/phing.php') /data/phpBB/vendor/phing/phing/bin/phing:18
04-Oct-2019 12:14:01     0.0295    3351600   3. Phing::startup() /data/phpBB/vendor/phing/phing/bin/phing.php:33
04-Oct-2019 12:14:01     0.0298    3425624   4. Phing::setIni() /data/phpBB/vendor/phing/phing/classes/phing/Phing.php:1393
04-Oct-2019 12:14:01     0.0298    3425864   5. Phing::convertShorthand() /data/phpBB/vendor/phing/phing/classes/phing/Phing.php:1335
04-Oct-2019 12:14:01
04-Oct-2019 12:14:02 Buildfile: /data/build/build.xml
04-Oct-2019 12:14:02
04-Oct-2019 12:14:02 phpBB > sniff:
04-Oct-2019 12:14:02
04-Oct-2019 12:14:06 ............................................................  60 / 725 (8%)
04-Oct-2019 12:14:07 ............................................................ 120 / 725 (17%)
04-Oct-2019 12:14:07 ............................................................ 180 / 725 (25%)
04-Oct-2019 12:14:08 ............................................................ 240 / 725 (33%)
04-Oct-2019 12:14:10 ............................................................ 300 / 725 (41%)
04-Oct-2019 12:14:14 ...........................E................................ 360 / 725 (50%)
04-Oct-2019 12:14:17 ............................................................ 420 / 725 (58%)
04-Oct-2019 12:14:19 ............................................................ 480 / 725 (66%)
04-Oct-2019 12:14:22 ............................................................ 540 / 725 (74%)
04-Oct-2019 12:14:24 ............................................................ 600 / 725 (83%)
04-Oct-2019 12:14:27 ............................................................ 660 / 725 (91%)
04-Oct-2019 12:14:29 ............................................................ 720 / 725 (99%)
04-Oct-2019 12:14:29 .....
04-Oct-2019 12:14:29
04-Oct-2019 12:14:29
04-Oct-2019 12:14:29 FILE: /data/phpBB/phpbb/session.php
04-Oct-2019 12:14:29 ----------------------------------------------------------------------
04-Oct-2019 12:14:29 FOUND 1 ERROR AFFECTING 1 LINE
04-Oct-2019 12:14:29 ----------------------------------------------------------------------
04-Oct-2019 12:14:29 1098 | ERROR | [x] Whitespace found at end of line
04-Oct-2019 12:14:29       |       |     (Squiz.WhiteSpace.SuperfluousWhitespace.EndLine)
04-Oct-2019 12:14:29 ----------------------------------------------------------------------
04-Oct-2019 12:14:29 PHPCBF CAN FIX THE 1 MARKED SNIFF VIOLATIONS AUTOMATICALLY
04-Oct-2019 12:14:29 ----------------------------------------------------------------------
04-Oct-2019 12:14:29
04-Oct-2019 12:14:29 Time: 27.01 secs; Memory: 70Mb
04-Oct-2019 12:14:29
04-Oct-2019 12:14:33 ............................................................  60 / 206 (29%)
04-Oct-2019 12:14:42 ............................................................ 120 / 206 (58%)
04-Oct-2019 12:14:50 ............................................................ 180 / 206 (87%)
04-Oct-2019 12:14:53 ..........................
04-Oct-2019 12:14:53
04-Oct-2019 12:14:53 Time: 24.45 secs; Memory: 40Mb
04-Oct-2019 12:14:53
04-Oct-2019 12:14:53
04-Oct-2019 12:14:53
04-Oct-2019 12:14:53 Time: 14ms; Memory: 4Mb
04-Oct-2019 12:14:53
04-Oct-2019 12:14:53        [if] Error in IfTask
04-Oct-2019 12:14:53 Execution of target "sniff" failed for the following reason: /data/build/build.xml:108:6: /data/build/build.xml:114:9: PHP Code Sniffer failed.
04-Oct-2019 12:14:53
04-Oct-2019 12:14:53 BUILD FAILED
04-Oct-2019 12:14:53 /data/build/build.xml:108:6: /data/build/build.xml:114:9: PHP Code Sniffer failed.
04-Oct-2019 12:14:53 Total time: 51.6869 seconds
04-Oct-2019 12:14:53
04-Oct-2019 12:14:53 Error occurred while running Task 'Run sniffs(11)' of type com.atlassian.bamboo.plugins.bamboo-docker-plugin:task.docker.cli.
04-Oct-2019 12:14:53 com.atlassian.bamboo.task.TaskException: Failed to execute task
04-Oct-2019 12:14:53         at com.atlassian.bamboo.plugins.docker.service.RunService.execute(RunService.java:75)
04-Oct-2019 12:14:53         at com.atlassian.bamboo.plugins.docker.tasks.cli.DockerCliTask.execute(DockerCliTask.java:70)
04-Oct-2019 12:14:53         at com.atlassian.bamboo.task.TaskExecutorImpl.lambda$executeTasks$3(TaskExecutorImpl.java:285)
04-Oct-2019 12:14:53         at com.atlassian.bamboo.task.TaskExecutorImpl.executeTaskWithPrePostActions(TaskExecutorImpl.java:224)
04-Oct-2019 12:14:53         at com.atlassian.bamboo.task.TaskExecutorImpl.executeTasks(TaskExecutorImpl.java:285)
04-Oct-2019 12:14:53         at com.atlassian.bamboo.task.TaskExecutorImpl.execute(TaskExecutorImpl.java:112)
04-Oct-2019 12:14:53         at com.atlassian.bamboo.build.pipeline.tasks.ExecuteBuildTask.call(ExecuteBuildTask.java:71)
04-Oct-2019 12:14:53         at com.atlassian.bamboo.v2.build.agent.DefaultBuildAgent.executeBuildPhase(DefaultBuildAgent.java:203)
04-Oct-2019 12:14:53         at com.atlassian.bamboo.v2.build.agent.DefaultBuildAgent.build(DefaultBuildAgent.java:175)
04-Oct-2019 12:14:53         at com.atlassian.bamboo.v2.build.agent.BuildAgentControllerImpl.lambda$waitAndPerformBuild$0(BuildAgentControllerImpl.java:122)
04-Oct-2019 12:14:53         at com.atlassian.bamboo.variable.CustomVariableContextImpl.withVariableSubstitutor(CustomVariableContextImpl.java:185)
04-Oct-2019 12:14:53         at com.atlassian.bamboo.v2.build.agent.BuildAgentControllerImpl.waitAndPerformBuild(BuildAgentControllerImpl.java:117)
04-Oct-2019 12:14:53         at com.atlassian.bamboo.v2.build.agent.DefaultBuildAgent$1.run(DefaultBuildAgent.java:126)
04-Oct-2019 12:14:53         at com.atlassian.bamboo.utils.BambooRunnables$1.run(BambooRunnables.java:48)
04-Oct-2019 12:14:53         at com.atlassian.bamboo.security.ImpersonationHelper.runWith(ImpersonationHelper.java:26)
04-Oct-2019 12:14:53         at com.atlassian.bamboo.security.ImpersonationHelper.runWithSystemAuthority(ImpersonationHelper.java:17)
04-Oct-2019 12:14:53         at com.atlassian.bamboo.security.ImpersonationHelper$1.run(ImpersonationHelper.java:41)
04-Oct-2019 12:14:53         at java.lang.Thread.run(Thread.java:748)
04-Oct-2019 12:14:53 Caused by: com.atlassian.bamboo.docker.DockerException: Error running Docker run command
04-Oct-2019 12:14:53         at com.atlassian.bamboo.docker.DockerContainerServiceImpl.run(DockerContainerServiceImpl.java:118)
04-Oct-2019 12:14:53         at sun.reflect.GeneratedMethodAccessor2260.invoke(Unknown Source)
04-Oct-2019 12:14:53         at sun.reflect.DelegatingMethodAccessorImpl.invoke(DelegatingMethodAccessorImpl.java:43)
04-Oct-2019 12:14:53         at java.lang.reflect.Method.invoke(Method.java:498)
04-Oct-2019 12:14:53         at com.atlassian.plugin.util.ContextClassLoaderSettingInvocationHandler.invoke(ContextClassLoaderSettingInvocationHandler.java:26)
04-Oct-2019 12:14:53         at com.sun.proxy.$Proxy401.run(Unknown Source)
04-Oct-2019 12:14:53         at sun.reflect.GeneratedMethodAccessor2260.invoke(Unknown Source)
04-Oct-2019 12:14:53         at sun.reflect.DelegatingMethodAccessorImpl.invoke(DelegatingMethodAccessorImpl.java:43)
04-Oct-2019 12:14:53         at java.lang.reflect.Method.invoke(Method.java:498)
04-Oct-2019 12:14:53         at org.springframework.aop.support.AopUtils.invokeJoinpointUsingReflection(AopUtils.java:302)
04-Oct-2019 12:14:53         at org.eclipse.gemini.blueprint.service.importer.support.internal.aop.ServiceInvoker.doInvoke(ServiceInvoker.java:56)
04-Oct-2019 12:14:53         at org.eclipse.gemini.blueprint.service.importer.support.internal.aop.ServiceInvoker.invoke(ServiceInvoker.java:60)
04-Oct-2019 12:14:53         at org.springframework.aop.framework.ReflectiveMethodInvocation.proceed(ReflectiveMethodInvocation.java:179)
04-Oct-2019 12:14:53         at org.springframework.aop.support.DelegatingIntroductionInterceptor.doProceed(DelegatingIntroductionInterceptor.java:133)
04-Oct-2019 12:14:53         at org.springframework.aop.support.DelegatingIntroductionInterceptor.invoke(DelegatingIntroductionInterceptor.java:121)
04-Oct-2019 12:14:53         at org.springframework.aop.framework.ReflectiveMethodInvocation.proceed(ReflectiveMethodInvocation.java:179)
04-Oct-2019 12:14:53         at org.eclipse.gemini.blueprint.service.util.internal.aop.ServiceTCCLInterceptor.invokeUnprivileged(ServiceTCCLInterceptor.java:70)
04-Oct-2019 12:14:53         at org.eclipse.gemini.blueprint.service.util.internal.aop.ServiceTCCLInterceptor.invoke(ServiceTCCLInterceptor.java:53)
04-Oct-2019 12:14:53         at org.springframework.aop.framework.ReflectiveMethodInvocation.proceed(ReflectiveMethodInvocation.java:179)
04-Oct-2019 12:14:53         at org.eclipse.gemini.blueprint.service.importer.support.LocalBundleContextAdvice.invoke(LocalBundleContextAdvice.java:57)
04-Oct-2019 12:14:53         at org.springframework.aop.framework.ReflectiveMethodInvocation.proceed(ReflectiveMethodInvocation.java:179)
04-Oct-2019 12:14:53         at org.springframework.aop.support.DelegatingIntroductionInterceptor.doProceed(DelegatingIntroductionInterceptor.java:133)
04-Oct-2019 12:14:53         at org.springframework.aop.support.DelegatingIntroductionInterceptor.invoke(DelegatingIntroductionInterceptor.java:121)
04-Oct-2019 12:14:53         at org.springframework.aop.framework.ReflectiveMethodInvocation.proceed(ReflectiveMethodInvocation.java:179)
04-Oct-2019 12:14:53         at org.springframework.aop.framework.JdkDynamicAopProxy.invoke(JdkDynamicAopProxy.java:207)
04-Oct-2019 12:14:53         at com.sun.proxy.$Proxy662.run(Unknown Source)
04-Oct-2019 12:14:53         at com.atlassian.bamboo.plugins.docker.client.DockerCmd.run(DockerCmd.java:51)
04-Oct-2019 12:14:53         at com.atlassian.bamboo.plugins.docker.service.RunService.execute(RunService.java:64)
04-Oct-2019 12:14:53         ... 17 more
04-Oct-2019 12:14:53 Caused by: com.atlassian.utils.process.ProcessException: Error executing /usr/bin/docker run --volume /home/bamboo/xml-data/build-dir/PHPBB3-PR-JOB1:/data --workdir /data/build --rm -u=991 phpbb:php-7.1 ../phpBB/vendor/bin/phing sniff
04-Oct-2019 12:14:53         at com.atlassian.bamboo.docker.DockerContainerServiceImpl.execute(DockerContainerServiceImpl.java:252)
04-Oct-2019 12:14:53         at com.atlassian.bamboo.docker.DockerContainerServiceImpl.run(DockerContainerServiceImpl.java:106)
04-Oct-2019 12:14:53         ... 44 more
04-Oct-2019 12:14:53 Starting task 'Parsing test results produced by script' of type 'com.atlassian.bamboo.plugins.testresultparser:task.testresultparser.junit'
04-Oct-2019 12:14:53 Parsing test results under /home/bamboo/xml-data/build-dir/PHPBB3-PR-JOB1...
04-Oct-2019 12:14:53 Failing task since test cases were expected but none were found.
04-Oct-2019 12:14:53 Finished task 'Parsing test results produced by script' with result: Failed
04-Oct-2019 12:14:53
Substituting variable: ${bamboo.PRnumber} with 5703
04-Oct-2019 12:14:53
Substituting variable: ${bamboo.buildResultsUrl} with https://bamboo.phpbb.com/browse/PHPBB3-PR-JOB1-9632
04-Oct-2019 12:14:53
Substituting variable: ${bamboo.buildResultsUrl} with https://bamboo.phpbb.com/browse/PHPBB3-PR-JOB1-9632
04-Oct-2019 12:14:53 Starting task 'Set result build status' of type 'com.atlassian.bamboo.plugins.scripttask:task.builder.script'
04-Oct-2019 12:14:53
Beginning to execute external process for build 'phpBB3 - Pull Requests - Build and Test Job #9632 (PHPBB3-PR-JOB1-9632)'
... running command line:
/bin/sh /home/bamboo/temp/PHPBB3-PR-JOB1-9632-ScriptBuildTask-500324507362462108.sh
... in: /home/bamboo/xml-data/build-dir/PHPBB3-PR-JOB1
... using extra environment variables:
bamboo_planRepository_1_branch=3.1.x
bamboo_planRepository_1_branchDisplayName=3.1.x
bamboo_repository_revision_number=dc8ff9da28b8ab4ad11c7ea94cca526f17c87fe5
bamboo_PRref=3.2.x
bamboo_resultsUrl=https://bamboo.phpbb.com/browse/PHPBB3-PR-JOB1-9632
bamboo_capability_system_builder_command_Git=/usr/bin/git
bamboo_repository_75956235_git_username=bantu
bamboo_build_working_directory=/home/bamboo/xml-data/build-dir/PHPBB3-PR-JOB1
bamboo_planRepository_1_name=phpBB Ascraeus
bamboo_buildKey=PHPBB3-PR-JOB1
bamboo_capability_phpbb_tests=true
bamboo_shortPlanName=Pull Requests
bamboo_capability_system_builder_command_fop=/usr/bin/fop
bamboo_capability_dbms_sqlite_2=true
bamboo_planRepository_name=phpBB Ascraeus
bamboo_PRnumber=5703
bamboo_buildNumber=9632
bamboo_repository_75956235_git_repositoryUrl=https://github.com/phpbb/phpbb.git
bamboo_capability_system_builder_phpunit_PHPUnit=/usr/bin/phpunit
bamboo_shortJobName=Build and Test Job
bamboo_buildResultsUrl=https://bamboo.phpbb.com/browse/PHPBB3-PR-JOB1-9632
bamboo_repository_75956235_branch_name=3.1.x
bamboo_planRepository_repositoryUrl=https://github.com/phpbb/phpbb.git
bamboo_agentId=131073
bamboo_planName=phpBB3 - Pull Requests
bamboo_build_commandline_com_atlassian_bamboo_plugins_scripttask_task_builder_script_7=/bin/sh /home/bamboo/temp/PHPBB3-PR-JOB1-9632-ScriptBuildTask-103605683388361967.sh
bamboo_shortPlanKey=PR
bamboo_shortJobKey=JOB1
bamboo_capability_dbms_mysql_55=true
bamboo_capability_system_jdk_JDK_1_7_0_65=/usr/lib/jvm/java-7-openjdk-amd64
bamboo_planRepository_revision=dc8ff9da28b8ab4ad11c7ea94cca526f17c87fe5
bamboo_buildTimeStamp=2019-10-04T12:13:05.337Z
bamboo_repository_previous_revision_number=dc8ff9da28b8ab4ad11c7ea94cca526f17c87fe5
bamboo_capability_system_jdk_JDK_1_6_0_16=/usr/lib/jvm/java-6-sun-1.6.0.16
bamboo_capability_system_builder_mvn2_Maven_2=/usr/share/maven2
bamboo_planRepository_previousRevision=dc8ff9da28b8ab4ad11c7ea94cca526f17c87fe5
bamboo_build_commandline_com_atlassian_bamboo_plugins_scripttask_task_builder_script_4=/bin/sh /home/bamboo/temp/PHPBB3-PR-JOB1-9632-ScriptBuildTask-116930823601058291.sh
bamboo_repository_git_branch=3.1.x
bamboo_buildResultKey=PHPBB3-PR-JOB1-9632
bamboo_repository_branch_name=3.1.x
bamboo_buildPlanName=phpBB3 - Pull Requests - Build and Test Job
bamboo_planRepository_1_revision=dc8ff9da28b8ab4ad11c7ea94cca526f17c87fe5
bamboo_repository_name=phpBB Ascraeus
bamboo_buildFailed=true
bamboo_capability_system_docker_executable=/usr/bin/docker
bamboo_build_commandline_com_atlassian_bamboo_plugins_bamboo_docker_plugin_task_docker_cli_11=/usr/bin/docker run --volume /home/bamboo/xml-data/build-dir/PHPBB3-PR-JOB1:/data --workdir /data/build --rm -u=991 phpbb:php-7.1 ../phpBB/vendor/bin/phing sniff
bamboo_build_commandline_com_atlassian_bamboo_plugins_bamboo_docker_plugin_task_docker_cli_12=/usr/bin/docker run --volume /home/bamboo/xml-data/build-dir/PHPBB3-PR-JOB1:/data --workdir /data/phpBB --rm -e HOME=/home/bamboo -u=991 phpbb:php-7.1 /bin/bash -c php ../composer.phar install --dev; cd ../build; ../phpBB/vendor/bin/phing clean prepare
bamboo_build_commandline_com_atlassian_bamboo_plugins_bamboo_docker_plugin_task_docker_cli_13=/usr/bin/docker build --force-rm=true --tag=phpbb:php-7.1 /home/bamboo/xml-data/build-dir/PHPBB3-PR-JOB1
bamboo_planRepository_branch=3.1.x
bamboo_agentWorkingDirectory=/home/bamboo/xml-data/build-dir
bamboo_jobFailed=true
bamboo_capability_system_git_executable=/usr/bin/git
bamboo_capability_system_builder_phpunit_PHPUnit_3_4=/usr/bin/phpunit
bamboo_repository_git_username=bantu
bamboo_planRepository_1_previousRevision=dc8ff9da28b8ab4ad11c7ea94cca526f17c87fe5
bamboo_repository_75956235_revision_number=dc8ff9da28b8ab4ad11c7ea94cca526f17c87fe5
bamboo_planRepository_branchDisplayName=3.1.x
bamboo_planRepository_1_type=gitv2
bamboo_planRepository_branchName=3.1.x
bamboo_repository_75956235_previous_revision_number=dc8ff9da28b8ab4ad11c7ea94cca526f17c87fe5
bamboo_capability_system_jdk_JDK=/usr/lib/jvm/java-6-sun
bamboo_plan_storageTag=PHPBB3-PR
bamboo_hg_cache_directory=/home/bamboo/xml-data/build-dir/_hg-repositories-cache
bamboo_planRepository_1_username=bantu
bamboo_planRepository_type=gitv2
bamboo_git_cache_directory=/home/bamboo/xml-data/build-dir/_git-repositories-cache
bamboo_ManualBuildTriggerReason_userName=Build Robot
bamboo_repository_git_repositoryUrl=https://github.com/phpbb/phpbb.git
bamboo_repository_75956235_git_branch=3.1.x
bamboo_capability_system_builder_ant_Ant=/usr/share/ant
bamboo_repository_75956235_name=phpBB Ascraeus
bamboo_tmp_directory=/home/bamboo/temp
bamboo_working_directory=/home/bamboo/xml-data/build-dir/PHPBB3-PR-JOB1
bamboo_planKey=PHPBB3-PR
bamboo_capability_local=true
bamboo_planRepository_1_repositoryUrl=https://github.com/phpbb/phpbb.git
bamboo_planRepository_username=bantu
bamboo_capability_system_jdk_JDK_1_6=/usr/lib/jvm/java-6-sun
bamboo_capability_system_jdk_JDK_1_7=/usr/lib/jvm/java-7-openjdk-amd64
bamboo_planRepository_1_branchName=3.1.x
04-Oct-2019 12:14:54 From https://github.com/phpbb/phpbb
04-Oct-2019 12:14:54 * branch            refs/pull/5703/head -> FETCH_HEAD
04-Oct-2019 12:14:54 grep: build/logs/phpunit.xml: No such file or directory
04-Oct-2019 12:14:54 grep: build/logs/phpunit.xml: No such file or directory
04-Oct-2019 12:14:54   % Total    % Received % Xferd  Average Speed   Time    Time     Time  Current
04-Oct-2019 12:14:54                                  Dload  Upload   Total   Spent    Left  Speed
04-Oct-2019 12:14:54
04-Oct-2019 12:14:55   0     0    0     0    0     0      0      0 --:--:-- --:--:-- --:--:--     0
04-Oct-2019 12:14:55   0     0    0     0    0     0      0      0 --:--:-- --:--:-- --:--:--     0
04-Oct-2019 12:14:55 100   273  100    93  100   180    286    554 --:--:-- --:--:-- --:--:--   553
04-Oct-2019 12:14:55 Finished task 'Set result build status' with result: Success
04-Oct-2019 12:14:55 Running post build plugin 'NCover Results Collector'
04-Oct-2019 12:14:55 Running post build plugin 'Artifact Copier'
04-Oct-2019 12:14:55 Running post build plugin 'npm Cache Cleanup'
04-Oct-2019 12:14:55 Running post build plugin 'Clover Results Collector'
04-Oct-2019 12:14:55 Running post build plugin 'Docker Container Cleanup'
04-Oct-2019 12:14:55 Successfully removed working directory at '/home/bamboo/xml-data/build-dir/PHPBB3-PR-JOB1'
04-Oct-2019 12:14:55 Finalising the build...
04-Oct-2019 12:14:55 Stopping timer.
04-Oct-2019 12:14:55 Build PHPBB3-PR-JOB1-9632 completed.
04-Oct-2019 12:14:55 Running on server: post build plugin 'NCover Results Collector'
04-Oct-2019 12:14:55 Running on server: post build plugin 'Build Hanging Detection Configuration'
04-Oct-2019 12:14:55 Running on server: post build plugin 'Clover Delta Calculator'
04-Oct-2019 12:14:55 Running on server: post build plugin 'Maven Dependencies Postprocessor'
04-Oct-2019 12:14:55 All post build plugins have finished
04-Oct-2019 12:14:55 Generating build results summary...
04-Oct-2019 12:14:55 Saving build results to disk...
04-Oct-2019 12:14:55 Logging substituted variables...
04-Oct-2019 12:14:55 Indexing build results...
04-Oct-2019 12:14:55 Finished building PHPBB3-PR-JOB1-9632.
04-Oct-2019 12:14:55
Substituting variable: ${bamboo.PRnumber} with 5703