Tests pending pull requests

Build: #9726 failed

Job: Build and Test Job failed

Stages & jobs

  1. Build and Test

Build log

The build generated 645 lines of output. Download or view full build log

27-Nov-2019 16:14:03 Build phpBB3 - Pull Requests - Build and Test Job #9726 (PHPBB3-PR-JOB1-9726) started building on agent Default Agent
27-Nov-2019 16:14:03
27-Nov-2019 16:14:03 Build working directory is /home/bamboo/xml-data/build-dir/PHPBB3-PR-JOB1
27-Nov-2019 16:14:03 Executing build phpBB3 - Pull Requests - Build and Test Job #9726 (PHPBB3-PR-JOB1-9726)
27-Nov-2019 16:14:03 Starting task 'Checkout develop branch' of type 'com.atlassian.bamboo.plugins.vcs:task.vcs.checkout'
27-Nov-2019 16:14:03 Build always requires a clean checkout
27-Nov-2019 16:14:03 Cleaning build directory '/home/bamboo/xml-data/build-dir/PHPBB3-PR-JOB1'
27-Nov-2019 16:14:03 Checking out into /home/bamboo/xml-data/build-dir/PHPBB3-PR-JOB1
27-Nov-2019 16:14:03 Updating source code to revision: dc8ff9da28b8ab4ad11c7ea94cca526f17c87fe5
27-Nov-2019 16:14:03 Fetching 'refs/heads/3.1.x' from 'https://github.com/phpbb/phpbb.git'.
27-Nov-2019 16:14:03 Checking out revision dc8ff9da28b8ab4ad11c7ea94cca526f17c87fe5.
27-Nov-2019 16:14:03 Creating local git repository in '/home/bamboo/xml-data/build-dir/PHPBB3-PR-JOB1/.git'.
27-Nov-2019 16:14:03 Cloning into '/home/bamboo/xml-data/build-dir/PHPBB3-PR-JOB1'...
27-Nov-2019 16:14:03 done.
27-Nov-2019 16:14:05 Switched to a new branch '3.1.x'
27-Nov-2019 16:14:05 Branch 3.1.x set up to track remote branch 3.1.x from origin.
27-Nov-2019 16:14:05 Updated source code to revision: dc8ff9da28b8ab4ad11c7ea94cca526f17c87fe5
27-Nov-2019 16:14:05 Finished task 'Checkout develop branch' with result: Success
27-Nov-2019 16:14:05 Running pre-build action: VCS Version Collector
27-Nov-2019 16:14:05
Substituting variable: ${bamboo.PRnumber} with 5746
27-Nov-2019 16:14:05
Substituting variable: ${bamboo.buildResultsUrl} with https://bamboo.phpbb.com/browse/PHPBB3-PR-JOB1-9726
27-Nov-2019 16:14:05 Starting task 'Set pending build status' of type 'com.atlassian.bamboo.plugins.scripttask:task.builder.script'
27-Nov-2019 16:14:05
Beginning to execute external process for build 'phpBB3 - Pull Requests - Build and Test Job #9726 (PHPBB3-PR-JOB1-9726)'
... running command line:
/bin/sh /home/bamboo/temp/PHPBB3-PR-JOB1-9726-ScriptBuildTask-5758660211912520253.sh
... in: /home/bamboo/xml-data/build-dir/PHPBB3-PR-JOB1
... using extra environment variables:
bamboo_planRepository_1_branch=3.1.x
bamboo_planRepository_1_branchDisplayName=3.1.x
bamboo_repository_revision_number=dc8ff9da28b8ab4ad11c7ea94cca526f17c87fe5
bamboo_PRref=master
bamboo_resultsUrl=https://bamboo.phpbb.com/browse/PHPBB3-PR-JOB1-9726
bamboo_capability_system_builder_command_Git=/usr/bin/git
bamboo_repository_75956235_git_username=bantu
bamboo_build_working_directory=/home/bamboo/xml-data/build-dir/PHPBB3-PR-JOB1
bamboo_planRepository_1_name=phpBB Ascraeus
bamboo_buildKey=PHPBB3-PR-JOB1
bamboo_capability_phpbb_tests=true
bamboo_shortPlanName=Pull Requests
bamboo_capability_system_builder_command_fop=/usr/bin/fop
bamboo_capability_dbms_sqlite_2=true
bamboo_planRepository_name=phpBB Ascraeus
bamboo_PRnumber=5746
bamboo_buildNumber=9726
bamboo_repository_75956235_git_repositoryUrl=https://github.com/phpbb/phpbb.git
bamboo_capability_system_builder_phpunit_PHPUnit=/usr/bin/phpunit
bamboo_shortJobName=Build and Test Job
bamboo_buildResultsUrl=https://bamboo.phpbb.com/browse/PHPBB3-PR-JOB1-9726
bamboo_repository_75956235_branch_name=3.1.x
bamboo_planRepository_repositoryUrl=https://github.com/phpbb/phpbb.git
bamboo_agentId=131073
bamboo_planName=phpBB3 - Pull Requests
bamboo_shortPlanKey=PR
bamboo_shortJobKey=JOB1
bamboo_capability_dbms_mysql_55=true
bamboo_capability_system_jdk_JDK_1_7_0_65=/usr/lib/jvm/java-7-openjdk-amd64
bamboo_planRepository_revision=dc8ff9da28b8ab4ad11c7ea94cca526f17c87fe5
bamboo_buildTimeStamp=2019-11-27T16:14:02.981Z
bamboo_repository_previous_revision_number=dc8ff9da28b8ab4ad11c7ea94cca526f17c87fe5
bamboo_capability_system_jdk_JDK_1_6_0_16=/usr/lib/jvm/java-6-sun-1.6.0.16
bamboo_capability_system_builder_mvn2_Maven_2=/usr/share/maven2
bamboo_planRepository_previousRevision=dc8ff9da28b8ab4ad11c7ea94cca526f17c87fe5
bamboo_repository_git_branch=3.1.x
bamboo_buildResultKey=PHPBB3-PR-JOB1-9726
bamboo_repository_branch_name=3.1.x
bamboo_buildPlanName=phpBB3 - Pull Requests - Build and Test Job
bamboo_planRepository_1_revision=dc8ff9da28b8ab4ad11c7ea94cca526f17c87fe5
bamboo_repository_name=phpBB Ascraeus
bamboo_buildFailed=false
bamboo_capability_system_docker_executable=/usr/bin/docker
bamboo_planRepository_branch=3.1.x
bamboo_agentWorkingDirectory=/home/bamboo/xml-data/build-dir
bamboo_capability_system_git_executable=/usr/bin/git
bamboo_capability_system_builder_phpunit_PHPUnit_3_4=/usr/bin/phpunit
bamboo_repository_git_username=bantu
bamboo_planRepository_1_previousRevision=dc8ff9da28b8ab4ad11c7ea94cca526f17c87fe5
bamboo_repository_75956235_revision_number=dc8ff9da28b8ab4ad11c7ea94cca526f17c87fe5
bamboo_planRepository_branchDisplayName=3.1.x
bamboo_planRepository_1_type=gitv2
bamboo_planRepository_branchName=3.1.x
bamboo_repository_75956235_previous_revision_number=dc8ff9da28b8ab4ad11c7ea94cca526f17c87fe5
bamboo_capability_system_jdk_JDK=/usr/lib/jvm/java-6-sun
bamboo_plan_storageTag=PHPBB3-PR
bamboo_hg_cache_directory=/home/bamboo/xml-data/build-dir/_hg-repositories-cache
bamboo_planRepository_1_username=bantu
bamboo_planRepository_type=gitv2
bamboo_git_cache_directory=/home/bamboo/xml-data/build-dir/_git-repositories-cache
bamboo_ManualBuildTriggerReason_userName=Build Robot
bamboo_repository_git_repositoryUrl=https://github.com/phpbb/phpbb.git
bamboo_repository_75956235_git_branch=3.1.x
bamboo_capability_system_builder_ant_Ant=/usr/share/ant
bamboo_repository_75956235_name=phpBB Ascraeus
bamboo_tmp_directory=/home/bamboo/temp
bamboo_working_directory=/home/bamboo/xml-data/build-dir/PHPBB3-PR-JOB1
bamboo_planKey=PHPBB3-PR
bamboo_capability_local=true
bamboo_planRepository_1_repositoryUrl=https://github.com/phpbb/phpbb.git
bamboo_planRepository_username=bantu
bamboo_capability_system_jdk_JDK_1_6=/usr/lib/jvm/java-6-sun
bamboo_capability_system_jdk_JDK_1_7=/usr/lib/jvm/java-7-openjdk-amd64
bamboo_planRepository_1_branchName=3.1.x
27-Nov-2019 16:14:08 From https://github.com/phpbb/phpbb
27-Nov-2019 16:14:08 * branch            refs/pull/5746/head -> FETCH_HEAD
27-Nov-2019 16:14:08   % Total    % Received % Xferd  Average Speed   Time    Time     Time  Current
27-Nov-2019 16:14:08                                  Dload  Upload   Total   Spent    Left  Speed
27-Nov-2019 16:14:08
27-Nov-2019 16:14:09   0     0    0     0    0     0      0      0 --:--:-- --:--:-- --:--:--     0
27-Nov-2019 16:14:09 100   275  100    93  100   182    152    297 --:--:-- --:--:-- --:--:--   297
27-Nov-2019 16:14:09 Finished task 'Set pending build status' with result: Success
27-Nov-2019 16:14:09
Substituting variable: ${bamboo.PRnumber} with 5746
27-Nov-2019 16:14:09 Starting task 'Fetch PR' of type 'com.atlassian.bamboo.plugins.scripttask:task.builder.script'
27-Nov-2019 16:14:09
Beginning to execute external process for build 'phpBB3 - Pull Requests - Build and Test Job #9726 (PHPBB3-PR-JOB1-9726)'
... running command line:
/bin/sh /home/bamboo/temp/PHPBB3-PR-JOB1-9726-ScriptBuildTask-6474111210365733875.sh
... in: /home/bamboo/xml-data/build-dir/PHPBB3-PR-JOB1
... using extra environment variables:
bamboo_planRepository_1_branch=3.1.x
bamboo_planRepository_1_branchDisplayName=3.1.x
bamboo_repository_revision_number=dc8ff9da28b8ab4ad11c7ea94cca526f17c87fe5
bamboo_PRref=master
bamboo_resultsUrl=https://bamboo.phpbb.com/browse/PHPBB3-PR-JOB1-9726
bamboo_capability_system_builder_command_Git=/usr/bin/git
bamboo_repository_75956235_git_username=bantu
bamboo_build_working_directory=/home/bamboo/xml-data/build-dir/PHPBB3-PR-JOB1
bamboo_planRepository_1_name=phpBB Ascraeus
bamboo_buildKey=PHPBB3-PR-JOB1
bamboo_capability_phpbb_tests=true
bamboo_shortPlanName=Pull Requests
bamboo_capability_system_builder_command_fop=/usr/bin/fop
bamboo_capability_dbms_sqlite_2=true
bamboo_planRepository_name=phpBB Ascraeus
bamboo_PRnumber=5746
bamboo_buildNumber=9726
bamboo_repository_75956235_git_repositoryUrl=https://github.com/phpbb/phpbb.git
bamboo_capability_system_builder_phpunit_PHPUnit=/usr/bin/phpunit
bamboo_shortJobName=Build and Test Job
bamboo_buildResultsUrl=https://bamboo.phpbb.com/browse/PHPBB3-PR-JOB1-9726
bamboo_repository_75956235_branch_name=3.1.x
bamboo_planRepository_repositoryUrl=https://github.com/phpbb/phpbb.git
bamboo_agentId=131073
bamboo_planName=phpBB3 - Pull Requests
bamboo_build_commandline_com_atlassian_bamboo_plugins_scripttask_task_builder_script_7=/bin/sh /home/bamboo/temp/PHPBB3-PR-JOB1-9726-ScriptBuildTask-5758660211912520253.sh
bamboo_shortPlanKey=PR
bamboo_shortJobKey=JOB1
bamboo_capability_dbms_mysql_55=true
bamboo_capability_system_jdk_JDK_1_7_0_65=/usr/lib/jvm/java-7-openjdk-amd64
bamboo_planRepository_revision=dc8ff9da28b8ab4ad11c7ea94cca526f17c87fe5
bamboo_buildTimeStamp=2019-11-27T16:14:02.981Z
bamboo_repository_previous_revision_number=dc8ff9da28b8ab4ad11c7ea94cca526f17c87fe5
bamboo_capability_system_jdk_JDK_1_6_0_16=/usr/lib/jvm/java-6-sun-1.6.0.16
bamboo_capability_system_builder_mvn2_Maven_2=/usr/share/maven2
bamboo_planRepository_previousRevision=dc8ff9da28b8ab4ad11c7ea94cca526f17c87fe5
bamboo_repository_git_branch=3.1.x
bamboo_buildResultKey=PHPBB3-PR-JOB1-9726
bamboo_repository_branch_name=3.1.x
bamboo_buildPlanName=phpBB3 - Pull Requests - Build and Test Job
bamboo_planRepository_1_revision=dc8ff9da28b8ab4ad11c7ea94cca526f17c87fe5
bamboo_repository_name=phpBB Ascraeus
bamboo_buildFailed=false
bamboo_capability_system_docker_executable=/usr/bin/docker
bamboo_planRepository_branch=3.1.x
bamboo_agentWorkingDirectory=/home/bamboo/xml-data/build-dir
bamboo_capability_system_git_executable=/usr/bin/git
bamboo_capability_system_builder_phpunit_PHPUnit_3_4=/usr/bin/phpunit
bamboo_repository_git_username=bantu
bamboo_planRepository_1_previousRevision=dc8ff9da28b8ab4ad11c7ea94cca526f17c87fe5
bamboo_repository_75956235_revision_number=dc8ff9da28b8ab4ad11c7ea94cca526f17c87fe5
bamboo_planRepository_branchDisplayName=3.1.x
bamboo_planRepository_1_type=gitv2
bamboo_planRepository_branchName=3.1.x
bamboo_repository_75956235_previous_revision_number=dc8ff9da28b8ab4ad11c7ea94cca526f17c87fe5
bamboo_capability_system_jdk_JDK=/usr/lib/jvm/java-6-sun
bamboo_plan_storageTag=PHPBB3-PR
bamboo_hg_cache_directory=/home/bamboo/xml-data/build-dir/_hg-repositories-cache
bamboo_planRepository_1_username=bantu
bamboo_planRepository_type=gitv2
bamboo_git_cache_directory=/home/bamboo/xml-data/build-dir/_git-repositories-cache
bamboo_ManualBuildTriggerReason_userName=Build Robot
bamboo_repository_git_repositoryUrl=https://github.com/phpbb/phpbb.git
bamboo_repository_75956235_git_branch=3.1.x
bamboo_capability_system_builder_ant_Ant=/usr/share/ant
bamboo_repository_75956235_name=phpBB Ascraeus
bamboo_tmp_directory=/home/bamboo/temp
bamboo_working_directory=/home/bamboo/xml-data/build-dir/PHPBB3-PR-JOB1
bamboo_planKey=PHPBB3-PR
bamboo_capability_local=true
bamboo_planRepository_1_repositoryUrl=https://github.com/phpbb/phpbb.git
bamboo_planRepository_username=bantu
bamboo_capability_system_jdk_JDK_1_6=/usr/lib/jvm/java-6-sun
bamboo_capability_system_jdk_JDK_1_7=/usr/lib/jvm/java-7-openjdk-amd64
bamboo_planRepository_1_branchName=3.1.x
27-Nov-2019 16:14:12 From https://github.com/phpbb/phpbb
27-Nov-2019 16:14:12 * branch            refs/pull/5746/merge -> FETCH_HEAD
27-Nov-2019 16:14:12 Note: checking out 'FETCH_HEAD'.
27-Nov-2019 16:14:12
27-Nov-2019 16:14:12 You are in 'detached HEAD' state. You can look around, make experimental
27-Nov-2019 16:14:12 changes and commit them, and you can discard any commits you make in this
27-Nov-2019 16:14:12 state without impacting any branches by performing another checkout.
27-Nov-2019 16:14:12
27-Nov-2019 16:14:12 If you want to create a new branch to retain commits you create, you may
27-Nov-2019 16:14:12 do so (now or later) by using -b with the checkout command again. Example:
27-Nov-2019 16:14:12
27-Nov-2019 16:14:12   git checkout -b new_branch_name
27-Nov-2019 16:14:12
27-Nov-2019 16:14:12 HEAD is now at 29336bd... Merge 35429d934ff021146017cd733c2c062e3e0fef83 into f26c79621bf4e8a68fda662b9ae61e0404e5b4f0
27-Nov-2019 16:14:12 Finished task 'Fetch PR' with result: Success
27-Nov-2019 16:14:12 Skipping execution of task 'Prepare directory' as it is disabled
27-Nov-2019 16:14:12
Substituting variable: ${bamboo.working.directory} with /home/bamboo/xml-data/build-dir/PHPBB3-PR-JOB1
27-Nov-2019 16:14:12 Starting task 'Build image' of type 'com.atlassian.bamboo.plugins.bamboo-docker-plugin:task.docker.cli'
27-Nov-2019 16:14:12
Beginning to execute external process for build 'phpBB3 - Pull Requests - Build and Test Job #9726 (PHPBB3-PR-JOB1-9726)'
... running command line:
/usr/bin/docker build --force-rm=true --tag=phpbb:php-7.1 /home/bamboo/xml-data/build-dir/PHPBB3-PR-JOB1
... in: /home/bamboo/xml-data/build-dir/PHPBB3-PR-JOB1
... using extra environment variables:
bamboo_planRepository_1_branch=3.1.x
bamboo_planRepository_1_branchDisplayName=3.1.x
bamboo_repository_revision_number=dc8ff9da28b8ab4ad11c7ea94cca526f17c87fe5
bamboo_PRref=master
bamboo_resultsUrl=https://bamboo.phpbb.com/browse/PHPBB3-PR-JOB1-9726
bamboo_capability_system_builder_command_Git=/usr/bin/git
bamboo_repository_75956235_git_username=bantu
bamboo_build_working_directory=/home/bamboo/xml-data/build-dir/PHPBB3-PR-JOB1
bamboo_planRepository_1_name=phpBB Ascraeus
bamboo_buildKey=PHPBB3-PR-JOB1
bamboo_capability_phpbb_tests=true
bamboo_shortPlanName=Pull Requests
bamboo_capability_system_builder_command_fop=/usr/bin/fop
bamboo_capability_dbms_sqlite_2=true
bamboo_planRepository_name=phpBB Ascraeus
bamboo_PRnumber=5746
bamboo_buildNumber=9726
bamboo_repository_75956235_git_repositoryUrl=https://github.com/phpbb/phpbb.git
bamboo_capability_system_builder_phpunit_PHPUnit=/usr/bin/phpunit
bamboo_shortJobName=Build and Test Job
bamboo_buildResultsUrl=https://bamboo.phpbb.com/browse/PHPBB3-PR-JOB1-9726
bamboo_repository_75956235_branch_name=3.1.x
bamboo_planRepository_repositoryUrl=https://github.com/phpbb/phpbb.git
bamboo_agentId=131073
bamboo_planName=phpBB3 - Pull Requests
bamboo_build_commandline_com_atlassian_bamboo_plugins_scripttask_task_builder_script_7=/bin/sh /home/bamboo/temp/PHPBB3-PR-JOB1-9726-ScriptBuildTask-5758660211912520253.sh
bamboo_shortPlanKey=PR
bamboo_shortJobKey=JOB1
bamboo_capability_dbms_mysql_55=true
bamboo_capability_system_jdk_JDK_1_7_0_65=/usr/lib/jvm/java-7-openjdk-amd64
bamboo_planRepository_revision=dc8ff9da28b8ab4ad11c7ea94cca526f17c87fe5
bamboo_buildTimeStamp=2019-11-27T16:14:02.981Z
bamboo_repository_previous_revision_number=dc8ff9da28b8ab4ad11c7ea94cca526f17c87fe5
bamboo_capability_system_jdk_JDK_1_6_0_16=/usr/lib/jvm/java-6-sun-1.6.0.16
bamboo_capability_system_builder_mvn2_Maven_2=/usr/share/maven2
bamboo_planRepository_previousRevision=dc8ff9da28b8ab4ad11c7ea94cca526f17c87fe5
bamboo_build_commandline_com_atlassian_bamboo_plugins_scripttask_task_builder_script_4=/bin/sh /home/bamboo/temp/PHPBB3-PR-JOB1-9726-ScriptBuildTask-6474111210365733875.sh
bamboo_repository_git_branch=3.1.x
bamboo_buildResultKey=PHPBB3-PR-JOB1-9726
bamboo_repository_branch_name=3.1.x
bamboo_buildPlanName=phpBB3 - Pull Requests - Build and Test Job
bamboo_planRepository_1_revision=dc8ff9da28b8ab4ad11c7ea94cca526f17c87fe5
bamboo_repository_name=phpBB Ascraeus
bamboo_buildFailed=false
bamboo_capability_system_docker_executable=/usr/bin/docker
bamboo_planRepository_branch=3.1.x
bamboo_agentWorkingDirectory=/home/bamboo/xml-data/build-dir
bamboo_capability_system_git_executable=/usr/bin/git
bamboo_capability_system_builder_phpunit_PHPUnit_3_4=/usr/bin/phpunit
bamboo_repository_git_username=bantu
bamboo_planRepository_1_previousRevision=dc8ff9da28b8ab4ad11c7ea94cca526f17c87fe5
bamboo_repository_75956235_revision_number=dc8ff9da28b8ab4ad11c7ea94cca526f17c87fe5
bamboo_planRepository_branchDisplayName=3.1.x
bamboo_planRepository_1_type=gitv2
bamboo_planRepository_branchName=3.1.x
bamboo_repository_75956235_previous_revision_number=dc8ff9da28b8ab4ad11c7ea94cca526f17c87fe5
bamboo_capability_system_jdk_JDK=/usr/lib/jvm/java-6-sun
bamboo_plan_storageTag=PHPBB3-PR
bamboo_hg_cache_directory=/home/bamboo/xml-data/build-dir/_hg-repositories-cache
bamboo_planRepository_1_username=bantu
bamboo_planRepository_type=gitv2
bamboo_git_cache_directory=/home/bamboo/xml-data/build-dir/_git-repositories-cache
bamboo_ManualBuildTriggerReason_userName=Build Robot
bamboo_repository_git_repositoryUrl=https://github.com/phpbb/phpbb.git
bamboo_repository_75956235_git_branch=3.1.x
bamboo_capability_system_builder_ant_Ant=/usr/share/ant
bamboo_repository_75956235_name=phpBB Ascraeus
bamboo_tmp_directory=/home/bamboo/temp
bamboo_working_directory=/home/bamboo/xml-data/build-dir/PHPBB3-PR-JOB1
bamboo_planKey=PHPBB3-PR
bamboo_capability_local=true
bamboo_planRepository_1_repositoryUrl=https://github.com/phpbb/phpbb.git
bamboo_planRepository_username=bantu
bamboo_capability_system_jdk_JDK_1_6=/usr/lib/jvm/java-6-sun
bamboo_capability_system_jdk_JDK_1_7=/usr/lib/jvm/java-7-openjdk-amd64
bamboo_planRepository_1_branchName=3.1.x
27-Nov-2019 16:14:13 Sending build context to Docker daemon  48.09MB
27-Nov-2019 16:14:13
27-Nov-2019 16:14:13 Step 1/5 : FROM php:7.1
27-Nov-2019 16:14:13 ---> 060b5298208c
27-Nov-2019 16:14:13 Step 2/5 : RUN apt-get update && apt-get install -y         git         zlib1g-dev         bzip2         zip         && docker-php-ext-install -j$(nproc) zip
27-Nov-2019 16:14:13 ---> Using cache
27-Nov-2019 16:14:13 ---> 385e626c3207
27-Nov-2019 16:14:13 Step 3/5 : RUN pecl install xdebug-2.6.1
27-Nov-2019 16:14:13 ---> Using cache
27-Nov-2019 16:14:13 ---> 7f0fe7e3ce20
27-Nov-2019 16:14:13 Step 4/5 : RUN docker-php-ext-enable xdebug
27-Nov-2019 16:14:13 ---> Using cache
27-Nov-2019 16:14:13 ---> 8b1cd62f766c
27-Nov-2019 16:14:13 Step 5/5 : RUN echo "memory_limit = 1536M" >> /usr/local/etc/php/conf.d/memory.ini
27-Nov-2019 16:14:13 ---> Using cache
27-Nov-2019 16:14:13 ---> 6914a79785c7
27-Nov-2019 16:14:13 Successfully built 6914a79785c7
27-Nov-2019 16:14:13 Successfully tagged phpbb:php-7.1
27-Nov-2019 16:14:13 Built Docker image 'phpbb:php-7.1'
27-Nov-2019 16:14:13 Finished task 'Build image' with result: Success
27-Nov-2019 16:14:13
Substituting variable: ${bamboo.working.directory} with /home/bamboo/xml-data/build-dir/PHPBB3-PR-JOB1
27-Nov-2019 16:14:13 Starting task 'Prepare directory' of type 'com.atlassian.bamboo.plugins.bamboo-docker-plugin:task.docker.cli'
27-Nov-2019 16:14:13 Running image name (phpbb:php-7.1)
27-Nov-2019 16:14:13
Beginning to execute external process for build 'phpBB3 - Pull Requests - Build and Test Job #9726 (PHPBB3-PR-JOB1-9726)'
... running command line:
/usr/bin/docker run --volume /home/bamboo/xml-data/build-dir/PHPBB3-PR-JOB1:/data --workdir /data/phpBB --rm -e HOME=/home/bamboo -u=991 phpbb:php-7.1 /bin/bash -c php ../composer.phar install --dev; cd ../build; ../phpBB/vendor/bin/phing clean prepare
... in: /home/bamboo/xml-data/build-dir/PHPBB3-PR-JOB1
... using extra environment variables:
bamboo_planRepository_1_branch=3.1.x
bamboo_planRepository_1_branchDisplayName=3.1.x
bamboo_repository_revision_number=dc8ff9da28b8ab4ad11c7ea94cca526f17c87fe5
bamboo_PRref=master
bamboo_resultsUrl=https://bamboo.phpbb.com/browse/PHPBB3-PR-JOB1-9726
bamboo_capability_system_builder_command_Git=/usr/bin/git
bamboo_repository_75956235_git_username=bantu
bamboo_build_working_directory=/home/bamboo/xml-data/build-dir/PHPBB3-PR-JOB1
bamboo_planRepository_1_name=phpBB Ascraeus
bamboo_buildKey=PHPBB3-PR-JOB1
bamboo_capability_phpbb_tests=true
bamboo_shortPlanName=Pull Requests
bamboo_capability_system_builder_command_fop=/usr/bin/fop
bamboo_capability_dbms_sqlite_2=true
bamboo_planRepository_name=phpBB Ascraeus
bamboo_PRnumber=5746
bamboo_buildNumber=9726
bamboo_repository_75956235_git_repositoryUrl=https://github.com/phpbb/phpbb.git
bamboo_capability_system_builder_phpunit_PHPUnit=/usr/bin/phpunit
bamboo_shortJobName=Build and Test Job
bamboo_buildResultsUrl=https://bamboo.phpbb.com/browse/PHPBB3-PR-JOB1-9726
bamboo_repository_75956235_branch_name=3.1.x
bamboo_planRepository_repositoryUrl=https://github.com/phpbb/phpbb.git
bamboo_agentId=131073
bamboo_planName=phpBB3 - Pull Requests
bamboo_build_commandline_com_atlassian_bamboo_plugins_scripttask_task_builder_script_7=/bin/sh /home/bamboo/temp/PHPBB3-PR-JOB1-9726-ScriptBuildTask-5758660211912520253.sh
bamboo_shortPlanKey=PR
bamboo_shortJobKey=JOB1
bamboo_capability_dbms_mysql_55=true
bamboo_capability_system_jdk_JDK_1_7_0_65=/usr/lib/jvm/java-7-openjdk-amd64
bamboo_planRepository_revision=dc8ff9da28b8ab4ad11c7ea94cca526f17c87fe5
bamboo_buildTimeStamp=2019-11-27T16:14:02.981Z
bamboo_repository_previous_revision_number=dc8ff9da28b8ab4ad11c7ea94cca526f17c87fe5
bamboo_capability_system_jdk_JDK_1_6_0_16=/usr/lib/jvm/java-6-sun-1.6.0.16
bamboo_capability_system_builder_mvn2_Maven_2=/usr/share/maven2
bamboo_planRepository_previousRevision=dc8ff9da28b8ab4ad11c7ea94cca526f17c87fe5
bamboo_build_commandline_com_atlassian_bamboo_plugins_scripttask_task_builder_script_4=/bin/sh /home/bamboo/temp/PHPBB3-PR-JOB1-9726-ScriptBuildTask-6474111210365733875.sh
bamboo_repository_git_branch=3.1.x
bamboo_buildResultKey=PHPBB3-PR-JOB1-9726
bamboo_repository_branch_name=3.1.x
bamboo_buildPlanName=phpBB3 - Pull Requests - Build and Test Job
bamboo_planRepository_1_revision=dc8ff9da28b8ab4ad11c7ea94cca526f17c87fe5
bamboo_repository_name=phpBB Ascraeus
bamboo_buildFailed=false
bamboo_capability_system_docker_executable=/usr/bin/docker
bamboo_build_commandline_com_atlassian_bamboo_plugins_bamboo_docker_plugin_task_docker_cli_13=/usr/bin/docker build --force-rm=true --tag=phpbb:php-7.1 /home/bamboo/xml-data/build-dir/PHPBB3-PR-JOB1
bamboo_planRepository_branch=3.1.x
bamboo_agentWorkingDirectory=/home/bamboo/xml-data/build-dir
bamboo_capability_system_git_executable=/usr/bin/git
bamboo_capability_system_builder_phpunit_PHPUnit_3_4=/usr/bin/phpunit
bamboo_repository_git_username=bantu
bamboo_planRepository_1_previousRevision=dc8ff9da28b8ab4ad11c7ea94cca526f17c87fe5
bamboo_repository_75956235_revision_number=dc8ff9da28b8ab4ad11c7ea94cca526f17c87fe5
bamboo_planRepository_branchDisplayName=3.1.x
bamboo_planRepository_1_type=gitv2
bamboo_planRepository_branchName=3.1.x
bamboo_repository_75956235_previous_revision_number=dc8ff9da28b8ab4ad11c7ea94cca526f17c87fe5
bamboo_capability_system_jdk_JDK=/usr/lib/jvm/java-6-sun
bamboo_plan_storageTag=PHPBB3-PR
bamboo_hg_cache_directory=/home/bamboo/xml-data/build-dir/_hg-repositories-cache
bamboo_planRepository_1_username=bantu
bamboo_planRepository_type=gitv2
bamboo_git_cache_directory=/home/bamboo/xml-data/build-dir/_git-repositories-cache
bamboo_ManualBuildTriggerReason_userName=Build Robot
bamboo_repository_git_repositoryUrl=https://github.com/phpbb/phpbb.git
bamboo_repository_75956235_git_branch=3.1.x
bamboo_capability_system_builder_ant_Ant=/usr/share/ant
bamboo_repository_75956235_name=phpBB Ascraeus
bamboo_tmp_directory=/home/bamboo/temp
bamboo_working_directory=/home/bamboo/xml-data/build-dir/PHPBB3-PR-JOB1
bamboo_planKey=PHPBB3-PR
bamboo_capability_local=true
bamboo_planRepository_1_repositoryUrl=https://github.com/phpbb/phpbb.git
bamboo_planRepository_username=bantu
bamboo_capability_system_jdk_JDK_1_6=/usr/lib/jvm/java-6-sun
bamboo_capability_system_jdk_JDK_1_7=/usr/lib/jvm/java-7-openjdk-amd64
bamboo_planRepository_1_branchName=3.1.x
27-Nov-2019 16:14:14 Cannot create cache directory /home/bamboo/.composer/cache/repo/https---repo.packagist.org/, or directory is not writable. Proceeding without cache
27-Nov-2019 16:14:14 Cannot create cache directory /home/bamboo/.composer/cache/files/, or directory is not writable. Proceeding without cache
27-Nov-2019 16:14:14 You are using the deprecated option "dev". Dev packages are installed by default now.
27-Nov-2019 16:14:14 Loading composer repositories with package information
27-Nov-2019 16:14:14 Installing dependencies (including require-dev) from lock file
27-Nov-2019 16:14:14 Package operations: 82 installs, 0 updates, 0 removals
27-Nov-2019 16:14:15   - Installing composer/installers (v1.6.0): Downloading (connecting...)Downloading (0%)           Downloading (5%)Downloading (35%)Downloading (65%)Downloading (70%)Downloading (75%)Downloading (80%)Downloading (100%)
27-Nov-2019 16:14:15   - Installing ocramius/package-versions (1.4.0): Downloading (connecting...)Downloading (0%)           Downloading (30%)Downloading (60%)Downloading (90%)Downloading (100%)
27-Nov-2019 16:14:16   - Installing bantu/ini-get-wrapper (v1.0.1): Downloading (connecting...)Downloading (0%)           Downloading (100%)
27-Nov-2019 16:14:16   - Installing symfony/process (v3.4.31): Downloading (connecting...)Downloading (0%)           Downloading (5%)Downloading (40%)Downloading (45%)Downloading (50%)Downloading (80%)Downloading (85%)Downloading (90%)Downloading (100%)
27-Nov-2019 16:14:17   - Installing symfony/finder (v3.4.31): Downloading (connecting...)Downloading (100%)         
27-Nov-2019 16:14:18   - Installing symfony/polyfill-ctype (v1.12.0): Downloading (connecting...)Downloading (0%)           Downloading (100%)
27-Nov-2019 16:14:18   - Installing symfony/filesystem (v3.4.31): Downloading (connecting...)Downloading (0%)           Downloading (5%)Downloading (10%)Downloading (70%)Downloading (75%)Downloading (80%)Downloading (100%)
27-Nov-2019 16:14:19   - Installing symfony/polyfill-mbstring (v1.12.0): Downloading (connecting...)Downloading (0%)           Downloading (30%)Downloading (60%)Downloading (100%)
27-Nov-2019 16:14:20   - Installing psr/log (1.1.0): Downloading (connecting...)Downloading (0%)           Downloading (65%)Downloading (90%)Downloading (100%)
27-Nov-2019 16:14:20   - Installing symfony/debug (v3.4.31): Downloading (connecting...)Downloading (0%)           Downloading (5%)Downloading (15%)Downloading (20%)Downloading (30%)Downloading (35%)Downloading (40%)Downloading (55%)Downloading (60%)Downloading (75%)Downloading (80%)Downloading (90%)Downloading (95%)Downloading (100%)
27-Nov-2019 16:14:21   - Installing symfony/console (v3.4.31): Downloading (connecting...)Downloading (100%)         
27-Nov-2019 16:14:22   - Installing seld/phar-utils (1.0.1): Downloading (connecting...)Downloading (0%)           Downloading (30%)Downloading (60%)Downloading (90%)Downloading (100%)
27-Nov-2019 16:14:22   - Installing seld/jsonlint (1.7.1): Downloading (connecting...)Downloading (0%)           Downloading (15%)Downloading (75%)Downloading (90%)Downloading (100%)
27-Nov-2019 16:14:23   - Installing justinrainbow/json-schema (5.2.8): Downloading (connecting...)Downloading (0%)           Downloading (5%)Downloading (20%)Downloading (25%)Downloading (55%)Downloading (60%)Downloading (80%)Downloading (85%)Downloading (100%)
27-Nov-2019 16:14:24   - Installing composer/xdebug-handler (1.3.3): Downloading (connecting...)Downloading (0%)           Downloading (70%)Downloading (95%)Downloading (100%)
27-Nov-2019 16:14:24   - Installing composer/spdx-licenses (1.5.2): Downloading (connecting...)Downloading (0%)           Downloading (10%)Downloading (20%)Downloading (30%)Downloading (40%)Downloading (50%)Downloading (60%)Downloading (100%)
27-Nov-2019 16:14:25   - Installing composer/semver (1.5.0): Downloading (connecting...)Downloading (0%)           Downloading (35%)Downloading (75%)Downloading (100%)
27-Nov-2019 16:14:26   - Installing composer/ca-bundle (1.1.4): Downloading (connecting...)Downloading (0%)           Downloading (5%)Downloading (10%)Downloading (15%)Downloading (20%)Downloading (25%)Downloading (30%)Downloading (35%)Downloading (40%)Downloading (45%)Downloading (50%)Downloading (55%)Downloading (60%)Downloading (65%)Downloading (70%)Downloading (75%)Downloading (80%)Downloading (85%)Downloading (90%)Downloading (95%)Downloading (100%)
27-Nov-2019 16:14:27   - Installing composer/composer (1.8.6): Downloading (connecting...)Downloading (0%)           Downloading (5%)Downloading (10%)Downloading (15%)Downloading (20%)Downloading (25%)Downloading (30%)Downloading (35%)Downloading (40%)Downloading (45%)Downloading (50%)Downloading (55%)Downloading (60%)Downloading (70%)Downloading (75%)Downloading (85%)Downloading (90%)Downloading (95%)Downloading (100%)
27-Nov-2019 16:14:27   - Installing google/recaptcha (1.2.3): Downloading (connecting...)Downloading (0%)           Downloading (15%)Downloading (30%)Downloading (35%)Downloading (50%)Downloading (65%)Downloading (80%)Downloading (95%)Downloading (100%)
27-Nov-2019 16:14:28   - Installing guzzlehttp/promises (v1.3.1): Downloading (connecting...)Downloading (0%)           Downloading (30%)Downloading (60%)Downloading (90%)Downloading (100%)
27-Nov-2019 16:14:29   - Installing ralouphie/getallheaders (3.0.3): Downloading (connecting...)Downloading (0%)           Downloading (100%)
27-Nov-2019 16:14:29   - Installing psr/http-message (1.0.1): Downloading (connecting...)Downloading (0%)           Downloading (100%)
27-Nov-2019 16:14:30   - Installing guzzlehttp/psr7 (1.6.1): Downloading (connecting...)Downloading (0%)           Downloading (5%)Downloading (10%)Downloading (40%)Downloading (45%)Downloading (65%)Downloading (70%)Downloading (75%)Downloading (100%)
27-Nov-2019 16:14:31   - Installing lusitanian/oauth (v0.8.11): Downloading (connecting...)Downloading (0%)           Downloading (5%)Downloading (10%)Downloading (15%)Downloading (20%)Downloading (30%)Downloading (35%)Downloading (45%)Downloading (50%)Downloading (55%)Downloading (60%)Downloading (65%)Downloading (70%)Downloading (75%)Downloading (80%)Downloading (90%)Downloading (95%)Downloading (100%)
27-Nov-2019 16:14:31   - Installing marc1706/fast-image-size (v1.1.5): Downloading (connecting...)Downloading (100%)         
27-Nov-2019 16:14:32   - Installing patchwork/utf8 (v1.3.1): Downloading (connecting...)Downloading (0%)           Downloading (5%)Downloading (10%)Downloading (15%)Downloading (20%)Downloading (25%)Downloading (30%)Downloading (35%)Downloading (40%)Downloading (45%)Downloading (50%)Downloading (55%)Downloading (60%)Downloading (65%)Downloading (70%)Downloading (75%)Downloading (80%)Downloading (85%)Downloading (90%)Downloading (95%)Downloading (100%)
27-Nov-2019 16:14:33   - Installing psr/container (1.0.0): Downloading (connecting...)Downloading (0%)           Downloading (75%)Downloading (100%)
27-Nov-2019 16:14:33   - Installing s9e/regexp-builder (1.4.3): Downloading (connecting...)Downloading (100%)         
27-Nov-2019 16:14:35   - Installing s9e/text-formatter (2.1.2): Downloading (connecting...)Downloading (100%)         
27-Nov-2019 16:14:35   - Installing symfony/config (v3.4.31): Downloading (connecting...)Downloading (0%)           Downloading (5%)Downloading (10%)Downloading (15%)Downloading (20%)Downloading (25%)Downloading (30%)Downloading (35%)Downloading (40%)Downloading (45%)Downloading (50%)Downloading (55%)Downloading (60%)Downloading (65%)Downloading (70%)Downloading (75%)Downloading (80%)Downloading (85%)Downloading (90%)Downloading (95%)Downloading (100%)
27-Nov-2019 16:14:36   - Installing paragonie/random_compat (v9.99.99): Downloading (connecting...)Downloading (0%)           Downloading (45%)Downloading (90%)Downloading (100%)
27-Nov-2019 16:14:37   - Installing symfony/polyfill-php70 (v1.12.0): Downloading (connecting...)Downloading (0%)           Downloading (85%)Downloading (100%)
27-Nov-2019 16:14:37   - Installing symfony/http-foundation (v3.4.31): Downloading (connecting...)Downloading (0%)           Downloading (5%)Downloading (10%)Downloading (15%)Downloading (20%)Downloading (25%)Downloading (30%)Downloading (35%)Downloading (40%)Downloading (45%)Downloading (50%)Downloading (55%)Downloading (60%)Downloading (65%)Downloading (70%)Downloading (75%)Downloading (80%)Downloading (85%)Downloading (90%)Downloading (95%)Downloading (100%)
27-Nov-2019 16:14:38   - Installing symfony/event-dispatcher (v3.4.31): Downloading (connecting...)Downloading (0%)           Downloading (5%)Downloading (45%)Downloading (50%)Downloading (100%)
27-Nov-2019 16:14:39   - Installing symfony/http-kernel (v3.4.31): Downloading (connecting...)Downloading (0%)           Downloading (5%)Downloading (10%)Downloading (15%)Downloading (20%)Downloading (25%)Downloading (30%)Downloading (35%)Downloading (40%)Downloading (45%)Downloading (50%)Downloading (55%)Downloading (60%)Downloading (65%)Downloading (70%)Downloading (75%)Downloading (80%)Downloading (85%)Downloading (90%)Downloading (95%)Downloading (100%)
27-Nov-2019 16:14:40   - Installing symfony/dependency-injection (v3.4.31): Downloading (connecting...)Downloading (0%)           Downloading (5%)Downloading (10%)Downloading (15%)Downloading (20%)Downloading (25%)Downloading (30%)Downloading (35%)Downloading (40%)Downloading (45%)Downloading (50%)Downloading (55%)Downloading (60%)Downloading (65%)Downloading (85%)Downloading (90%)Downloading (95%)Downloading (100%)
27-Nov-2019 16:14:40   - Installing zendframework/zend-eventmanager (3.2.1): Downloading (connecting...)Downloading (0%)           Downloading (15%)Downloading (20%)Downloading (35%)Downloading (55%)Downloading (60%)Downloading (80%)Downloading (95%)Downloading (100%)
27-Nov-2019 16:14:41   - Installing zendframework/zend-code (3.3.2): Downloading (connecting...)Downloading (0%)           Downloading (5%)Downloading (10%)Downloading (15%)Downloading (20%)Downloading (25%)Downloading (30%)Downloading (35%)Downloading (40%)Downloading (45%)Downloading (50%)Downloading (55%)Downloading (60%)Downloading (65%)Downloading (70%)Downloading (75%)Downloading (80%)Downloading (85%)Downloading (90%)Downloading (95%)Downloading (100%)
27-Nov-2019 16:14:42   - Installing ocramius/proxy-manager (2.1.1): Downloading (connecting...)Downloading (0%)           Downloading (5%)Downloading (10%)Downloading (15%)Downloading (20%)Downloading (25%)Downloading (30%)Downloading (35%)Downloading (40%)Downloading (45%)Downloading (50%)Downloading (55%)Downloading (60%)Downloading (65%)Downloading (70%)Downloading (75%)Downloading (80%)Downloading (85%)Downloading (90%)Downloading (95%)Downloading (100%)
27-Nov-2019 16:14:43   - Installing symfony/proxy-manager-bridge (v3.4.31): Downloading (connecting...)Downloading (100%)         
27-Nov-2019 16:14:44   - Installing symfony/routing (v3.4.31): Downloading (connecting...)Downloading (0%)           Downloading (5%)Downloading (10%)Downloading (15%)Downloading (20%)Downloading (25%)Downloading (30%)Downloading (35%)Downloading (40%)Downloading (45%)Downloading (50%)Downloading (55%)Downloading (60%)Downloading (65%)Downloading (70%)Downloading (75%)Downloading (80%)Downloading (85%)Downloading (90%)Downloading (95%)Downloading (100%)
27-Nov-2019 16:14:45   - Installing twig/twig (v2.11.3): Downloading (connecting...)Downloading (0%)           Downloading (5%)Downloading (10%)Downloading (15%)Downloading (20%)Downloading (25%)Downloading (30%)Downloading (35%)Downloading (40%)Downloading (45%)Downloading (50%)Downloading (55%)Downloading (60%)Downloading (65%)Downloading (70%)Downloading (75%)Downloading (80%)Downloading (85%)Downloading (90%)Downloading (95%)Downloading (100%)
27-Nov-2019 16:14:45   - Installing symfony/twig-bridge (v3.4.31): Downloading (connecting...)Downloading (100%)         
27-Nov-2019 16:14:46   - Installing symfony/dom-crawler (v3.4.31): Downloading (connecting...)Downloading (0%)           Downloading (25%)Downloading (30%)Downloading (40%)Downloading (45%)Downloading (70%)Downloading (75%)Downloading (95%)Downloading (100%)
27-Nov-2019 16:14:47   - Installing symfony/css-selector (v3.4.31): Downloading (connecting...)Downloading (0%)           Downloading (5%)Downloading (10%)Downloading (15%)Downloading (20%)Downloading (25%)Downloading (30%)Downloading (35%)Downloading (40%)Downloading (45%)Downloading (50%)Downloading (55%)Downloading (60%)Downloading (100%)
27-Nov-2019 16:14:48   - Installing symfony/browser-kit (v3.4.31): Downloading (connecting...)Downloading (100%)         
27-Nov-2019 16:14:48   - Installing guzzlehttp/guzzle (6.3.3): Downloading (connecting...)Downloading (0%)           Downloading (5%)Downloading (15%)Downloading (25%)Downloading (30%)Downloading (40%)Downloading (45%)Downloading (50%)Downloading (60%)Downloading (65%)Downloading (75%)Downloading (80%)Downloading (85%)Downloading (95%)Downloading (100%)
27-Nov-2019 16:14:49   - Installing fabpot/goutte (v3.2.3): Downloading (connecting...)Downloading (0%)           Downloading (40%)Downloading (100%)
27-Nov-2019 16:14:50   - Installing facebook/webdriver (1.7.1): Downloading (connecting...)Downloading (0%)           Downloading (5%)Downloading (10%)Downloading (15%)Downloading (20%)Downloading (25%)Downloading (30%)Downloading (35%)Downloading (40%)Downloading (45%)Downloading (50%)Downloading (55%)Downloading (60%)Downloading (65%)Downloading (70%)Downloading (75%)Downloading (80%)Downloading (85%)Downloading (90%)Downloading (95%)Downloading (100%)
27-Nov-2019 16:14:51   - Installing symfony/yaml (v3.4.31): Downloading (connecting...)Downloading (0%)           Downloading (5%)Downloading (10%)Downloading (15%)Downloading (45%)Downloading (50%)Downloading (55%)Downloading (60%)Downloading (65%)Downloading (70%)Downloading (75%)Downloading (80%)Downloading (100%)
27-Nov-2019 16:14:51   - Installing laravel/homestead (v7.20.0): Downloading (connecting...)Downloading (100%)         
27-Nov-2019 16:14:52   - Installing phing/phing (2.16.1): Downloading (connecting...)Downloading (0%)           Downloading (5%)Downloading (10%)Downloading (15%)Downloading (20%)Downloading (25%)Downloading (30%)Downloading (35%)Downloading (40%)Downloading (45%)Downloading (50%)Downloading (55%)Downloading (60%)Downloading (65%)Downloading (70%)Downloading (75%)Downloading (80%)Downloading (85%)Downloading (90%)Downloading (95%)Downloading (100%)
27-Nov-2019 16:14:53   - Installing webmozart/assert (1.5.0): Downloading (connecting...)Downloading (0%)           Downloading (10%)Downloading (100%)
27-Nov-2019 16:14:53   - Installing phpdocumentor/reflection-common (2.0.0): Downloading (connecting...)Downloading (0%)           Downloading (65%)Downloading (100%)
27-Nov-2019 16:14:54   - Installing phpdocumentor/type-resolver (1.0.1): Downloading (connecting...)Downloading (0%)           Downloading (10%)Downloading (35%)Downloading (45%)Downloading (60%)Downloading (90%)Downloading (100%)
27-Nov-2019 16:14:55   - Installing phpdocumentor/reflection-docblock (4.3.2): Downloading (connecting...)Downloading (0%)           Downloading (5%)Downloading (10%)Downloading (15%)Downloading (20%)Downloading (25%)Downloading (30%)Downloading (45%)Downloading (50%)Downloading (55%)Downloading (60%)Downloading (65%)Downloading (70%)Downloading (75%)Downloading (80%)Downloading (85%)Downloading (90%)Downloading (95%)Downloading (100%)
27-Nov-2019 16:14:55   - Installing sebastian/version (2.0.1): Downloading (connecting...)Downloading (0%)           Downloading (100%)
27-Nov-2019 16:14:56   - Installing sebastian/resource-operations (2.0.1): Downloading (connecting...)Downloading (0%)           Downloading (25%)Downloading (45%)Downloading (70%)Downloading (100%)
27-Nov-2019 16:14:56   - Installing sebastian/recursion-context (3.0.0): Downloading (connecting...)Downloading (0%)           Downloading (35%)Downloading (70%)Downloading (100%)
27-Nov-2019 16:14:57   - Installing sebastian/object-reflector (1.1.1): Downloading (connecting...)Downloading (0%)           Downloading (65%)Downloading (100%)
27-Nov-2019 16:14:57   - Installing sebastian/object-enumerator (3.0.3): Downloading (connecting...)Downloading (0%)           Downloading (100%)
27-Nov-2019 16:14:58   - Installing sebastian/global-state (2.0.0): Downloading (connecting...)Downloading (0%)           Downloading (20%)Downloading (75%)Downloading (100%)
27-Nov-2019 16:14:58   - Installing sebastian/exporter (3.1.2): Downloading (connecting...)Downloading (0%)           Downloading (10%)Downloading (20%)Downloading (30%)Downloading (40%)Downloading (50%)Downloading (60%)Downloading (100%)
27-Nov-2019 16:14:59   - Installing sebastian/environment (4.2.2): Downloading (connecting...)Downloading (0%)           Downloading (35%)Downloading (65%)Downloading (100%)
27-Nov-2019 16:15:00   - Installing sebastian/diff (3.0.2): Downloading (connecting...)Downloading (0%)           Downloading (20%)Downloading (30%)Downloading (45%)Downloading (60%)Downloading (65%)Downloading (80%)Downloading (85%)Downloading (100%)
27-Nov-2019 16:15:00   - Installing sebastian/comparator (3.0.2): Downloading (connecting...)Downloading (0%)           Downloading (30%)Downloading (40%)Downloading (45%)Downloading (75%)Downloading (85%)Downloading (100%)
27-Nov-2019 16:15:01   - Installing phpunit/php-timer (2.1.2): Downloading (connecting...)Downloading (0%)           Downloading (35%)Downloading (70%)Downloading (100%)
27-Nov-2019 16:15:02   - Installing phpunit/php-text-template (1.2.1): Downloading (connecting...)Downloading (0%)           Downloading (35%)Downloading (100%)
27-Nov-2019 16:15:02   - Installing phpunit/php-file-iterator (2.0.2): Downloading (connecting...)Downloading (0%)           Downloading (35%)Downloading (70%)Downloading (100%)
27-Nov-2019 16:15:03   - Installing theseer/tokenizer (1.1.3): Downloading (connecting...)Downloading (0%)           Downloading (15%)Downloading (30%)Downloading (100%)
27-Nov-2019 16:15:03   - Installing sebastian/code-unit-reverse-lookup (1.0.1): Downloading (connecting...)Downloading (0%)           Downloading (55%)Downloading (100%)
27-Nov-2019 16:15:04   - Installing phpunit/php-token-stream (3.1.1): Downloading (connecting...)Downloading (0%)           Downloading (5%)Downloading (100%)
27-Nov-2019 16:15:04   - Installing phpunit/php-code-coverage (6.1.4): Downloading (connecting...)Downloading (0%)           Downloading (5%)Downloading (10%)Downloading (15%)Downloading (20%)Downloading (25%)Downloading (30%)Downloading (35%)Downloading (40%)Downloading (45%)Downloading (50%)Downloading (55%)Downloading (60%)Downloading (65%)Downloading (70%)Downloading (75%)Downloading (80%)Downloading (85%)Downloading (90%)Downloading (95%)Downloading (100%)
27-Nov-2019 16:15:05   - Installing doctrine/instantiator (1.2.0): Downloading (connecting...)Downloading (0%)           Downloading (100%)
27-Nov-2019 16:15:06   - Installing phpspec/prophecy (1.9.0): Downloading (connecting...)Downloading (0%)           Downloading (10%)Downloading (20%)Downloading (25%)Downloading (30%)Downloading (35%)Downloading (40%)Downloading (45%)Downloading (50%)Downloading (60%)Downloading (70%)Downloading (80%)Downloading (90%)Downloading (95%)Downloading (100%)
27-Nov-2019 16:15:06   - Installing phar-io/version (2.0.1): Downloading (connecting...)Downloading (0%)           Downloading (5%)Downloading (10%)Downloading (100%)
27-Nov-2019 16:15:07   - Installing phar-io/manifest (1.0.3): Downloading (connecting...)Downloading (0%)           Downloading (10%)Downloading (15%)Downloading (25%)Downloading (30%)Downloading (35%)Downloading (45%)Downloading (50%)Downloading (60%)Downloading (70%)Downloading (75%)Downloading (85%)Downloading (95%)Downloading (100%)
27-Nov-2019 16:15:08   - Installing myclabs/deep-copy (1.9.3): Downloading (connecting...)Downloading (0%)           Downloading (5%)Downloading (10%)Downloading (15%)Downloading (20%)Downloading (25%)Downloading (30%)Downloading (100%)
27-Nov-2019 16:15:08   - Installing phpunit/phpunit (7.5.16): Downloading (connecting...)Downloading (0%)           Downloading (5%)Downloading (10%)Downloading (15%)Downloading (20%)Downloading (25%)Downloading (30%)Downloading (35%)Downloading (40%)Downloading (45%)Downloading (50%)Downloading (55%)Downloading (60%)Downloading (65%)Downloading (70%)Downloading (75%)Downloading (80%)Downloading (85%)Downloading (90%)Downloading (95%)Downloading (100%)
27-Nov-2019 16:15:09   - Installing phpunit/dbunit (4.0.0): Downloading (connecting...)Downloading (0%)           Downloading (10%)Downloading (15%)Downloading (20%)Downloading (25%)Downloading (30%)Downloading (35%)Downloading (40%)Downloading (45%)Downloading (50%)Downloading (55%)Downloading (60%)Downloading (65%)Downloading (75%)Downloading (80%)Downloading (85%)Downloading (90%)Downloading (95%)Downloading (100%)
27-Nov-2019 16:15:10   - Installing squizlabs/php_codesniffer (3.5.0): Downloading (connecting...)Downloading (0%)           Downloading (5%)Downloading (10%)Downloading (15%)Downloading (20%)Downloading (25%)Downloading (30%)Downloading (35%)Downloading (40%)Downloading (45%)Downloading (50%)Downloading (55%)Downloading (60%)Downloading (65%)Downloading (70%)Downloading (75%)Downloading (80%)Downloading (85%)Downloading (90%)Downloading (95%)Downloading (100%)
27-Nov-2019 16:15:11 symfony/console suggests installing symfony/lock
27-Nov-2019 16:15:11 guzzlehttp/psr7 suggests installing zendframework/zend-httphandlerrunner (Emit PSR-7 responses)
27-Nov-2019 16:15:11 lusitanian/oauth suggests installing predis/predis (Allows using the Redis storage backend.)
27-Nov-2019 16:15:11 patchwork/utf8 suggests installing ext-intl (Use Intl for best performance)
27-Nov-2019 16:15:11 patchwork/utf8 suggests installing ext-wfio (Use WFIO for UTF-8 filesystem access on Windows)
27-Nov-2019 16:15:11 s9e/text-formatter suggests installing ext-intl (Allows international URLs to be accepted by the URL filter)
27-Nov-2019 16:15:11 s9e/text-formatter suggests installing ext-xsl (Enables the XSLT renderer)
27-Nov-2019 16:15:11 paragonie/random_compat suggests installing ext-libsodium (Provides a modern crypto API that can be used to generate random bytes.)
27-Nov-2019 16:15:11 symfony/http-kernel suggests installing symfony/var-dumper
27-Nov-2019 16:15:11 symfony/dependency-injection suggests installing symfony/expression-language (For using expressions in service container configuration)
27-Nov-2019 16:15:11 zendframework/zend-eventmanager suggests installing container-interop/container-interop (^1.1.0, to use the lazy listeners feature)
27-Nov-2019 16:15:11 zendframework/zend-eventmanager suggests installing zendframework/zend-stdlib (^2.7.3 || ^3.0, to use the FilterChain feature)
27-Nov-2019 16:15:11 zendframework/zend-code suggests installing doctrine/annotations (Doctrine\Common\Annotations >=1.0 for annotation features)
27-Nov-2019 16:15:11 zendframework/zend-code suggests installing zendframework/zend-stdlib (Zend\Stdlib component)
27-Nov-2019 16:15:11 ocramius/proxy-manager suggests installing ocramius/generated-hydrator (To have very fast object to array to object conversion for ghost objects)
27-Nov-2019 16:15:11 ocramius/proxy-manager suggests installing zendframework/zend-json (To have the JsonRpc adapter (Remote Object feature))
27-Nov-2019 16:15:11 ocramius/proxy-manager suggests installing zendframework/zend-soap (To have the Soap adapter (Remote Object feature))
27-Nov-2019 16:15:11 ocramius/proxy-manager suggests installing zendframework/zend-xmlrpc (To have the XmlRpc adapter (Remote Object feature))
27-Nov-2019 16:15:11 symfony/routing suggests installing doctrine/annotations (For using the annotation loader)
27-Nov-2019 16:15:11 symfony/routing suggests installing symfony/expression-language (For using expression matching)
27-Nov-2019 16:15:11 symfony/twig-bridge suggests installing symfony/asset (For using the AssetExtension)
27-Nov-2019 16:15:11 symfony/twig-bridge suggests installing symfony/expression-language (For using the ExpressionExtension)
27-Nov-2019 16:15:11 symfony/twig-bridge suggests installing symfony/form (For using the FormExtension)
27-Nov-2019 16:15:11 symfony/twig-bridge suggests installing symfony/security (For using the SecurityExtension)
27-Nov-2019 16:15:11 symfony/twig-bridge suggests installing symfony/stopwatch (For using the StopwatchExtension)
27-Nov-2019 16:15:11 symfony/twig-bridge suggests installing symfony/templating (For using the TwigEngine)
27-Nov-2019 16:15:11 symfony/twig-bridge suggests installing symfony/translation (For using the TranslationExtension)
27-Nov-2019 16:15:11 symfony/twig-bridge suggests installing symfony/var-dumper (For using the DumpExtension)
27-Nov-2019 16:15:11 symfony/twig-bridge suggests installing symfony/web-link (For using the WebLinkExtension)
27-Nov-2019 16:15:11 facebook/webdriver suggests installing ext-SimpleXML (For Firefox profile creation)
27-Nov-2019 16:15:11 phing/phing suggests installing pdepend/pdepend (PHP version of JDepend)
27-Nov-2019 16:15:11 phing/phing suggests installing pear/archive_tar (Tar file management class)
27-Nov-2019 16:15:11 phing/phing suggests installing pear/versioncontrol_git (A library that provides OO interface to handle Git repository)
27-Nov-2019 16:15:11 phing/phing suggests installing pear/versioncontrol_svn (A simple OO-style interface for Subversion, the free/open-source version control system)
27-Nov-2019 16:15:11 phing/phing suggests installing phpdocumentor/phpdocumentor (Documentation Generator for PHP)
27-Nov-2019 16:15:11 phing/phing suggests installing phploc/phploc (A tool for quickly measuring the size of a PHP project)
27-Nov-2019 16:15:11 phing/phing suggests installing phpmd/phpmd (PHP version of PMD tool)
27-Nov-2019 16:15:11 phing/phing suggests installing sebastian/phpcpd (Copy/Paste Detector (CPD) for PHP code)
27-Nov-2019 16:15:11 phing/phing suggests installing siad007/versioncontrol_hg (A library for interfacing with Mercurial repositories.)
27-Nov-2019 16:15:11 phing/phing suggests installing tedivm/jshrink (Javascript Minifier built in PHP)
27-Nov-2019 16:15:11 sebastian/global-state suggests installing ext-uopz (*)
27-Nov-2019 16:15:11 phpunit/phpunit suggests installing ext-soap (*)
27-Nov-2019 16:15:11 phpunit/phpunit suggests installing phpunit/php-invoker (^2.0)
27-Nov-2019 16:15:11 Package phpunit/dbunit is abandoned, you should avoid using it. No replacement was suggested.
27-Nov-2019 16:15:11 Generating autoload files
27-Nov-2019 16:15:11 ocramius/package-versions:  Generating version class...
27-Nov-2019 16:15:11 ocramius/package-versions: ...done generating version class
27-Nov-2019 16:15:11 Buildfile: /data/build/build.xml
27-Nov-2019 16:15:11
27-Nov-2019 16:15:11 phpBB > clean:
27-Nov-2019 16:15:11
27-Nov-2019 16:15:11    [delete] Directory /data/build/logs does not exist or is not a directory.
27-Nov-2019 16:15:11    [delete] Directory /data/build/api does not exist or is not a directory.
27-Nov-2019 16:15:11    [delete] Directory /data/build/codebrowser does not exist or is not a directory.
27-Nov-2019 16:15:11    [delete] Directory /data/build/coverage does not exist or is not a directory.
27-Nov-2019 16:15:11    [delete] Directory /data/build/cpd does not exist or is not a directory.
27-Nov-2019 16:15:11    [delete] Directory /data/build/dependencies does not exist or is not a directory.
27-Nov-2019 16:15:11    [delete] Directory /data/build/new_version does not exist or is not a directory.
27-Nov-2019 16:15:11    [delete] Directory /data/build/old_versions does not exist or is not a directory.
27-Nov-2019 16:15:11    [delete] Directory /data/build/save does not exist or is not a directory.
27-Nov-2019 16:15:11
27-Nov-2019 16:15:11 phpBB > prepare:
27-Nov-2019 16:15:11
27-Nov-2019 16:15:11     [mkdir] Created dir: /data/build/logs
27-Nov-2019 16:15:11     [mkdir] Created dir: /data/build/api
27-Nov-2019 16:15:11     [mkdir] Created dir: /data/build/codebrowser
27-Nov-2019 16:15:11     [mkdir] Created dir: /data/build/coverage
27-Nov-2019 16:15:11     [mkdir] Created dir: /data/build/cpd
27-Nov-2019 16:15:11     [mkdir] Created dir: /data/build/dependencies
27-Nov-2019 16:15:11     [mkdir] Created dir: /data/build/new_version
27-Nov-2019 16:15:11     [mkdir] Created dir: /data/build/new_version/files
27-Nov-2019 16:15:11     [mkdir] Created dir: /data/build/new_version/patches
27-Nov-2019 16:15:11     [mkdir] Created dir: /data/build/new_version/release_files
27-Nov-2019 16:15:11     [mkdir] Created dir: /data/build/new_version/update
27-Nov-2019 16:15:12     [mkdir] Created dir: /data/build/old_versions
27-Nov-2019 16:15:12     [mkdir] Created dir: /data/build/save
27-Nov-2019 16:15:12
27-Nov-2019 16:15:12 BUILD FINISHED
27-Nov-2019 16:15:12
27-Nov-2019 16:15:12 Total time: 0.0896 seconds
27-Nov-2019 16:15:12
27-Nov-2019 16:15:12 Finished task 'Prepare directory' with result: Success
27-Nov-2019 16:15:12 Skipping execution of task 'Run sniffs' as it is disabled
27-Nov-2019 16:15:12
Substituting variable: ${bamboo.working.directory} with /home/bamboo/xml-data/build-dir/PHPBB3-PR-JOB1
27-Nov-2019 16:15:12 Starting task 'Run sniffs' of type 'com.atlassian.bamboo.plugins.bamboo-docker-plugin:task.docker.cli'
27-Nov-2019 16:15:12 Running image name (phpbb:php-7.1)
27-Nov-2019 16:15:12
Beginning to execute external process for build 'phpBB3 - Pull Requests - Build and Test Job #9726 (PHPBB3-PR-JOB1-9726)'
... running command line:
/usr/bin/docker run --volume /home/bamboo/xml-data/build-dir/PHPBB3-PR-JOB1:/data --workdir /data/build --rm -u=991 phpbb:php-7.1 ../phpBB/vendor/bin/phing sniff
... in: /home/bamboo/xml-data/build-dir/PHPBB3-PR-JOB1
... using extra environment variables:
bamboo_planRepository_1_branch=3.1.x
bamboo_planRepository_1_branchDisplayName=3.1.x
bamboo_repository_revision_number=dc8ff9da28b8ab4ad11c7ea94cca526f17c87fe5
bamboo_PRref=master
bamboo_resultsUrl=https://bamboo.phpbb.com/browse/PHPBB3-PR-JOB1-9726
bamboo_capability_system_builder_command_Git=/usr/bin/git
bamboo_repository_75956235_git_username=bantu
bamboo_build_working_directory=/home/bamboo/xml-data/build-dir/PHPBB3-PR-JOB1
bamboo_planRepository_1_name=phpBB Ascraeus
bamboo_buildKey=PHPBB3-PR-JOB1
bamboo_capability_phpbb_tests=true
bamboo_shortPlanName=Pull Requests
bamboo_capability_system_builder_command_fop=/usr/bin/fop
bamboo_capability_dbms_sqlite_2=true
bamboo_planRepository_name=phpBB Ascraeus
bamboo_PRnumber=5746
bamboo_buildNumber=9726
bamboo_repository_75956235_git_repositoryUrl=https://github.com/phpbb/phpbb.git
bamboo_capability_system_builder_phpunit_PHPUnit=/usr/bin/phpunit
bamboo_shortJobName=Build and Test Job
bamboo_buildResultsUrl=https://bamboo.phpbb.com/browse/PHPBB3-PR-JOB1-9726
bamboo_repository_75956235_branch_name=3.1.x
bamboo_planRepository_repositoryUrl=https://github.com/phpbb/phpbb.git
bamboo_agentId=131073
bamboo_planName=phpBB3 - Pull Requests
bamboo_build_commandline_com_atlassian_bamboo_plugins_scripttask_task_builder_script_7=/bin/sh /home/bamboo/temp/PHPBB3-PR-JOB1-9726-ScriptBuildTask-5758660211912520253.sh
bamboo_shortPlanKey=PR
bamboo_shortJobKey=JOB1
bamboo_capability_dbms_mysql_55=true
bamboo_capability_system_jdk_JDK_1_7_0_65=/usr/lib/jvm/java-7-openjdk-amd64
bamboo_planRepository_revision=dc8ff9da28b8ab4ad11c7ea94cca526f17c87fe5
bamboo_buildTimeStamp=2019-11-27T16:14:02.981Z
bamboo_repository_previous_revision_number=dc8ff9da28b8ab4ad11c7ea94cca526f17c87fe5
bamboo_capability_system_jdk_JDK_1_6_0_16=/usr/lib/jvm/java-6-sun-1.6.0.16
bamboo_capability_system_builder_mvn2_Maven_2=/usr/share/maven2
bamboo_planRepository_previousRevision=dc8ff9da28b8ab4ad11c7ea94cca526f17c87fe5
bamboo_build_commandline_com_atlassian_bamboo_plugins_scripttask_task_builder_script_4=/bin/sh /home/bamboo/temp/PHPBB3-PR-JOB1-9726-ScriptBuildTask-6474111210365733875.sh
bamboo_repository_git_branch=3.1.x
bamboo_buildResultKey=PHPBB3-PR-JOB1-9726
bamboo_repository_branch_name=3.1.x
bamboo_buildPlanName=phpBB3 - Pull Requests - Build and Test Job
bamboo_planRepository_1_revision=dc8ff9da28b8ab4ad11c7ea94cca526f17c87fe5
bamboo_repository_name=phpBB Ascraeus
bamboo_buildFailed=false
bamboo_capability_system_docker_executable=/usr/bin/docker
bamboo_build_commandline_com_atlassian_bamboo_plugins_bamboo_docker_plugin_task_docker_cli_12=/usr/bin/docker run --volume /home/bamboo/xml-data/build-dir/PHPBB3-PR-JOB1:/data --workdir /data/phpBB --rm -e HOME=/home/bamboo -u=991 phpbb:php-7.1 /bin/bash -c php ../composer.phar install --dev; cd ../build; ../phpBB/vendor/bin/phing clean prepare
bamboo_build_commandline_com_atlassian_bamboo_plugins_bamboo_docker_plugin_task_docker_cli_13=/usr/bin/docker build --force-rm=true --tag=phpbb:php-7.1 /home/bamboo/xml-data/build-dir/PHPBB3-PR-JOB1
bamboo_planRepository_branch=3.1.x
bamboo_agentWorkingDirectory=/home/bamboo/xml-data/build-dir
bamboo_capability_system_git_executable=/usr/bin/git
bamboo_capability_system_builder_phpunit_PHPUnit_3_4=/usr/bin/phpunit
bamboo_repository_git_username=bantu
bamboo_planRepository_1_previousRevision=dc8ff9da28b8ab4ad11c7ea94cca526f17c87fe5
bamboo_repository_75956235_revision_number=dc8ff9da28b8ab4ad11c7ea94cca526f17c87fe5
bamboo_planRepository_branchDisplayName=3.1.x
bamboo_planRepository_1_type=gitv2
bamboo_planRepository_branchName=3.1.x
bamboo_repository_75956235_previous_revision_number=dc8ff9da28b8ab4ad11c7ea94cca526f17c87fe5
bamboo_capability_system_jdk_JDK=/usr/lib/jvm/java-6-sun
bamboo_plan_storageTag=PHPBB3-PR
bamboo_hg_cache_directory=/home/bamboo/xml-data/build-dir/_hg-repositories-cache
bamboo_planRepository_1_username=bantu
bamboo_planRepository_type=gitv2
bamboo_git_cache_directory=/home/bamboo/xml-data/build-dir/_git-repositories-cache
bamboo_ManualBuildTriggerReason_userName=Build Robot
bamboo_repository_git_repositoryUrl=https://github.com/phpbb/phpbb.git
bamboo_repository_75956235_git_branch=3.1.x
bamboo_capability_system_builder_ant_Ant=/usr/share/ant
bamboo_repository_75956235_name=phpBB Ascraeus
bamboo_tmp_directory=/home/bamboo/temp
bamboo_working_directory=/home/bamboo/xml-data/build-dir/PHPBB3-PR-JOB1
bamboo_planKey=PHPBB3-PR
bamboo_capability_local=true
bamboo_planRepository_1_repositoryUrl=https://github.com/phpbb/phpbb.git
bamboo_planRepository_username=bantu
bamboo_capability_system_jdk_JDK_1_6=/usr/lib/jvm/java-6-sun
bamboo_capability_system_jdk_JDK_1_7=/usr/lib/jvm/java-7-openjdk-amd64
bamboo_planRepository_1_branchName=3.1.x
27-Nov-2019 16:15:12 Buildfile: /data/build/build.xml
27-Nov-2019 16:15:12
27-Nov-2019 16:15:12 phpBB > sniff:
27-Nov-2019 16:15:12
27-Nov-2019 16:15:18 ............................................................  60 / 866 (7%)
27-Nov-2019 16:15:19 ............................................................ 120 / 866 (14%)
27-Nov-2019 16:15:19 ............................................................ 180 / 866 (21%)
27-Nov-2019 16:15:20 ............................................................ 240 / 866 (28%)
27-Nov-2019 16:15:22 ............................................................ 300 / 866 (35%)
27-Nov-2019 16:15:26 ............................................................ 360 / 866 (42%)
27-Nov-2019 16:15:32 ............................................................ 420 / 866 (48%)
27-Nov-2019 16:15:37 ............................................................ 480 / 866 (55%)
27-Nov-2019 16:15:45 ............................................................ 540 / 866 (62%)
27-Nov-2019 16:15:50 ............................................................ 600 / 866 (69%)
27-Nov-2019 16:15:53 ............................................................ 660 / 866 (76%)
27-Nov-2019 16:15:56 ............................................................ 720 / 866 (83%)
27-Nov-2019 16:15:59 ............................................................ 780 / 866 (90%)
27-Nov-2019 16:16:05 ............................................................ 840 / 866 (97%)
27-Nov-2019 16:16:06 ..........................                                   866 / 866 (100%)
27-Nov-2019 16:16:06
27-Nov-2019 16:16:06
27-Nov-2019 16:16:06 Time: 53.25 secs; Memory: 50.01MB
27-Nov-2019 16:16:06
27-Nov-2019 16:16:06       [php] Calling PHP function: preg_replace()
27-Nov-2019 16:16:11 ............................................................ 60 / 89 (67%)
27-Nov-2019 16:16:22 .............................                                89 / 89 (100%)
27-Nov-2019 16:16:22
27-Nov-2019 16:16:22
27-Nov-2019 16:16:22 Time: 16.49 secs; Memory: 38.01MB
27-Nov-2019 16:16:22
27-Nov-2019 16:16:22
27-Nov-2019 16:16:22
27-Nov-2019 16:16:22 Time: 30ms; Memory: 4MB
27-Nov-2019 16:16:22
27-Nov-2019 16:16:22
27-Nov-2019 16:16:22 BUILD FINISHED
27-Nov-2019 16:16:22
27-Nov-2019 16:16:22 Total time: 1 minute  9.97 seconds
27-Nov-2019 16:16:22
27-Nov-2019 16:16:22 Finished task 'Run sniffs' with result: Success
27-Nov-2019 16:16:22 Skipping execution of task 'Run tests' as it is disabled
27-Nov-2019 16:16:22
Substituting variable: ${bamboo.working.directory} with /home/bamboo/xml-data/build-dir/PHPBB3-PR-JOB1
27-Nov-2019 16:16:22 Starting task 'Run tests' of type 'com.atlassian.bamboo.plugins.bamboo-docker-plugin:task.docker.cli'
27-Nov-2019 16:16:22 Running image name (phpbb:php-7.1)
27-Nov-2019 16:16:22
Beginning to execute external process for build 'phpBB3 - Pull Requests - Build and Test Job #9726 (PHPBB3-PR-JOB1-9726)'
... running command line:
/usr/bin/docker run --volume /home/bamboo/xml-data/build-dir/PHPBB3-PR-JOB1:/data --workdir /data --rm -u=991 -t phpbb:php-7.1 /bin/bash -c phpBB/vendor/bin/phpunit --log-junit build/logs/phpunit.xml
... in: /home/bamboo/xml-data/build-dir/PHPBB3-PR-JOB1
... using extra environment variables:
bamboo_planRepository_1_branch=3.1.x
bamboo_planRepository_1_branchDisplayName=3.1.x
bamboo_repository_revision_number=dc8ff9da28b8ab4ad11c7ea94cca526f17c87fe5
bamboo_PRref=master
bamboo_resultsUrl=https://bamboo.phpbb.com/browse/PHPBB3-PR-JOB1-9726
bamboo_capability_system_builder_command_Git=/usr/bin/git
bamboo_repository_75956235_git_username=bantu
bamboo_build_working_directory=/home/bamboo/xml-data/build-dir/PHPBB3-PR-JOB1
bamboo_planRepository_1_name=phpBB Ascraeus
bamboo_buildKey=PHPBB3-PR-JOB1
bamboo_capability_phpbb_tests=true
bamboo_shortPlanName=Pull Requests
bamboo_capability_system_builder_command_fop=/usr/bin/fop
bamboo_capability_dbms_sqlite_2=true
bamboo_planRepository_name=phpBB Ascraeus
bamboo_PRnumber=5746
bamboo_buildNumber=9726
bamboo_repository_75956235_git_repositoryUrl=https://github.com/phpbb/phpbb.git
bamboo_capability_system_builder_phpunit_PHPUnit=/usr/bin/phpunit
bamboo_shortJobName=Build and Test Job
bamboo_buildResultsUrl=https://bamboo.phpbb.com/browse/PHPBB3-PR-JOB1-9726
bamboo_repository_75956235_branch_name=3.1.x
bamboo_planRepository_repositoryUrl=https://github.com/phpbb/phpbb.git
bamboo_agentId=131073
bamboo_planName=phpBB3 - Pull Requests
bamboo_build_commandline_com_atlassian_bamboo_plugins_scripttask_task_builder_script_7=/bin/sh /home/bamboo/temp/PHPBB3-PR-JOB1-9726-ScriptBuildTask-5758660211912520253.sh
bamboo_shortPlanKey=PR
bamboo_shortJobKey=JOB1
bamboo_capability_dbms_mysql_55=true
bamboo_capability_system_jdk_JDK_1_7_0_65=/usr/lib/jvm/java-7-openjdk-amd64
bamboo_planRepository_revision=dc8ff9da28b8ab4ad11c7ea94cca526f17c87fe5
bamboo_buildTimeStamp=2019-11-27T16:14:02.981Z
bamboo_repository_previous_revision_number=dc8ff9da28b8ab4ad11c7ea94cca526f17c87fe5
bamboo_capability_system_jdk_JDK_1_6_0_16=/usr/lib/jvm/java-6-sun-1.6.0.16
bamboo_capability_system_builder_mvn2_Maven_2=/usr/share/maven2
bamboo_planRepository_previousRevision=dc8ff9da28b8ab4ad11c7ea94cca526f17c87fe5
bamboo_build_commandline_com_atlassian_bamboo_plugins_scripttask_task_builder_script_4=/bin/sh /home/bamboo/temp/PHPBB3-PR-JOB1-9726-ScriptBuildTask-6474111210365733875.sh
bamboo_repository_git_branch=3.1.x
bamboo_buildResultKey=PHPBB3-PR-JOB1-9726
bamboo_repository_branch_name=3.1.x
bamboo_buildPlanName=phpBB3 - Pull Requests - Build and Test Job
bamboo_planRepository_1_revision=dc8ff9da28b8ab4ad11c7ea94cca526f17c87fe5
bamboo_repository_name=phpBB Ascraeus
bamboo_buildFailed=false
bamboo_capability_system_docker_executable=/usr/bin/docker
bamboo_build_commandline_com_atlassian_bamboo_plugins_bamboo_docker_plugin_task_docker_cli_11=/usr/bin/docker run --volume /home/bamboo/xml-data/build-dir/PHPBB3-PR-JOB1:/data --workdir /data/build --rm -u=991 phpbb:php-7.1 ../phpBB/vendor/bin/phing sniff
bamboo_build_commandline_com_atlassian_bamboo_plugins_bamboo_docker_plugin_task_docker_cli_12=/usr/bin/docker run --volume /home/bamboo/xml-data/build-dir/PHPBB3-PR-JOB1:/data --workdir /data/phpBB --rm -e HOME=/home/bamboo -u=991 phpbb:php-7.1 /bin/bash -c php ../composer.phar install --dev; cd ../build; ../phpBB/vendor/bin/phing clean prepare
bamboo_build_commandline_com_atlassian_bamboo_plugins_bamboo_docker_plugin_task_docker_cli_13=/usr/bin/docker build --force-rm=true --tag=phpbb:php-7.1 /home/bamboo/xml-data/build-dir/PHPBB3-PR-JOB1
bamboo_planRepository_branch=3.1.x
bamboo_agentWorkingDirectory=/home/bamboo/xml-data/build-dir
bamboo_capability_system_git_executable=/usr/bin/git
bamboo_capability_system_builder_phpunit_PHPUnit_3_4=/usr/bin/phpunit
bamboo_repository_git_username=bantu
bamboo_planRepository_1_previousRevision=dc8ff9da28b8ab4ad11c7ea94cca526f17c87fe5
bamboo_repository_75956235_revision_number=dc8ff9da28b8ab4ad11c7ea94cca526f17c87fe5
bamboo_planRepository_branchDisplayName=3.1.x
bamboo_planRepository_1_type=gitv2
bamboo_planRepository_branchName=3.1.x
bamboo_repository_75956235_previous_revision_number=dc8ff9da28b8ab4ad11c7ea94cca526f17c87fe5
bamboo_capability_system_jdk_JDK=/usr/lib/jvm/java-6-sun
bamboo_plan_storageTag=PHPBB3-PR
bamboo_hg_cache_directory=/home/bamboo/xml-data/build-dir/_hg-repositories-cache
bamboo_planRepository_1_username=bantu
bamboo_planRepository_type=gitv2
bamboo_git_cache_directory=/home/bamboo/xml-data/build-dir/_git-repositories-cache
bamboo_ManualBuildTriggerReason_userName=Build Robot
bamboo_repository_git_repositoryUrl=https://github.com/phpbb/phpbb.git
bamboo_repository_75956235_git_branch=3.1.x
bamboo_capability_system_builder_ant_Ant=/usr/share/ant
bamboo_repository_75956235_name=phpBB Ascraeus
bamboo_tmp_directory=/home/bamboo/temp
bamboo_working_directory=/home/bamboo/xml-data/build-dir/PHPBB3-PR-JOB1
bamboo_planKey=PHPBB3-PR
bamboo_capability_local=true
bamboo_planRepository_1_repositoryUrl=https://github.com/phpbb/phpbb.git
bamboo_planRepository_username=bantu
bamboo_capability_system_jdk_JDK_1_6=/usr/lib/jvm/java-6-sun
bamboo_capability_system_jdk_JDK_1_7=/usr/lib/jvm/java-7-openjdk-amd64
bamboo_planRepository_1_branchName=3.1.x
27-Nov-2019 16:16:24 PHPUnit 7.5.16 by Sebastian Bergmann and contributors.
27-Nov-2019 16:16:24
27-Nov-2019 16:16:30 .........................................F...................   61 / 7113 (  0%)
27-Nov-2019 16:16:31 .............................................................  122 / 7113 (  1%)
27-Nov-2019 16:16:31 .............I.....SSSS............SSSSSSSS.........S...S....  183 / 7113 (  2%)
27-Nov-2019 16:16:32 .............................................................  244 / 7113 (  3%)
27-Nov-2019 16:16:37 .....S.......................................................  305 / 7113 (  4%)
27-Nov-2019 16:16:38 .............................................................  366 / 7113 (  5%)
27-Nov-2019 16:16:38 .............................................................  427 / 7113 (  6%)
27-Nov-2019 16:16:38 .............................................................  488 / 7113 (  6%)
27-Nov-2019 16:16:39 .............................................................  549 / 7113 (  7%)
27-Nov-2019 16:16:39 .............................................................  610 / 7113 (  8%)
27-Nov-2019 16:16:39 .............................................................  671 / 7113 (  9%)
27-Nov-2019 16:16:39 .............................................................  732 / 7113 ( 10%)
27-Nov-2019 16:16:40 .............................................................  793 / 7113 ( 11%)
27-Nov-2019 16:16:40 .............................................................  854 / 7113 ( 12%)
27-Nov-2019 16:16:40 .............................................................  915 / 7113 ( 12%)
27-Nov-2019 16:16:41 .............................................................  976 / 7113 ( 13%)
27-Nov-2019 16:16:41 ............................................................. 1037 / 7113 ( 14%)
27-Nov-2019 16:16:44 ....................................................I........ 1098 / 7113 ( 15%)
27-Nov-2019 16:16:47 ............................................................. 1159 / 7113 ( 16%)
27-Nov-2019 16:16:49 ............................................................. 1220 / 7113 ( 17%)
27-Nov-2019 16:16:50 ....S.S.S.................................................... 1281 / 7113 ( 18%)
27-Nov-2019 16:16:50 ............................................................. 1342 / 7113 ( 18%)
27-Nov-2019 16:16:50 ............................................................. 1403 / 7113 ( 19%)
27-Nov-2019 16:16:51 ............................................................. 1464 / 7113 ( 20%)
27-Nov-2019 16:16:51 ............................................................. 1525 / 7113 ( 21%)
27-Nov-2019 16:16:51 ............................................................. 1586 / 7113 ( 22%)
27-Nov-2019 16:16:51 ............................................................. 1647 / 7113 ( 23%)
27-Nov-2019 16:16:51 ............................................................. 1708 / 7113 ( 24%)
27-Nov-2019 16:16:51 ............................................................. 1769 / 7113 ( 24%)
27-Nov-2019 16:16:51 ............................................................. 1830 / 7113 ( 25%)
27-Nov-2019 16:16:51 ............................................................. 1891 / 7113 ( 26%)
27-Nov-2019 16:16:51 ............................................................. 1952 / 7113 ( 27%)
27-Nov-2019 16:16:51 ............................................................. 2013 / 7113 ( 28%)
27-Nov-2019 16:16:52 ............................................................. 2074 / 7113 ( 29%)
27-Nov-2019 16:16:52 ............................................................. 2135 / 7113 ( 30%)
27-Nov-2019 16:16:53 ............................................................. 2196 / 7113 ( 30%)
27-Nov-2019 16:16:53 ............................................................. 2257 / 7113 ( 31%)
27-Nov-2019 16:16:54 ............................................................. 2318 / 7113 ( 32%)
27-Nov-2019 16:16:56 ..I.II....................................................... 2379 / 7113 ( 33%)
27-Nov-2019 16:16:56 ............................................................. 2440 / 7113 ( 34%)
27-Nov-2019 16:16:56 ............................................................. 2501 / 7113 ( 35%)
27-Nov-2019 16:16:56 ............................................................. 2562 / 7113 ( 36%)
27-Nov-2019 16:16:58 ............................................................. 2623 / 7113 ( 36%)
27-Nov-2019 16:16:58 ....................E........................................ 2684 / 7113 ( 37%)
27-Nov-2019 16:16:59 ............................................................. 2745 / 7113 ( 38%)
27-Nov-2019 16:16:59 ............................................................. 2806 / 7113 ( 39%)
27-Nov-2019 16:17:04 ............................................................. 2867 / 7113 ( 40%)
27-Nov-2019 16:17:07 ............................................................. 2928 / 7113 ( 41%)
27-Nov-2019 16:17:10 ............................................................. 2989 / 7113 ( 42%)
27-Nov-2019 16:17:13 .....S....................................................... 3050 / 7113 ( 42%)
27-Nov-2019 16:17:18 ............................................................. 3111 / 7113 ( 43%)
27-Nov-2019 16:17:20 ............................................................. 3172 / 7113 ( 44%)
27-Nov-2019 16:17:35 .....SSSSSSS................................................. 3233 / 7113 ( 45%)
27-Nov-2019 16:17:35 ............................................................. 3294 / 7113 ( 46%)
27-Nov-2019 16:17:36 ............................................................. 3355 / 7113 ( 47%)
27-Nov-2019 16:17:36 ............................................................. 3416 / 7113 ( 48%)
27-Nov-2019 16:17:36 ............................................................. 3477 / 7113 ( 48%)
27-Nov-2019 16:17:36 ............................................................. 3538 / 7113 ( 49%)
27-Nov-2019 16:17:36 ............................................................. 3599 / 7113 ( 50%)
27-Nov-2019 16:17:36 ............................................................. 3660 / 7113 ( 51%)
27-Nov-2019 16:17:36 ............................................................. 3721 / 7113 ( 52%)
27-Nov-2019 16:17:37 ............................................................. 3782 / 7113 ( 53%)
27-Nov-2019 16:17:39 ............................................................. 3843 / 7113 ( 54%)
27-Nov-2019 16:17:40 ............................................................. 3904 / 7113 ( 54%)
27-Nov-2019 16:17:41 ............................................................. 3965 / 7113 ( 55%)
27-Nov-2019 16:17:41 ............................................................. 4026 / 7113 ( 56%)
27-Nov-2019 16:17:42 ............................................................. 4087 / 7113 ( 57%)
27-Nov-2019 16:17:43 ............................................................. 4148 / 7113 ( 58%)
27-Nov-2019 16:17:50 ............................................................. 4209 / 7113 ( 59%)
27-Nov-2019 16:17:50 ............................................................. 4270 / 7113 ( 60%)
27-Nov-2019 16:17:51 ............................................................. 4331 / 7113 ( 60%)
27-Nov-2019 16:17:51 ............................................................. 4392 / 7113 ( 61%)
27-Nov-2019 16:17:51 ............................................................. 4453 / 7113 ( 62%)
27-Nov-2019 16:17:51 ............................................................. 4514 / 7113 ( 63%)
27-Nov-2019 16:17:51 ............................................................. 4575 / 7113 ( 64%)
27-Nov-2019 16:17:51 ............................................................. 4636 / 7113 ( 65%)
27-Nov-2019 16:17:51 ............................................................. 4697 / 7113 ( 66%)
27-Nov-2019 16:17:51 ............................................................. 4758 / 7113 ( 66%)
27-Nov-2019 16:17:52 ............................................................. 4819 / 7113 ( 67%)
27-Nov-2019 16:17:58 ............................................................. 4880 / 7113 ( 68%)
27-Nov-2019 16:18:04 .....................S....................................... 4941 / 7113 ( 69%)
27-Nov-2019 16:18:09 ............................................................. 5002 / 7113 ( 70%)
27-Nov-2019 16:18:14 ............................................................. 5063 / 7113 ( 71%)
27-Nov-2019 16:18:14 ............................................................. 5124 / 7113 ( 72%)
27-Nov-2019 16:18:15 ............................................................. 5185 / 7113 ( 72%)
27-Nov-2019 16:18:15 ............................................................. 5246 / 7113 ( 73%)
27-Nov-2019 16:18:15 ......................................SSSSSSSSSSSSSSSSSSSSSSS 5307 / 7113 ( 74%)
27-Nov-2019 16:18:15 SSSSSSSSSSSSSSSSSSSSSSSSSSSSSSSSSSSSSSSSSSSSSSSSSSSSSSSSSSSSS 5368 / 7113 ( 75%)
27-Nov-2019 16:18:15 SSSSSSSSSSSSSSSSSSSSSSSSSSSSSSSSSSSSSSSSSSSSSSSSSSSSSSSSSSSSS 5429 / 7113 ( 76%)
27-Nov-2019 16:18:15 SSSSSSSSSSSSSSSSSSSSSSSSSSSSSSSSSSSSSSSSSSSSSSSSSSSSSSSSSSSSS 5490 / 7113 ( 77%)
27-Nov-2019 16:18:16 SSSSSSSSSSSSS................................................ 5551 / 7113 ( 78%)
27-Nov-2019 16:18:18 ............................................................. 5612 / 7113 ( 78%)
27-Nov-2019 16:18:20 ............................................................. 5673 / 7113 ( 79%)
27-Nov-2019 16:18:22 ............................................................. 5734 / 7113 ( 80%)
27-Nov-2019 16:18:24 ............................................................. 5795 / 7113 ( 81%)
27-Nov-2019 16:18:26 ............................................................. 5856 / 7113 ( 82%)
27-Nov-2019 16:18:28 ............................................................. 5917 / 7113 ( 83%)
27-Nov-2019 16:18:30 ............................................................. 5978 / 7113 ( 84%)
27-Nov-2019 16:18:32 ............................................................. 6039 / 7113 ( 84%)
27-Nov-2019 16:18:34 ............................................................. 6100 / 7113 ( 85%)
27-Nov-2019 16:18:36 ............................................................. 6161 / 7113 ( 86%)
27-Nov-2019 16:18:38 ............................................................. 6222 / 7113 ( 87%)
27-Nov-2019 16:18:40 ............................................................. 6283 / 7113 ( 88%)
27-Nov-2019 16:18:42 ............................................................. 6344 / 7113 ( 89%)
27-Nov-2019 16:18:44 ............................................................. 6405 / 7113 ( 90%)
27-Nov-2019 16:18:46 ............................................................. 6466 / 7113 ( 90%)
27-Nov-2019 16:18:48 ............................................................. 6527 / 7113 ( 91%)
27-Nov-2019 16:18:50 ............................................................. 6588 / 7113 ( 92%)
27-Nov-2019 16:18:52 ............................................................. 6649 / 7113 ( 93%)
27-Nov-2019 16:18:54 ............................................................. 6710 / 7113 ( 94%)
27-Nov-2019 16:18:56 ............................................................. 6771 / 7113 ( 95%)
27-Nov-2019 16:18:58 ............................................................. 6832 / 7113 ( 96%)
27-Nov-2019 16:19:00 ............................................................. 6893 / 7113 ( 96%)
27-Nov-2019 16:19:02 ............................................................. 6954 / 7113 ( 97%)
27-Nov-2019 16:19:04 ............................................................. 7015 / 7113 ( 98%)
27-Nov-2019 16:19:06 ............................................SS
27-Nov-2019 16:19:06
27-Nov-2019 16:19:06 Time: 2.71 minutes, Memory: 280.00 MB
27-Nov-2019 16:19:06
27-Nov-2019 16:19:06 There was 1 error:
27-Nov-2019 16:19:06
27-Nov-2019 16:19:06 1) phpbb_functions_user_delete_test::test_user_delete
27-Nov-2019 16:19:06 TypeError: Argument 5 passed to phpbb\auth\provider\oauth\oauth::__construct() must be an instance of phpbb\controller\helper, instance of phpbb\language\language given, called in /data/tests/functions/user_delete_test.php on line 99
27-Nov-2019 16:19:06
27-Nov-2019 16:19:06 /data/phpBB/phpbb/auth/provider/oauth/oauth.php:103
27-Nov-2019 16:19:06 /data/tests/functions/user_delete_test.php:99
27-Nov-2019 16:19:06
27-Nov-2019 16:19:06 --
27-Nov-2019 16:19:06
27-Nov-2019 16:19:06 There was 1 failure:
27-Nov-2019 16:19:06
27-Nov-2019 16:19:06 1) phpbb_auth_provider_apache_test::test_autologin
27-Nov-2019 16:19:06 Failed asserting that two arrays are equal.
27-Nov-2019 16:19:06 --- Expected
27-Nov-2019 16:19:06 +++ Actual
27-Nov-2019 16:19:06 @@ @@
27-Nov-2019 16:19:06 Array (
27-Nov-2019 16:19:06 -    'user_id' => '1'
27-Nov-2019 16:19:06 -    'user_type' => '0'
27-Nov-2019 16:19:06 -    'group_id' => '3'
27-Nov-2019 16:19:06 +    'user_id' => 1
27-Nov-2019 16:19:06 +    'user_type' => 0
27-Nov-2019 16:19:06 +    'group_id' => 3
27-Nov-2019 16:19:06      'user_permissions' => ''
27-Nov-2019 16:19:06 -    'user_perm_from' => '0'
27-Nov-2019 16:19:06 +    'user_perm_from' => 0
27-Nov-2019 16:19:06      'user_ip' => ''
27-Nov-2019 16:19:06 -    'user_regdate' => '0'
27-Nov-2019 16:19:06 +    'user_regdate' => 0
27-Nov-2019 16:19:06      'username' => 'foobar'
27-Nov-2019 16:19:06      'username_clean' => 'foobar'
27-Nov-2019 16:19:06      'user_password' => '$2y$10$4RmpyVu2y8Yf/lP3.yQBqu...bCGz9i'
27-Nov-2019 16:19:06 -    'user_passchg' => '0'
27-Nov-2019 16:19:06 +    'user_passchg' => 0
27-Nov-2019 16:19:06      'user_email' => 'example@example.com'
27-Nov-2019 16:19:06      'user_birthday' => ''
27-Nov-2019 16:19:06 -    'user_lastvisit' => '0'
27-Nov-2019 16:19:06 -    'user_lastmark' => '0'
27-Nov-2019 16:19:06 -    'user_lastpost_time' => '0'
27-Nov-2019 16:19:06 +    'user_lastvisit' => 0
27-Nov-2019 16:19:06 +    'user_lastmark' => 0
27-Nov-2019 16:19:06 +    'user_lastpost_time' => 0
27-Nov-2019 16:19:06      'user_lastpage' => ''
27-Nov-2019 16:19:06      'user_last_confirm_key' => ''
27-Nov-2019 16:19:06 -    'user_last_search' => '0'
27-Nov-2019 16:19:06 -    'user_warnings' => '0'
27-Nov-2019 16:19:06 -    'user_last_warning' => '0'
27-Nov-2019 16:19:06 -    'user_login_attempts' => '0'
27-Nov-2019 16:19:06 -    'user_inactive_reason' => '0'
27-Nov-2019 16:19:06 -    'user_inactive_time' => '0'
27-Nov-2019 16:19:06 -    'user_posts' => '0'
27-Nov-2019 16:19:06 +    'user_last_search' => 0
27-Nov-2019 16:19:06 +    'user_warnings' => 0
27-Nov-2019 16:19:06 +    'user_last_warning' => 0
27-Nov-2019 16:19:06 +    'user_login_attempts' => 0
27-Nov-2019 16:19:06 +    'user_inactive_reason' => 0
27-Nov-2019 16:19:06 +    'user_inactive_time' => 0
27-Nov-2019 16:19:06 +    'user_posts' => 0
27-Nov-2019 16:19:06      'user_lang' => ''
27-Nov-2019 16:19:06      'user_timezone' => ''
27-Nov-2019 16:19:06      'user_dateformat' => 'd M Y H:i'
27-Nov-2019 16:19:06 -    'user_style' => '0'
27-Nov-2019 16:19:06 -    'user_rank' => '0'
27-Nov-2019 16:19:06 +    'user_style' => 0
27-Nov-2019 16:19:06 +    'user_rank' => 0
27-Nov-2019 16:19:06      'user_colour' => ''
27-Nov-2019 16:19:06 -    'user_new_privmsg' => '0'
27-Nov-2019 16:19:06 -    'user_unread_privmsg' => '0'
27-Nov-2019 16:19:06 -    'user_last_privmsg' => '0'
27-Nov-2019 16:19:06 -    'user_message_rules' => '0'
27-Nov-2019 16:19:06 -    'user_full_folder' => '-3'
27-Nov-2019 16:19:06 -    'user_emailtime' => '0'
27-Nov-2019 16:19:06 -    'user_topic_show_days' => '0'
27-Nov-2019 16:19:06 +    'user_new_privmsg' => 0
27-Nov-2019 16:19:06 +    'user_unread_privmsg' => 0
27-Nov-2019 16:19:06 +    'user_last_privmsg' => 0
27-Nov-2019 16:19:06 +    'user_message_rules' => 0
27-Nov-2019 16:19:06 +    'user_full_folder' => -3
27-Nov-2019 16:19:06 +    'user_emailtime' => 0
27-Nov-2019 16:19:06 +    'user_topic_show_days' => 0
27-Nov-2019 16:19:06      'user_topic_sortby_type' => 't'
27-Nov-2019 16:19:06      'user_topic_sortby_dir' => 'd'
27-Nov-2019 16:19:06 -    'user_post_show_days' => '0'
27-Nov-2019 16:19:06 +    'user_post_show_days' => 0
27-Nov-2019 16:19:06      'user_post_sortby_type' => 't'
27-Nov-2019 16:19:06      'user_post_sortby_dir' => 'a'
27-Nov-2019 16:19:06 -    'user_notify' => '0'
27-Nov-2019 16:19:06 -    'user_notify_pm' => '1'
27-Nov-2019 16:19:06 -    'user_notify_type' => '0'
27-Nov-2019 16:19:06 -    'user_allow_pm' => '1'
27-Nov-2019 16:19:06 -    'user_allow_viewonline' => '1'
27-Nov-2019 16:19:06 -    'user_allow_viewemail' => '1'
27-Nov-2019 16:19:06 -    'user_allow_massemail' => '1'
27-Nov-2019 16:19:06 -    'user_options' => '230271'
27-Nov-2019 16:19:06 +    'user_notify' => 0
27-Nov-2019 16:19:06 +    'user_notify_pm' => 1
27-Nov-2019 16:19:06 +    'user_notify_type' => 0
27-Nov-2019 16:19:06 +    'user_allow_pm' => 1
27-Nov-2019 16:19:06 +    'user_allow_viewonline' => 1
27-Nov-2019 16:19:06 +    'user_allow_viewemail' => 1
27-Nov-2019 16:19:06 +    'user_allow_massemail' => 1
27-Nov-2019 16:19:06 +    'user_options' => 230271
27-Nov-2019 16:19:06      'user_avatar' => ''
27-Nov-2019 16:19:06      'user_avatar_type' => ''
27-Nov-2019 16:19:06 -    'user_avatar_width' => '0'
27-Nov-2019 16:19:06 -    'user_avatar_height' => '0'
27-Nov-2019 16:19:06 +    'user_avatar_width' => 0
27-Nov-2019 16:19:06 +    'user_avatar_height' => 0
27-Nov-2019 16:19:06      'user_sig' => ''
27-Nov-2019 16:19:06      'user_sig_bbcode_uid' => ''
27-Nov-2019 16:19:06      'user_sig_bbcode_bitfield' => ''
27-Nov-2019 16:19:06 @@ @@
27-Nov-2019 16:19:06      'user_actkey' => ''
27-Nov-2019 16:19:06      'user_newpasswd' => ''
27-Nov-2019 16:19:06      'user_form_salt' => ''
27-Nov-2019 16:19:06 -    'user_new' => '1'
27-Nov-2019 16:19:06 -    'user_reminded' => '0'
27-Nov-2019 16:19:06 -    'user_reminded_time' => '0'
27-Nov-2019 16:19:06 +    'user_new' => 1
27-Nov-2019 16:19:06 +    'user_reminded' => 0
27-Nov-2019 16:19:06 +    'user_reminded_time' => 0
27-Nov-2019 16:19:06      'reset_token' => ''
27-Nov-2019 16:19:06 -    'reset_token_expiration' => '0'
27-Nov-2019 16:19:06 +    'reset_token_expiration' => 0
27-Nov-2019 16:19:06 +    'user_email_hash' => 0
27-Nov-2019 16:19:06 )
27-Nov-2019 16:19:06
27-Nov-2019 16:19:06 /data/tests/auth/provider_apache_test.php:181
27-Nov-2019 16:19:06
27-Nov-2019 16:19:06 ERRORS!
27-Nov-2019 16:19:06 Tests: 7113, Assertions: 124047, Errors: 1, Failures: 1, Skipped: 248, Incomplete: 5.
27-Nov-2019 16:19:06 Error occurred while running Task 'Run tests(10)' of type com.atlassian.bamboo.plugins.bamboo-docker-plugin:task.docker.cli.
27-Nov-2019 16:19:06 com.atlassian.bamboo.task.TaskException: Failed to execute task
27-Nov-2019 16:19:06         at com.atlassian.bamboo.plugins.docker.service.RunService.execute(RunService.java:75)
27-Nov-2019 16:19:06         at com.atlassian.bamboo.plugins.docker.tasks.cli.DockerCliTask.execute(DockerCliTask.java:70)
27-Nov-2019 16:19:06         at com.atlassian.bamboo.task.TaskExecutorImpl.lambda$executeTasks$3(TaskExecutorImpl.java:285)
27-Nov-2019 16:19:06         at com.atlassian.bamboo.task.TaskExecutorImpl.executeTaskWithPrePostActions(TaskExecutorImpl.java:224)
27-Nov-2019 16:19:06         at com.atlassian.bamboo.task.TaskExecutorImpl.executeTasks(TaskExecutorImpl.java:285)
27-Nov-2019 16:19:06         at com.atlassian.bamboo.task.TaskExecutorImpl.execute(TaskExecutorImpl.java:112)
27-Nov-2019 16:19:06         at com.atlassian.bamboo.build.pipeline.tasks.ExecuteBuildTask.call(ExecuteBuildTask.java:71)
27-Nov-2019 16:19:06         at com.atlassian.bamboo.v2.build.agent.DefaultBuildAgent.executeBuildPhase(DefaultBuildAgent.java:203)
27-Nov-2019 16:19:06         at com.atlassian.bamboo.v2.build.agent.DefaultBuildAgent.build(DefaultBuildAgent.java:175)
27-Nov-2019 16:19:06         at com.atlassian.bamboo.v2.build.agent.BuildAgentControllerImpl.lambda$waitAndPerformBuild$0(BuildAgentControllerImpl.java:122)
27-Nov-2019 16:19:06         at com.atlassian.bamboo.variable.CustomVariableContextImpl.withVariableSubstitutor(CustomVariableContextImpl.java:185)
27-Nov-2019 16:19:06         at com.atlassian.bamboo.v2.build.agent.BuildAgentControllerImpl.waitAndPerformBuild(BuildAgentControllerImpl.java:117)
27-Nov-2019 16:19:06         at com.atlassian.bamboo.v2.build.agent.DefaultBuildAgent$1.run(DefaultBuildAgent.java:126)
27-Nov-2019 16:19:06         at com.atlassian.bamboo.utils.BambooRunnables$1.run(BambooRunnables.java:48)
27-Nov-2019 16:19:06         at com.atlassian.bamboo.security.ImpersonationHelper.runWith(ImpersonationHelper.java:26)
27-Nov-2019 16:19:06         at com.atlassian.bamboo.security.ImpersonationHelper.runWithSystemAuthority(ImpersonationHelper.java:17)
27-Nov-2019 16:19:06         at com.atlassian.bamboo.security.ImpersonationHelper$1.run(ImpersonationHelper.java:41)
27-Nov-2019 16:19:06         at java.lang.Thread.run(Thread.java:748)
27-Nov-2019 16:19:06 Caused by: com.atlassian.bamboo.docker.DockerException: Error running Docker run command
27-Nov-2019 16:19:06         at com.atlassian.bamboo.docker.DockerContainerServiceImpl.run(DockerContainerServiceImpl.java:118)
27-Nov-2019 16:19:06         at sun.reflect.GeneratedMethodAccessor2260.invoke(Unknown Source)
27-Nov-2019 16:19:06         at sun.reflect.DelegatingMethodAccessorImpl.invoke(DelegatingMethodAccessorImpl.java:43)
27-Nov-2019 16:19:06         at java.lang.reflect.Method.invoke(Method.java:498)
27-Nov-2019 16:19:06         at com.atlassian.plugin.util.ContextClassLoaderSettingInvocationHandler.invoke(ContextClassLoaderSettingInvocationHandler.java:26)
27-Nov-2019 16:19:06         at com.sun.proxy.$Proxy401.run(Unknown Source)
27-Nov-2019 16:19:06         at sun.reflect.GeneratedMethodAccessor2260.invoke(Unknown Source)
27-Nov-2019 16:19:06         at sun.reflect.DelegatingMethodAccessorImpl.invoke(DelegatingMethodAccessorImpl.java:43)
27-Nov-2019 16:19:06         at java.lang.reflect.Method.invoke(Method.java:498)
27-Nov-2019 16:19:06         at org.springframework.aop.support.AopUtils.invokeJoinpointUsingReflection(AopUtils.java:302)
27-Nov-2019 16:19:06         at org.eclipse.gemini.blueprint.service.importer.support.internal.aop.ServiceInvoker.doInvoke(ServiceInvoker.java:56)
27-Nov-2019 16:19:06         at org.eclipse.gemini.blueprint.service.importer.support.internal.aop.ServiceInvoker.invoke(ServiceInvoker.java:60)
27-Nov-2019 16:19:06         at org.springframework.aop.framework.ReflectiveMethodInvocation.proceed(ReflectiveMethodInvocation.java:179)
27-Nov-2019 16:19:06         at org.springframework.aop.support.DelegatingIntroductionInterceptor.doProceed(DelegatingIntroductionInterceptor.java:133)
27-Nov-2019 16:19:06         at org.springframework.aop.support.DelegatingIntroductionInterceptor.invoke(DelegatingIntroductionInterceptor.java:121)
27-Nov-2019 16:19:06         at org.springframework.aop.framework.ReflectiveMethodInvocation.proceed(ReflectiveMethodInvocation.java:179)
27-Nov-2019 16:19:06         at org.eclipse.gemini.blueprint.service.util.internal.aop.ServiceTCCLInterceptor.invokeUnprivileged(ServiceTCCLInterceptor.java:70)
27-Nov-2019 16:19:06         at org.eclipse.gemini.blueprint.service.util.internal.aop.ServiceTCCLInterceptor.invoke(ServiceTCCLInterceptor.java:53)
27-Nov-2019 16:19:06         at org.springframework.aop.framework.ReflectiveMethodInvocation.proceed(ReflectiveMethodInvocation.java:179)
27-Nov-2019 16:19:06         at org.eclipse.gemini.blueprint.service.importer.support.LocalBundleContextAdvice.invoke(LocalBundleContextAdvice.java:57)
27-Nov-2019 16:19:06         at org.springframework.aop.framework.ReflectiveMethodInvocation.proceed(ReflectiveMethodInvocation.java:179)
27-Nov-2019 16:19:06         at org.springframework.aop.support.DelegatingIntroductionInterceptor.doProceed(DelegatingIntroductionInterceptor.java:133)
27-Nov-2019 16:19:06         at org.springframework.aop.support.DelegatingIntroductionInterceptor.invoke(DelegatingIntroductionInterceptor.java:121)
27-Nov-2019 16:19:06         at org.springframework.aop.framework.ReflectiveMethodInvocation.proceed(ReflectiveMethodInvocation.java:179)
27-Nov-2019 16:19:06         at org.springframework.aop.framework.JdkDynamicAopProxy.invoke(JdkDynamicAopProxy.java:207)
27-Nov-2019 16:19:06         at com.sun.proxy.$Proxy662.run(Unknown Source)
27-Nov-2019 16:19:06         at com.atlassian.bamboo.plugins.docker.client.DockerCmd.run(DockerCmd.java:51)
27-Nov-2019 16:19:06         at com.atlassian.bamboo.plugins.docker.service.RunService.execute(RunService.java:64)
27-Nov-2019 16:19:06         ... 17 more
27-Nov-2019 16:19:06 Caused by: com.atlassian.utils.process.ProcessException: Error executing /usr/bin/docker run --volume /home/bamboo/xml-data/build-dir/PHPBB3-PR-JOB1:/data --workdir /data --rm -u=991 -t phpbb:php-7.1 /bin/bash -c "phpBB/vendor/bin/phpunit --log-junit build/logs/phpunit.xml"
27-Nov-2019 16:19:06         at com.atlassian.bamboo.docker.DockerContainerServiceImpl.execute(DockerContainerServiceImpl.java:252)
27-Nov-2019 16:19:06         at com.atlassian.bamboo.docker.DockerContainerServiceImpl.run(DockerContainerServiceImpl.java:106)
27-Nov-2019 16:19:06         ... 44 more
27-Nov-2019 16:19:06 Starting task 'Parsing test results produced by script' of type 'com.atlassian.bamboo.plugins.testresultparser:task.testresultparser.junit'
27-Nov-2019 16:19:06 Parsing test results under /home/bamboo/xml-data/build-dir/PHPBB3-PR-JOB1...
27-Nov-2019 16:19:06 Failing task since 2 failing test cases were found.
27-Nov-2019 16:19:06 Finished task 'Parsing test results produced by script' with result: Failed
27-Nov-2019 16:19:06
Substituting variable: ${bamboo.PRnumber} with 5746
27-Nov-2019 16:19:06
Substituting variable: ${bamboo.buildResultsUrl} with https://bamboo.phpbb.com/browse/PHPBB3-PR-JOB1-9726
27-Nov-2019 16:19:06
Substituting variable: ${bamboo.buildResultsUrl} with https://bamboo.phpbb.com/browse/PHPBB3-PR-JOB1-9726
27-Nov-2019 16:19:06 Starting task 'Set result build status' of type 'com.atlassian.bamboo.plugins.scripttask:task.builder.script'
27-Nov-2019 16:19:06
Beginning to execute external process for build 'phpBB3 - Pull Requests - Build and Test Job #9726 (PHPBB3-PR-JOB1-9726)'
... running command line:
/bin/sh /home/bamboo/temp/PHPBB3-PR-JOB1-9726-ScriptBuildTask-5035456979918472064.sh
... in: /home/bamboo/xml-data/build-dir/PHPBB3-PR-JOB1
... using extra environment variables:
bamboo_planRepository_1_branch=3.1.x
bamboo_planRepository_1_branchDisplayName=3.1.x
bamboo_repository_revision_number=dc8ff9da28b8ab4ad11c7ea94cca526f17c87fe5
bamboo_PRref=master
bamboo_resultsUrl=https://bamboo.phpbb.com/browse/PHPBB3-PR-JOB1-9726
bamboo_capability_system_builder_command_Git=/usr/bin/git
bamboo_repository_75956235_git_username=bantu
bamboo_build_working_directory=/home/bamboo/xml-data/build-dir/PHPBB3-PR-JOB1
bamboo_planRepository_1_name=phpBB Ascraeus
bamboo_buildKey=PHPBB3-PR-JOB1
bamboo_capability_phpbb_tests=true
bamboo_shortPlanName=Pull Requests
bamboo_capability_system_builder_command_fop=/usr/bin/fop
bamboo_capability_dbms_sqlite_2=true
bamboo_planRepository_name=phpBB Ascraeus
bamboo_PRnumber=5746
bamboo_buildNumber=9726
bamboo_repository_75956235_git_repositoryUrl=https://github.com/phpbb/phpbb.git
bamboo_capability_system_builder_phpunit_PHPUnit=/usr/bin/phpunit
bamboo_shortJobName=Build and Test Job
bamboo_buildResultsUrl=https://bamboo.phpbb.com/browse/PHPBB3-PR-JOB1-9726
bamboo_repository_75956235_branch_name=3.1.x
bamboo_planRepository_repositoryUrl=https://github.com/phpbb/phpbb.git
bamboo_agentId=131073
bamboo_planName=phpBB3 - Pull Requests
bamboo_build_commandline_com_atlassian_bamboo_plugins_scripttask_task_builder_script_7=/bin/sh /home/bamboo/temp/PHPBB3-PR-JOB1-9726-ScriptBuildTask-5758660211912520253.sh
bamboo_shortPlanKey=PR
bamboo_shortJobKey=JOB1
bamboo_capability_dbms_mysql_55=true
bamboo_capability_system_jdk_JDK_1_7_0_65=/usr/lib/jvm/java-7-openjdk-amd64
bamboo_planRepository_revision=dc8ff9da28b8ab4ad11c7ea94cca526f17c87fe5
bamboo_buildTimeStamp=2019-11-27T16:14:02.981Z
bamboo_repository_previous_revision_number=dc8ff9da28b8ab4ad11c7ea94cca526f17c87fe5
bamboo_capability_system_jdk_JDK_1_6_0_16=/usr/lib/jvm/java-6-sun-1.6.0.16
bamboo_capability_system_builder_mvn2_Maven_2=/usr/share/maven2
bamboo_planRepository_previousRevision=dc8ff9da28b8ab4ad11c7ea94cca526f17c87fe5
bamboo_build_commandline_com_atlassian_bamboo_plugins_scripttask_task_builder_script_4=/bin/sh /home/bamboo/temp/PHPBB3-PR-JOB1-9726-ScriptBuildTask-6474111210365733875.sh
bamboo_repository_git_branch=3.1.x
bamboo_buildResultKey=PHPBB3-PR-JOB1-9726
bamboo_repository_branch_name=3.1.x
bamboo_buildPlanName=phpBB3 - Pull Requests - Build and Test Job
bamboo_planRepository_1_revision=dc8ff9da28b8ab4ad11c7ea94cca526f17c87fe5
bamboo_repository_name=phpBB Ascraeus
bamboo_buildFailed=true
bamboo_build_commandline_com_atlassian_bamboo_plugins_bamboo_docker_plugin_task_docker_cli_10=/usr/bin/docker run --volume /home/bamboo/xml-data/build-dir/PHPBB3-PR-JOB1:/data --workdir /data --rm -u=991 -t phpbb:php-7.1 /bin/bash -c phpBB/vendor/bin/phpunit --log-junit build/logs/phpunit.xml
bamboo_capability_system_docker_executable=/usr/bin/docker
bamboo_build_commandline_com_atlassian_bamboo_plugins_bamboo_docker_plugin_task_docker_cli_11=/usr/bin/docker run --volume /home/bamboo/xml-data/build-dir/PHPBB3-PR-JOB1:/data --workdir /data/build --rm -u=991 phpbb:php-7.1 ../phpBB/vendor/bin/phing sniff
bamboo_build_commandline_com_atlassian_bamboo_plugins_bamboo_docker_plugin_task_docker_cli_12=/usr/bin/docker run --volume /home/bamboo/xml-data/build-dir/PHPBB3-PR-JOB1:/data --workdir /data/phpBB --rm -e HOME=/home/bamboo -u=991 phpbb:php-7.1 /bin/bash -c php ../composer.phar install --dev; cd ../build; ../phpBB/vendor/bin/phing clean prepare
bamboo_build_commandline_com_atlassian_bamboo_plugins_bamboo_docker_plugin_task_docker_cli_13=/usr/bin/docker build --force-rm=true --tag=phpbb:php-7.1 /home/bamboo/xml-data/build-dir/PHPBB3-PR-JOB1
bamboo_planRepository_branch=3.1.x
bamboo_agentWorkingDirectory=/home/bamboo/xml-data/build-dir
bamboo_jobFailed=true
bamboo_capability_system_git_executable=/usr/bin/git
bamboo_capability_system_builder_phpunit_PHPUnit_3_4=/usr/bin/phpunit
bamboo_repository_git_username=bantu
bamboo_planRepository_1_previousRevision=dc8ff9da28b8ab4ad11c7ea94cca526f17c87fe5
bamboo_repository_75956235_revision_number=dc8ff9da28b8ab4ad11c7ea94cca526f17c87fe5
bamboo_planRepository_branchDisplayName=3.1.x
bamboo_planRepository_1_type=gitv2
bamboo_planRepository_branchName=3.1.x
bamboo_repository_75956235_previous_revision_number=dc8ff9da28b8ab4ad11c7ea94cca526f17c87fe5
bamboo_capability_system_jdk_JDK=/usr/lib/jvm/java-6-sun
bamboo_plan_storageTag=PHPBB3-PR
bamboo_hg_cache_directory=/home/bamboo/xml-data/build-dir/_hg-repositories-cache
bamboo_planRepository_1_username=bantu
bamboo_planRepository_type=gitv2
bamboo_git_cache_directory=/home/bamboo/xml-data/build-dir/_git-repositories-cache
bamboo_ManualBuildTriggerReason_userName=Build Robot
bamboo_repository_git_repositoryUrl=https://github.com/phpbb/phpbb.git
bamboo_repository_75956235_git_branch=3.1.x
bamboo_capability_system_builder_ant_Ant=/usr/share/ant
bamboo_repository_75956235_name=phpBB Ascraeus
bamboo_tmp_directory=/home/bamboo/temp
bamboo_working_directory=/home/bamboo/xml-data/build-dir/PHPBB3-PR-JOB1
bamboo_planKey=PHPBB3-PR
bamboo_capability_local=true
bamboo_planRepository_1_repositoryUrl=https://github.com/phpbb/phpbb.git
bamboo_planRepository_username=bantu
bamboo_capability_system_jdk_JDK_1_6=/usr/lib/jvm/java-6-sun
bamboo_capability_system_jdk_JDK_1_7=/usr/lib/jvm/java-7-openjdk-amd64
bamboo_planRepository_1_branchName=3.1.x
27-Nov-2019 16:19:07 From https://github.com/phpbb/phpbb
27-Nov-2019 16:19:07 * branch            refs/pull/5746/head -> FETCH_HEAD
27-Nov-2019 16:19:07   <testsuite name="" tests="7061" assertions="124047" errors="1" failures="1" skipped="253" time="157.592554">
27-Nov-2019 16:19:07     <testsuite name="phpBB Test Suite" tests="5284" assertions="122491" errors="1" failures="1" skipped="32" time="107.049819">
27-Nov-2019 16:19:07       <testsuite name="phpbb_auth_provider_apache_test" file="/data/tests/auth/provider_apache_test.php" tests="4" assertions="7" errors="0" failures="1" skipped="0" time="0.133030">
27-Nov-2019 16:19:07   % Total    % Received % Xferd  Average Speed   Time    Time     Time  Current
27-Nov-2019 16:19:07                                  Dload  Upload   Total   Spent    Left  Speed
27-Nov-2019 16:19:07
27-Nov-2019 16:19:08   0     0    0     0    0     0      0      0 --:--:-- --:--:-- --:--:--     0
27-Nov-2019 16:19:08   0     0    0     0    0     0      0      0 --:--:-- --:--:-- --:--:--     0
27-Nov-2019 16:19:08 100   267  100    93  100   174    189    355 --:--:-- --:--:-- --:--:--   355
27-Nov-2019 16:19:08 Finished task 'Set result build status' with result: Success
27-Nov-2019 16:19:08 Running post build plugin 'NCover Results Collector'
27-Nov-2019 16:19:08 Running post build plugin 'Artifact Copier'
27-Nov-2019 16:19:08 Running post build plugin 'npm Cache Cleanup'
27-Nov-2019 16:19:08 Running post build plugin 'Clover Results Collector'
27-Nov-2019 16:19:08 Running post build plugin 'Docker Container Cleanup'
27-Nov-2019 16:19:09 Successfully removed working directory at '/home/bamboo/xml-data/build-dir/PHPBB3-PR-JOB1'
27-Nov-2019 16:19:09 Finalising the build...
27-Nov-2019 16:19:09 Stopping timer.
27-Nov-2019 16:19:09 Build PHPBB3-PR-JOB1-9726 completed.
27-Nov-2019 16:19:09 Running on server: post build plugin 'NCover Results Collector'
27-Nov-2019 16:19:09 Running on server: post build plugin 'Build Hanging Detection Configuration'
27-Nov-2019 16:19:09 Running on server: post build plugin 'Clover Delta Calculator'
27-Nov-2019 16:19:09 Running on server: post build plugin 'Maven Dependencies Postprocessor'
27-Nov-2019 16:19:09 All post build plugins have finished
27-Nov-2019 16:19:09 Generating build results summary...
27-Nov-2019 16:19:15 Saving build results to disk...
27-Nov-2019 16:19:16 Logging substituted variables...
27-Nov-2019 16:19:16 Indexing build results...
27-Nov-2019 16:19:16 Finished building PHPBB3-PR-JOB1-9726.
27-Nov-2019 16:19:16
Substituting variable: ${bamboo.PRnumber} with 5746