Tests pending pull requests

Build: #9738 failed

Job: Build and Test Job failed

Stages & jobs

  1. Build and Test

Build log

The build generated 648 lines of output. Download or view full build log

30-Nov-2019 20:46:40 Build phpBB3 - Pull Requests - Build and Test Job #9738 (PHPBB3-PR-JOB1-9738) started building on agent Default Agent
30-Nov-2019 20:46:40
30-Nov-2019 20:46:40 Build working directory is /home/bamboo/xml-data/build-dir/PHPBB3-PR-JOB1
30-Nov-2019 20:46:40 Executing build phpBB3 - Pull Requests - Build and Test Job #9738 (PHPBB3-PR-JOB1-9738)
30-Nov-2019 20:46:40 Starting task 'Checkout develop branch' of type 'com.atlassian.bamboo.plugins.vcs:task.vcs.checkout'
30-Nov-2019 20:46:40 Build always requires a clean checkout
30-Nov-2019 20:46:40 Cleaning build directory '/home/bamboo/xml-data/build-dir/PHPBB3-PR-JOB1'
30-Nov-2019 20:46:40 Checking out into /home/bamboo/xml-data/build-dir/PHPBB3-PR-JOB1
30-Nov-2019 20:46:40 Updating source code to revision: dc8ff9da28b8ab4ad11c7ea94cca526f17c87fe5
30-Nov-2019 20:46:40 Fetching 'refs/heads/3.1.x' from 'https://github.com/phpbb/phpbb.git'.
30-Nov-2019 20:46:41 Checking out revision dc8ff9da28b8ab4ad11c7ea94cca526f17c87fe5.
30-Nov-2019 20:46:41 Creating local git repository in '/home/bamboo/xml-data/build-dir/PHPBB3-PR-JOB1/.git'.
30-Nov-2019 20:46:41 Cloning into '/home/bamboo/xml-data/build-dir/PHPBB3-PR-JOB1'...
30-Nov-2019 20:46:41 done.
30-Nov-2019 20:46:46 Switched to a new branch '3.1.x'
30-Nov-2019 20:46:46 Branch 3.1.x set up to track remote branch 3.1.x from origin.
30-Nov-2019 20:46:46 Updated source code to revision: dc8ff9da28b8ab4ad11c7ea94cca526f17c87fe5
30-Nov-2019 20:46:46 Finished task 'Checkout develop branch' with result: Success
30-Nov-2019 20:46:46 Running pre-build action: VCS Version Collector
30-Nov-2019 20:46:46
Substituting variable: ${bamboo.PRnumber} with 5753
30-Nov-2019 20:46:46
Substituting variable: ${bamboo.buildResultsUrl} with https://bamboo.phpbb.com/browse/PHPBB3-PR-JOB1-9738
30-Nov-2019 20:46:46 Starting task 'Set pending build status' of type 'com.atlassian.bamboo.plugins.scripttask:task.builder.script'
30-Nov-2019 20:46:46
Beginning to execute external process for build 'phpBB3 - Pull Requests - Build and Test Job #9738 (PHPBB3-PR-JOB1-9738)'
... running command line:
/bin/sh /home/bamboo/temp/PHPBB3-PR-JOB1-9738-ScriptBuildTask-5660838944896039843.sh
... in: /home/bamboo/xml-data/build-dir/PHPBB3-PR-JOB1
... using extra environment variables:
bamboo_planRepository_1_branch=3.1.x
bamboo_planRepository_1_branchDisplayName=3.1.x
bamboo_repository_revision_number=dc8ff9da28b8ab4ad11c7ea94cca526f17c87fe5
bamboo_PRref=master
bamboo_resultsUrl=https://bamboo.phpbb.com/browse/PHPBB3-PR-JOB1-9738
bamboo_capability_system_builder_command_Git=/usr/bin/git
bamboo_repository_75956235_git_username=bantu
bamboo_build_working_directory=/home/bamboo/xml-data/build-dir/PHPBB3-PR-JOB1
bamboo_planRepository_1_name=phpBB Ascraeus
bamboo_buildKey=PHPBB3-PR-JOB1
bamboo_capability_phpbb_tests=true
bamboo_shortPlanName=Pull Requests
bamboo_capability_system_builder_command_fop=/usr/bin/fop
bamboo_capability_dbms_sqlite_2=true
bamboo_planRepository_name=phpBB Ascraeus
bamboo_PRnumber=5753
bamboo_buildNumber=9738
bamboo_repository_75956235_git_repositoryUrl=https://github.com/phpbb/phpbb.git
bamboo_capability_system_builder_phpunit_PHPUnit=/usr/bin/phpunit
bamboo_shortJobName=Build and Test Job
bamboo_buildResultsUrl=https://bamboo.phpbb.com/browse/PHPBB3-PR-JOB1-9738
bamboo_repository_75956235_branch_name=3.1.x
bamboo_planRepository_repositoryUrl=https://github.com/phpbb/phpbb.git
bamboo_agentId=131073
bamboo_planName=phpBB3 - Pull Requests
bamboo_shortPlanKey=PR
bamboo_shortJobKey=JOB1
bamboo_capability_dbms_mysql_55=true
bamboo_capability_system_jdk_JDK_1_7_0_65=/usr/lib/jvm/java-7-openjdk-amd64
bamboo_planRepository_revision=dc8ff9da28b8ab4ad11c7ea94cca526f17c87fe5
bamboo_buildTimeStamp=2019-11-30T20:46:40.070Z
bamboo_repository_previous_revision_number=dc8ff9da28b8ab4ad11c7ea94cca526f17c87fe5
bamboo_capability_system_jdk_JDK_1_6_0_16=/usr/lib/jvm/java-6-sun-1.6.0.16
bamboo_capability_system_builder_mvn2_Maven_2=/usr/share/maven2
bamboo_planRepository_previousRevision=dc8ff9da28b8ab4ad11c7ea94cca526f17c87fe5
bamboo_repository_git_branch=3.1.x
bamboo_buildResultKey=PHPBB3-PR-JOB1-9738
bamboo_repository_branch_name=3.1.x
bamboo_buildPlanName=phpBB3 - Pull Requests - Build and Test Job
bamboo_planRepository_1_revision=dc8ff9da28b8ab4ad11c7ea94cca526f17c87fe5
bamboo_repository_name=phpBB Ascraeus
bamboo_buildFailed=false
bamboo_capability_system_docker_executable=/usr/bin/docker
bamboo_planRepository_branch=3.1.x
bamboo_agentWorkingDirectory=/home/bamboo/xml-data/build-dir
bamboo_capability_system_git_executable=/usr/bin/git
bamboo_capability_system_builder_phpunit_PHPUnit_3_4=/usr/bin/phpunit
bamboo_repository_git_username=bantu
bamboo_planRepository_1_previousRevision=dc8ff9da28b8ab4ad11c7ea94cca526f17c87fe5
bamboo_repository_75956235_revision_number=dc8ff9da28b8ab4ad11c7ea94cca526f17c87fe5
bamboo_planRepository_branchDisplayName=3.1.x
bamboo_planRepository_1_type=gitv2
bamboo_planRepository_branchName=3.1.x
bamboo_repository_75956235_previous_revision_number=dc8ff9da28b8ab4ad11c7ea94cca526f17c87fe5
bamboo_capability_system_jdk_JDK=/usr/lib/jvm/java-6-sun
bamboo_plan_storageTag=PHPBB3-PR
bamboo_hg_cache_directory=/home/bamboo/xml-data/build-dir/_hg-repositories-cache
bamboo_planRepository_1_username=bantu
bamboo_planRepository_type=gitv2
bamboo_git_cache_directory=/home/bamboo/xml-data/build-dir/_git-repositories-cache
bamboo_ManualBuildTriggerReason_userName=Build Robot
bamboo_repository_git_repositoryUrl=https://github.com/phpbb/phpbb.git
bamboo_repository_75956235_git_branch=3.1.x
bamboo_capability_system_builder_ant_Ant=/usr/share/ant
bamboo_repository_75956235_name=phpBB Ascraeus
bamboo_tmp_directory=/home/bamboo/temp
bamboo_working_directory=/home/bamboo/xml-data/build-dir/PHPBB3-PR-JOB1
bamboo_planKey=PHPBB3-PR
bamboo_capability_local=true
bamboo_planRepository_1_repositoryUrl=https://github.com/phpbb/phpbb.git
bamboo_planRepository_username=bantu
bamboo_capability_system_jdk_JDK_1_6=/usr/lib/jvm/java-6-sun
bamboo_capability_system_jdk_JDK_1_7=/usr/lib/jvm/java-7-openjdk-amd64
bamboo_planRepository_1_branchName=3.1.x
30-Nov-2019 20:46:49 From https://github.com/phpbb/phpbb
30-Nov-2019 20:46:49 * branch            refs/pull/5753/head -> FETCH_HEAD
30-Nov-2019 20:46:49   % Total    % Received % Xferd  Average Speed   Time    Time     Time  Current
30-Nov-2019 20:46:49                                  Dload  Upload   Total   Spent    Left  Speed
30-Nov-2019 20:46:49
30-Nov-2019 20:46:50   0     0    0     0    0     0      0      0 --:--:-- --:--:-- --:--:--     0
30-Nov-2019 20:46:50 100   275  100    93  100   182    170    332 --:--:-- --:--:-- --:--:--   332
30-Nov-2019 20:46:50 100   275  100    93  100   182    169    332 --:--:-- --:--:-- --:--:--   332
30-Nov-2019 20:46:50 Finished task 'Set pending build status' with result: Success
30-Nov-2019 20:46:50
Substituting variable: ${bamboo.PRnumber} with 5753
30-Nov-2019 20:46:50 Starting task 'Fetch PR' of type 'com.atlassian.bamboo.plugins.scripttask:task.builder.script'
30-Nov-2019 20:46:50
Beginning to execute external process for build 'phpBB3 - Pull Requests - Build and Test Job #9738 (PHPBB3-PR-JOB1-9738)'
... running command line:
/bin/sh /home/bamboo/temp/PHPBB3-PR-JOB1-9738-ScriptBuildTask-7700656022281140120.sh
... in: /home/bamboo/xml-data/build-dir/PHPBB3-PR-JOB1
... using extra environment variables:
bamboo_planRepository_1_branch=3.1.x
bamboo_planRepository_1_branchDisplayName=3.1.x
bamboo_repository_revision_number=dc8ff9da28b8ab4ad11c7ea94cca526f17c87fe5
bamboo_PRref=master
bamboo_resultsUrl=https://bamboo.phpbb.com/browse/PHPBB3-PR-JOB1-9738
bamboo_capability_system_builder_command_Git=/usr/bin/git
bamboo_repository_75956235_git_username=bantu
bamboo_build_working_directory=/home/bamboo/xml-data/build-dir/PHPBB3-PR-JOB1
bamboo_planRepository_1_name=phpBB Ascraeus
bamboo_buildKey=PHPBB3-PR-JOB1
bamboo_capability_phpbb_tests=true
bamboo_shortPlanName=Pull Requests
bamboo_capability_system_builder_command_fop=/usr/bin/fop
bamboo_capability_dbms_sqlite_2=true
bamboo_planRepository_name=phpBB Ascraeus
bamboo_PRnumber=5753
bamboo_buildNumber=9738
bamboo_repository_75956235_git_repositoryUrl=https://github.com/phpbb/phpbb.git
bamboo_capability_system_builder_phpunit_PHPUnit=/usr/bin/phpunit
bamboo_shortJobName=Build and Test Job
bamboo_buildResultsUrl=https://bamboo.phpbb.com/browse/PHPBB3-PR-JOB1-9738
bamboo_repository_75956235_branch_name=3.1.x
bamboo_planRepository_repositoryUrl=https://github.com/phpbb/phpbb.git
bamboo_agentId=131073
bamboo_planName=phpBB3 - Pull Requests
bamboo_build_commandline_com_atlassian_bamboo_plugins_scripttask_task_builder_script_7=/bin/sh /home/bamboo/temp/PHPBB3-PR-JOB1-9738-ScriptBuildTask-5660838944896039843.sh
bamboo_shortPlanKey=PR
bamboo_shortJobKey=JOB1
bamboo_capability_dbms_mysql_55=true
bamboo_capability_system_jdk_JDK_1_7_0_65=/usr/lib/jvm/java-7-openjdk-amd64
bamboo_planRepository_revision=dc8ff9da28b8ab4ad11c7ea94cca526f17c87fe5
bamboo_buildTimeStamp=2019-11-30T20:46:40.070Z
bamboo_repository_previous_revision_number=dc8ff9da28b8ab4ad11c7ea94cca526f17c87fe5
bamboo_capability_system_jdk_JDK_1_6_0_16=/usr/lib/jvm/java-6-sun-1.6.0.16
bamboo_capability_system_builder_mvn2_Maven_2=/usr/share/maven2
bamboo_planRepository_previousRevision=dc8ff9da28b8ab4ad11c7ea94cca526f17c87fe5
bamboo_repository_git_branch=3.1.x
bamboo_buildResultKey=PHPBB3-PR-JOB1-9738
bamboo_repository_branch_name=3.1.x
bamboo_buildPlanName=phpBB3 - Pull Requests - Build and Test Job
bamboo_planRepository_1_revision=dc8ff9da28b8ab4ad11c7ea94cca526f17c87fe5
bamboo_repository_name=phpBB Ascraeus
bamboo_buildFailed=false
bamboo_capability_system_docker_executable=/usr/bin/docker
bamboo_planRepository_branch=3.1.x
bamboo_agentWorkingDirectory=/home/bamboo/xml-data/build-dir
bamboo_capability_system_git_executable=/usr/bin/git
bamboo_capability_system_builder_phpunit_PHPUnit_3_4=/usr/bin/phpunit
bamboo_repository_git_username=bantu
bamboo_planRepository_1_previousRevision=dc8ff9da28b8ab4ad11c7ea94cca526f17c87fe5
bamboo_repository_75956235_revision_number=dc8ff9da28b8ab4ad11c7ea94cca526f17c87fe5
bamboo_planRepository_branchDisplayName=3.1.x
bamboo_planRepository_1_type=gitv2
bamboo_planRepository_branchName=3.1.x
bamboo_repository_75956235_previous_revision_number=dc8ff9da28b8ab4ad11c7ea94cca526f17c87fe5
bamboo_capability_system_jdk_JDK=/usr/lib/jvm/java-6-sun
bamboo_plan_storageTag=PHPBB3-PR
bamboo_hg_cache_directory=/home/bamboo/xml-data/build-dir/_hg-repositories-cache
bamboo_planRepository_1_username=bantu
bamboo_planRepository_type=gitv2
bamboo_git_cache_directory=/home/bamboo/xml-data/build-dir/_git-repositories-cache
bamboo_ManualBuildTriggerReason_userName=Build Robot
bamboo_repository_git_repositoryUrl=https://github.com/phpbb/phpbb.git
bamboo_repository_75956235_git_branch=3.1.x
bamboo_capability_system_builder_ant_Ant=/usr/share/ant
bamboo_repository_75956235_name=phpBB Ascraeus
bamboo_tmp_directory=/home/bamboo/temp
bamboo_working_directory=/home/bamboo/xml-data/build-dir/PHPBB3-PR-JOB1
bamboo_planKey=PHPBB3-PR
bamboo_capability_local=true
bamboo_planRepository_1_repositoryUrl=https://github.com/phpbb/phpbb.git
bamboo_planRepository_username=bantu
bamboo_capability_system_jdk_JDK_1_6=/usr/lib/jvm/java-6-sun
bamboo_capability_system_jdk_JDK_1_7=/usr/lib/jvm/java-7-openjdk-amd64
bamboo_planRepository_1_branchName=3.1.x
30-Nov-2019 20:46:53 From https://github.com/phpbb/phpbb
30-Nov-2019 20:46:53 * branch            refs/pull/5753/merge -> FETCH_HEAD
30-Nov-2019 20:46:54 Note: checking out 'FETCH_HEAD'.
30-Nov-2019 20:46:54
30-Nov-2019 20:46:54 You are in 'detached HEAD' state. You can look around, make experimental
30-Nov-2019 20:46:54 changes and commit them, and you can discard any commits you make in this
30-Nov-2019 20:46:54 state without impacting any branches by performing another checkout.
30-Nov-2019 20:46:54
30-Nov-2019 20:46:54 If you want to create a new branch to retain commits you create, you may
30-Nov-2019 20:46:54 do so (now or later) by using -b with the checkout command again. Example:
30-Nov-2019 20:46:54
30-Nov-2019 20:46:54   git checkout -b new_branch_name
30-Nov-2019 20:46:54
30-Nov-2019 20:46:54 HEAD is now at 4bfb4e2... Merge 1350cc8db37b0e454ec54157df5485933e213daa into 0a01b3bcc80b5c07d30d73fb41f486941ee7c7a2
30-Nov-2019 20:46:54 Finished task 'Fetch PR' with result: Success
30-Nov-2019 20:46:54 Skipping execution of task 'Prepare directory' as it is disabled
30-Nov-2019 20:46:54
Substituting variable: ${bamboo.working.directory} with /home/bamboo/xml-data/build-dir/PHPBB3-PR-JOB1
30-Nov-2019 20:46:54 Starting task 'Build image' of type 'com.atlassian.bamboo.plugins.bamboo-docker-plugin:task.docker.cli'
30-Nov-2019 20:46:54
Beginning to execute external process for build 'phpBB3 - Pull Requests - Build and Test Job #9738 (PHPBB3-PR-JOB1-9738)'
... running command line:
/usr/bin/docker build --force-rm=true --tag=phpbb:php-7.1 /home/bamboo/xml-data/build-dir/PHPBB3-PR-JOB1
... in: /home/bamboo/xml-data/build-dir/PHPBB3-PR-JOB1
... using extra environment variables:
bamboo_planRepository_1_branch=3.1.x
bamboo_planRepository_1_branchDisplayName=3.1.x
bamboo_repository_revision_number=dc8ff9da28b8ab4ad11c7ea94cca526f17c87fe5
bamboo_PRref=master
bamboo_resultsUrl=https://bamboo.phpbb.com/browse/PHPBB3-PR-JOB1-9738
bamboo_capability_system_builder_command_Git=/usr/bin/git
bamboo_repository_75956235_git_username=bantu
bamboo_build_working_directory=/home/bamboo/xml-data/build-dir/PHPBB3-PR-JOB1
bamboo_planRepository_1_name=phpBB Ascraeus
bamboo_buildKey=PHPBB3-PR-JOB1
bamboo_capability_phpbb_tests=true
bamboo_shortPlanName=Pull Requests
bamboo_capability_system_builder_command_fop=/usr/bin/fop
bamboo_capability_dbms_sqlite_2=true
bamboo_planRepository_name=phpBB Ascraeus
bamboo_PRnumber=5753
bamboo_buildNumber=9738
bamboo_repository_75956235_git_repositoryUrl=https://github.com/phpbb/phpbb.git
bamboo_capability_system_builder_phpunit_PHPUnit=/usr/bin/phpunit
bamboo_shortJobName=Build and Test Job
bamboo_buildResultsUrl=https://bamboo.phpbb.com/browse/PHPBB3-PR-JOB1-9738
bamboo_repository_75956235_branch_name=3.1.x
bamboo_planRepository_repositoryUrl=https://github.com/phpbb/phpbb.git
bamboo_agentId=131073
bamboo_planName=phpBB3 - Pull Requests
bamboo_build_commandline_com_atlassian_bamboo_plugins_scripttask_task_builder_script_7=/bin/sh /home/bamboo/temp/PHPBB3-PR-JOB1-9738-ScriptBuildTask-5660838944896039843.sh
bamboo_shortPlanKey=PR
bamboo_shortJobKey=JOB1
bamboo_capability_dbms_mysql_55=true
bamboo_capability_system_jdk_JDK_1_7_0_65=/usr/lib/jvm/java-7-openjdk-amd64
bamboo_planRepository_revision=dc8ff9da28b8ab4ad11c7ea94cca526f17c87fe5
bamboo_buildTimeStamp=2019-11-30T20:46:40.070Z
bamboo_repository_previous_revision_number=dc8ff9da28b8ab4ad11c7ea94cca526f17c87fe5
bamboo_capability_system_jdk_JDK_1_6_0_16=/usr/lib/jvm/java-6-sun-1.6.0.16
bamboo_capability_system_builder_mvn2_Maven_2=/usr/share/maven2
bamboo_planRepository_previousRevision=dc8ff9da28b8ab4ad11c7ea94cca526f17c87fe5
bamboo_build_commandline_com_atlassian_bamboo_plugins_scripttask_task_builder_script_4=/bin/sh /home/bamboo/temp/PHPBB3-PR-JOB1-9738-ScriptBuildTask-7700656022281140120.sh
bamboo_repository_git_branch=3.1.x
bamboo_buildResultKey=PHPBB3-PR-JOB1-9738
bamboo_repository_branch_name=3.1.x
bamboo_buildPlanName=phpBB3 - Pull Requests - Build and Test Job
bamboo_planRepository_1_revision=dc8ff9da28b8ab4ad11c7ea94cca526f17c87fe5
bamboo_repository_name=phpBB Ascraeus
bamboo_buildFailed=false
bamboo_capability_system_docker_executable=/usr/bin/docker
bamboo_planRepository_branch=3.1.x
bamboo_agentWorkingDirectory=/home/bamboo/xml-data/build-dir
bamboo_capability_system_git_executable=/usr/bin/git
bamboo_capability_system_builder_phpunit_PHPUnit_3_4=/usr/bin/phpunit
bamboo_repository_git_username=bantu
bamboo_planRepository_1_previousRevision=dc8ff9da28b8ab4ad11c7ea94cca526f17c87fe5
bamboo_repository_75956235_revision_number=dc8ff9da28b8ab4ad11c7ea94cca526f17c87fe5
bamboo_planRepository_branchDisplayName=3.1.x
bamboo_planRepository_1_type=gitv2
bamboo_planRepository_branchName=3.1.x
bamboo_repository_75956235_previous_revision_number=dc8ff9da28b8ab4ad11c7ea94cca526f17c87fe5
bamboo_capability_system_jdk_JDK=/usr/lib/jvm/java-6-sun
bamboo_plan_storageTag=PHPBB3-PR
bamboo_hg_cache_directory=/home/bamboo/xml-data/build-dir/_hg-repositories-cache
bamboo_planRepository_1_username=bantu
bamboo_planRepository_type=gitv2
bamboo_git_cache_directory=/home/bamboo/xml-data/build-dir/_git-repositories-cache
bamboo_ManualBuildTriggerReason_userName=Build Robot
bamboo_repository_git_repositoryUrl=https://github.com/phpbb/phpbb.git
bamboo_repository_75956235_git_branch=3.1.x
bamboo_capability_system_builder_ant_Ant=/usr/share/ant
bamboo_repository_75956235_name=phpBB Ascraeus
bamboo_tmp_directory=/home/bamboo/temp
bamboo_working_directory=/home/bamboo/xml-data/build-dir/PHPBB3-PR-JOB1
bamboo_planKey=PHPBB3-PR
bamboo_capability_local=true
bamboo_planRepository_1_repositoryUrl=https://github.com/phpbb/phpbb.git
bamboo_planRepository_username=bantu
bamboo_capability_system_jdk_JDK_1_6=/usr/lib/jvm/java-6-sun
bamboo_capability_system_jdk_JDK_1_7=/usr/lib/jvm/java-7-openjdk-amd64
bamboo_planRepository_1_branchName=3.1.x
30-Nov-2019 20:46:54 Sending build context to Docker daemon  46.05MB
30-Nov-2019 20:46:54
30-Nov-2019 20:46:55 Step 1/5 : FROM php:7.1
30-Nov-2019 20:46:55 ---> 060b5298208c
30-Nov-2019 20:46:55 Step 2/5 : RUN apt-get update && apt-get install -y         git         zlib1g-dev         bzip2         zip         && docker-php-ext-install -j$(nproc) zip
30-Nov-2019 20:46:55 ---> Using cache
30-Nov-2019 20:46:55 ---> 385e626c3207
30-Nov-2019 20:46:55 Step 3/5 : RUN pecl install xdebug-2.6.1
30-Nov-2019 20:46:55 ---> Using cache
30-Nov-2019 20:46:55 ---> 7f0fe7e3ce20
30-Nov-2019 20:46:55 Step 4/5 : RUN docker-php-ext-enable xdebug
30-Nov-2019 20:46:55 ---> Using cache
30-Nov-2019 20:46:55 ---> 8b1cd62f766c
30-Nov-2019 20:46:55 Step 5/5 : RUN echo "memory_limit = 1536M" >> /usr/local/etc/php/conf.d/memory.ini
30-Nov-2019 20:46:55 ---> Using cache
30-Nov-2019 20:46:55 ---> 770b43a00303
30-Nov-2019 20:46:55 Successfully built 770b43a00303
30-Nov-2019 20:46:55 Successfully tagged phpbb:php-7.1
30-Nov-2019 20:46:55 Built Docker image 'phpbb:php-7.1'
30-Nov-2019 20:46:55 Finished task 'Build image' with result: Success
30-Nov-2019 20:46:55
Substituting variable: ${bamboo.working.directory} with /home/bamboo/xml-data/build-dir/PHPBB3-PR-JOB1
30-Nov-2019 20:46:55 Starting task 'Prepare directory' of type 'com.atlassian.bamboo.plugins.bamboo-docker-plugin:task.docker.cli'
30-Nov-2019 20:46:55 Running image name (phpbb:php-7.1)
30-Nov-2019 20:46:55
Beginning to execute external process for build 'phpBB3 - Pull Requests - Build and Test Job #9738 (PHPBB3-PR-JOB1-9738)'
... running command line:
/usr/bin/docker run --volume /home/bamboo/xml-data/build-dir/PHPBB3-PR-JOB1:/data --workdir /data/phpBB --rm -e HOME=/home/bamboo -u=991 phpbb:php-7.1 /bin/bash -c php ../composer.phar install --dev; cd ../build; ../phpBB/vendor/bin/phing clean prepare
... in: /home/bamboo/xml-data/build-dir/PHPBB3-PR-JOB1
... using extra environment variables:
bamboo_planRepository_1_branch=3.1.x
bamboo_planRepository_1_branchDisplayName=3.1.x
bamboo_repository_revision_number=dc8ff9da28b8ab4ad11c7ea94cca526f17c87fe5
bamboo_PRref=master
bamboo_resultsUrl=https://bamboo.phpbb.com/browse/PHPBB3-PR-JOB1-9738
bamboo_capability_system_builder_command_Git=/usr/bin/git
bamboo_repository_75956235_git_username=bantu
bamboo_build_working_directory=/home/bamboo/xml-data/build-dir/PHPBB3-PR-JOB1
bamboo_planRepository_1_name=phpBB Ascraeus
bamboo_buildKey=PHPBB3-PR-JOB1
bamboo_capability_phpbb_tests=true
bamboo_shortPlanName=Pull Requests
bamboo_capability_system_builder_command_fop=/usr/bin/fop
bamboo_capability_dbms_sqlite_2=true
bamboo_planRepository_name=phpBB Ascraeus
bamboo_PRnumber=5753
bamboo_buildNumber=9738
bamboo_repository_75956235_git_repositoryUrl=https://github.com/phpbb/phpbb.git
bamboo_capability_system_builder_phpunit_PHPUnit=/usr/bin/phpunit
bamboo_shortJobName=Build and Test Job
bamboo_buildResultsUrl=https://bamboo.phpbb.com/browse/PHPBB3-PR-JOB1-9738
bamboo_repository_75956235_branch_name=3.1.x
bamboo_planRepository_repositoryUrl=https://github.com/phpbb/phpbb.git
bamboo_agentId=131073
bamboo_planName=phpBB3 - Pull Requests
bamboo_build_commandline_com_atlassian_bamboo_plugins_scripttask_task_builder_script_7=/bin/sh /home/bamboo/temp/PHPBB3-PR-JOB1-9738-ScriptBuildTask-5660838944896039843.sh
bamboo_shortPlanKey=PR
bamboo_shortJobKey=JOB1
bamboo_capability_dbms_mysql_55=true
bamboo_capability_system_jdk_JDK_1_7_0_65=/usr/lib/jvm/java-7-openjdk-amd64
bamboo_planRepository_revision=dc8ff9da28b8ab4ad11c7ea94cca526f17c87fe5
bamboo_buildTimeStamp=2019-11-30T20:46:40.070Z
bamboo_repository_previous_revision_number=dc8ff9da28b8ab4ad11c7ea94cca526f17c87fe5
bamboo_capability_system_jdk_JDK_1_6_0_16=/usr/lib/jvm/java-6-sun-1.6.0.16
bamboo_capability_system_builder_mvn2_Maven_2=/usr/share/maven2
bamboo_planRepository_previousRevision=dc8ff9da28b8ab4ad11c7ea94cca526f17c87fe5
bamboo_build_commandline_com_atlassian_bamboo_plugins_scripttask_task_builder_script_4=/bin/sh /home/bamboo/temp/PHPBB3-PR-JOB1-9738-ScriptBuildTask-7700656022281140120.sh
bamboo_repository_git_branch=3.1.x
bamboo_buildResultKey=PHPBB3-PR-JOB1-9738
bamboo_repository_branch_name=3.1.x
bamboo_buildPlanName=phpBB3 - Pull Requests - Build and Test Job
bamboo_planRepository_1_revision=dc8ff9da28b8ab4ad11c7ea94cca526f17c87fe5
bamboo_repository_name=phpBB Ascraeus
bamboo_buildFailed=false
bamboo_capability_system_docker_executable=/usr/bin/docker
bamboo_build_commandline_com_atlassian_bamboo_plugins_bamboo_docker_plugin_task_docker_cli_13=/usr/bin/docker build --force-rm=true --tag=phpbb:php-7.1 /home/bamboo/xml-data/build-dir/PHPBB3-PR-JOB1
bamboo_planRepository_branch=3.1.x
bamboo_agentWorkingDirectory=/home/bamboo/xml-data/build-dir
bamboo_capability_system_git_executable=/usr/bin/git
bamboo_capability_system_builder_phpunit_PHPUnit_3_4=/usr/bin/phpunit
bamboo_repository_git_username=bantu
bamboo_planRepository_1_previousRevision=dc8ff9da28b8ab4ad11c7ea94cca526f17c87fe5
bamboo_repository_75956235_revision_number=dc8ff9da28b8ab4ad11c7ea94cca526f17c87fe5
bamboo_planRepository_branchDisplayName=3.1.x
bamboo_planRepository_1_type=gitv2
bamboo_planRepository_branchName=3.1.x
bamboo_repository_75956235_previous_revision_number=dc8ff9da28b8ab4ad11c7ea94cca526f17c87fe5
bamboo_capability_system_jdk_JDK=/usr/lib/jvm/java-6-sun
bamboo_plan_storageTag=PHPBB3-PR
bamboo_hg_cache_directory=/home/bamboo/xml-data/build-dir/_hg-repositories-cache
bamboo_planRepository_1_username=bantu
bamboo_planRepository_type=gitv2
bamboo_git_cache_directory=/home/bamboo/xml-data/build-dir/_git-repositories-cache
bamboo_ManualBuildTriggerReason_userName=Build Robot
bamboo_repository_git_repositoryUrl=https://github.com/phpbb/phpbb.git
bamboo_repository_75956235_git_branch=3.1.x
bamboo_capability_system_builder_ant_Ant=/usr/share/ant
bamboo_repository_75956235_name=phpBB Ascraeus
bamboo_tmp_directory=/home/bamboo/temp
bamboo_working_directory=/home/bamboo/xml-data/build-dir/PHPBB3-PR-JOB1
bamboo_planKey=PHPBB3-PR
bamboo_capability_local=true
bamboo_planRepository_1_repositoryUrl=https://github.com/phpbb/phpbb.git
bamboo_planRepository_username=bantu
bamboo_capability_system_jdk_JDK_1_6=/usr/lib/jvm/java-6-sun
bamboo_capability_system_jdk_JDK_1_7=/usr/lib/jvm/java-7-openjdk-amd64
bamboo_planRepository_1_branchName=3.1.x
30-Nov-2019 20:46:56 Cannot create cache directory /home/bamboo/.composer/cache/repo/https---repo.packagist.org/, or directory is not writable. Proceeding without cache
30-Nov-2019 20:46:56 Cannot create cache directory /home/bamboo/.composer/cache/files/, or directory is not writable. Proceeding without cache
30-Nov-2019 20:46:56 You are using the deprecated option "dev". Dev packages are installed by default now.
30-Nov-2019 20:46:56 Loading composer repositories with package information
30-Nov-2019 20:46:56 Installing dependencies (including require-dev) from lock file
30-Nov-2019 20:46:56 Package operations: 82 installs, 0 updates, 0 removals
30-Nov-2019 20:46:57   - Installing composer/installers (v1.6.0): Downloading (connecting...)Downloading (0%)           Downloading (5%)Downloading (40%)Downloading (45%)Downloading (50%)Downloading (80%)Downloading (85%)Downloading (90%)Downloading (100%)
30-Nov-2019 20:46:57   - Installing ocramius/package-versions (1.4.0): Downloading (connecting...)Downloading (100%)         
30-Nov-2019 20:46:58   - Installing bantu/ini-get-wrapper (v1.0.1): Downloading (connecting...)Downloading (100%)         
30-Nov-2019 20:46:59   - Installing symfony/process (v3.4.31): Downloading (connecting...)Downloading (0%)           Downloading (5%)Downloading (35%)Downloading (40%)Downloading (45%)Downloading (55%)Downloading (60%)Downloading (90%)Downloading (95%)Downloading (100%)
30-Nov-2019 20:47:00   - Installing symfony/finder (v3.4.31): Downloading (connecting...)Downloading (100%)         
30-Nov-2019 20:47:00   - Installing symfony/polyfill-ctype (v1.12.0): Downloading (connecting...)Downloading (0%)           Downloading (100%)
30-Nov-2019 20:47:01   - Installing symfony/filesystem (v3.4.31): Downloading (connecting...)Downloading (0%)           Downloading (5%)Downloading (10%)Downloading (100%)
30-Nov-2019 20:47:02   - Installing symfony/polyfill-mbstring (v1.12.0): Downloading (connecting...)Downloading (0%)           Downloading (30%)Downloading (60%)Downloading (90%)Downloading (100%)
30-Nov-2019 20:47:02   - Installing psr/log (1.1.0): Downloading (connecting...)Downloading (0%)           Downloading (65%)Downloading (90%)Downloading (100%)
30-Nov-2019 20:47:03   - Installing symfony/debug (v3.4.31): Downloading (connecting...)Downloading (100%)         
30-Nov-2019 20:47:04   - Installing symfony/console (v3.4.31): Downloading (connecting...)Downloading (100%)         
30-Nov-2019 20:47:05   - Installing seld/phar-utils (1.0.1): Downloading (connecting...)Downloading (0%)           Downloading (30%)Downloading (60%)Downloading (90%)Downloading (100%)
30-Nov-2019 20:47:05   - Installing seld/jsonlint (1.7.1): Downloading (connecting...)Downloading (0%)           Downloading (15%)Downloading (70%)Downloading (85%)Downloading (100%)
30-Nov-2019 20:47:06   - Installing justinrainbow/json-schema (5.2.8): Downloading (connecting...)Downloading (0%)           Downloading (5%)Downloading (20%)Downloading (25%)Downloading (55%)Downloading (60%)Downloading (80%)Downloading (85%)Downloading (100%)
30-Nov-2019 20:47:07   - Installing composer/xdebug-handler (1.3.3): Downloading (connecting...)Downloading (0%)           Downloading (65%)Downloading (100%)
30-Nov-2019 20:47:07   - Installing composer/spdx-licenses (1.5.2): Downloading (connecting...)Downloading (0%)           Downloading (10%)Downloading (20%)Downloading (30%)Downloading (40%)Downloading (50%)Downloading (60%)Downloading (70%)Downloading (80%)Downloading (90%)Downloading (100%)
30-Nov-2019 20:47:08   - Installing composer/semver (1.5.0): Downloading (connecting...)Downloading (0%)           Downloading (35%)Downloading (70%)Downloading (100%)
30-Nov-2019 20:47:09   - Installing composer/ca-bundle (1.1.4): Downloading (connecting...)Downloading (0%)           Downloading (5%)Downloading (10%)Downloading (15%)Downloading (20%)Downloading (25%)Downloading (30%)Downloading (35%)Downloading (40%)Downloading (45%)Downloading (50%)Downloading (55%)Downloading (60%)Downloading (65%)Downloading (70%)Downloading (75%)Downloading (80%)Downloading (85%)Downloading (95%)Downloading (100%)
30-Nov-2019 20:47:10   - Installing composer/composer (1.8.6): Downloading (connecting...)Downloading (100%)         
30-Nov-2019 20:47:10   - Installing google/recaptcha (1.2.3): Downloading (connecting...)Downloading (0%)           Downloading (15%)Downloading (30%)Downloading (35%)Downloading (55%)Downloading (60%)Downloading (70%)Downloading (75%)Downloading (90%)Downloading (100%)
30-Nov-2019 20:47:11   - Installing guzzlehttp/promises (v1.3.1): Downloading (connecting...)Downloading (0%)           Downloading (30%)Downloading (60%)Downloading (90%)Downloading (100%)
30-Nov-2019 20:47:12   - Installing ralouphie/getallheaders (3.0.3): Downloading (connecting...)Downloading (0%)           Downloading (100%)
30-Nov-2019 20:47:12   - Installing psr/http-message (1.0.1): Downloading (connecting...)Downloading (0%)           Downloading (100%)
30-Nov-2019 20:47:13   - Installing guzzlehttp/psr7 (1.6.1): Downloading (connecting...)Downloading (0%)           Downloading (5%)Downloading (10%)Downloading (45%)Downloading (80%)Downloading (85%)Downloading (90%)Downloading (95%)Downloading (100%)
30-Nov-2019 20:47:14   - Installing lusitanian/oauth (v0.8.11): Downloading (connecting...)Downloading (100%)         
30-Nov-2019 20:47:14   - Installing marc1706/fast-image-size (v1.1.5): Downloading (connecting...)Downloading (100%)         
30-Nov-2019 20:47:15   - Installing patchwork/utf8 (v1.3.1): Downloading (connecting...)Downloading (0%)           Downloading (5%)Downloading (10%)Downloading (15%)Downloading (20%)Downloading (25%)Downloading (30%)Downloading (35%)Downloading (40%)Downloading (45%)Downloading (50%)Downloading (55%)Downloading (60%)Downloading (65%)Downloading (70%)Downloading (75%)Downloading (80%)Downloading (85%)Downloading (90%)Downloading (95%)Downloading (100%)
30-Nov-2019 20:47:16   - Installing psr/container (1.0.0): Downloading (connecting...)Downloading (0%)           Downloading (75%)Downloading (100%)
30-Nov-2019 20:47:16   - Installing s9e/regexp-builder (1.4.3): Downloading (connecting...)Downloading (100%)         
30-Nov-2019 20:47:18   - Installing s9e/text-formatter (2.1.2): Downloading (connecting...)Downloading (100%)         
30-Nov-2019 20:47:18   - Installing symfony/config (v3.4.31): Downloading (connecting...)Downloading (100%)         
30-Nov-2019 20:47:19   - Installing paragonie/random_compat (v9.99.99): Downloading (connecting...)Downloading (0%)           Downloading (45%)Downloading (90%)Downloading (100%)
30-Nov-2019 20:47:20   - Installing symfony/polyfill-php70 (v1.12.0): Downloading (connecting...)Downloading (0%)           Downloading (85%)Downloading (100%)
30-Nov-2019 20:47:20   - Installing symfony/http-foundation (v3.4.31): Downloading (connecting...)Downloading (100%)         
30-Nov-2019 20:47:21   - Installing symfony/event-dispatcher (v3.4.31): Downloading (connecting...)Downloading (100%)         
30-Nov-2019 20:47:22   - Installing symfony/http-kernel (v3.4.31): Downloading (connecting...)Downloading (100%)         
30-Nov-2019 20:47:23   - Installing symfony/dependency-injection (v3.4.31): Downloading (connecting...)Downloading (100%)         
30-Nov-2019 20:47:24   - Installing zendframework/zend-eventmanager (3.2.1): Downloading (connecting...)Downloading (100%)         
30-Nov-2019 20:47:25   - Installing zendframework/zend-code (3.3.2): Downloading (connecting...)Downloading (0%)           Downloading (5%)Downloading (10%)Downloading (15%)Downloading (20%)Downloading (25%)Downloading (30%)Downloading (35%)Downloading (40%)Downloading (50%)Downloading (55%)Downloading (65%)Downloading (70%)Downloading (75%)Downloading (80%)Downloading (85%)Downloading (90%)Downloading (95%)Downloading (100%)
30-Nov-2019 20:47:26   - Installing ocramius/proxy-manager (2.1.1): Downloading (connecting...)Downloading (0%)           Downloading (5%)Downloading (10%)Downloading (15%)Downloading (20%)Downloading (25%)Downloading (30%)Downloading (35%)Downloading (40%)Downloading (45%)Downloading (50%)Downloading (55%)Downloading (60%)Downloading (65%)Downloading (70%)Downloading (75%)Downloading (80%)Downloading (85%)Downloading (90%)Downloading (95%)Downloading (100%)
30-Nov-2019 20:47:26   - Installing symfony/proxy-manager-bridge (v3.4.31): Downloading (connecting...)Downloading (100%)         
30-Nov-2019 20:47:27   - Installing symfony/routing (v3.4.31): Downloading (connecting...)Downloading (100%)         
30-Nov-2019 20:47:28   - Installing twig/twig (v2.11.3): Downloading (connecting...)Downloading (0%)           Downloading (5%)Downloading (10%)Downloading (15%)Downloading (20%)Downloading (25%)Downloading (30%)Downloading (35%)Downloading (40%)Downloading (45%)Downloading (50%)Downloading (55%)Downloading (65%)Downloading (70%)Downloading (75%)Downloading (80%)Downloading (85%)Downloading (100%)
30-Nov-2019 20:47:29   - Installing symfony/twig-bridge (v3.4.31): Downloading (connecting...)Downloading (100%)         
30-Nov-2019 20:47:30   - Installing symfony/dom-crawler (v3.4.31): Downloading (connecting...)Downloading (100%)         
30-Nov-2019 20:47:31   - Installing symfony/css-selector (v3.4.31): Downloading (connecting...)Downloading (100%)         
30-Nov-2019 20:47:31   - Installing symfony/browser-kit (v3.4.31): Downloading (connecting...)Downloading (100%)         
30-Nov-2019 20:47:32   - Installing guzzlehttp/guzzle (6.3.3): Downloading (connecting...)Downloading (0%)           Downloading (5%)Downloading (15%)Downloading (20%)Downloading (30%)Downloading (35%)Downloading (45%)Downloading (50%)Downloading (55%)Downloading (65%)Downloading (70%)Downloading (80%)Downloading (85%)Downloading (90%)Downloading (100%)
30-Nov-2019 20:47:33   - Installing fabpot/goutte (v3.2.3): Downloading (connecting...)Downloading (0%)           Downloading (40%)Downloading (100%)
30-Nov-2019 20:47:33   - Installing facebook/webdriver (1.7.1): Downloading (connecting...)Downloading (0%)           Downloading (5%)Downloading (10%)Downloading (15%)Downloading (20%)Downloading (25%)Downloading (30%)Downloading (35%)Downloading (40%)Downloading (45%)Downloading (50%)Downloading (55%)Downloading (60%)Downloading (65%)Downloading (70%)Downloading (75%)Downloading (80%)Downloading (85%)Downloading (90%)Downloading (95%)Downloading (100%)
30-Nov-2019 20:47:34   - Installing symfony/yaml (v3.4.31): Downloading (connecting...)Downloading (0%)           Downloading (5%)Downloading (10%)Downloading (15%)Downloading (20%)Downloading (25%)Downloading (30%)Downloading (35%)Downloading (40%)Downloading (45%)Downloading (50%)Downloading (75%)Downloading (80%)Downloading (85%)Downloading (90%)Downloading (95%)Downloading (100%)
30-Nov-2019 20:47:35   - Installing laravel/homestead (v7.20.0): Downloading (connecting...)Downloading (100%)         
30-Nov-2019 20:47:36   - Installing phing/phing (2.16.1): Downloading (connecting...)Downloading (0%)           Downloading (5%)Downloading (10%)Downloading (15%)Downloading (20%)Downloading (25%)Downloading (30%)Downloading (35%)Downloading (40%)Downloading (45%)Downloading (50%)Downloading (55%)Downloading (60%)Downloading (65%)Downloading (70%)Downloading (75%)Downloading (80%)Downloading (85%)Downloading (90%)Downloading (95%)Downloading (100%)
30-Nov-2019 20:47:37   - Installing webmozart/assert (1.5.0): Downloading (connecting...)Downloading (0%)           Downloading (10%)Downloading (100%)
30-Nov-2019 20:47:37   - Installing phpdocumentor/reflection-common (2.0.0): Downloading (connecting...)Downloading (0%)           Downloading (65%)Downloading (100%)
30-Nov-2019 20:47:38   - Installing phpdocumentor/type-resolver (1.0.1): Downloading (connecting...)Downloading (0%)           Downloading (10%)Downloading (35%)Downloading (45%)Downloading (90%)Downloading (100%)
30-Nov-2019 20:47:39   - Installing phpdocumentor/reflection-docblock (4.3.2): Downloading (connecting...)Downloading (0%)           Downloading (5%)Downloading (10%)Downloading (15%)Downloading (20%)Downloading (25%)Downloading (30%)Downloading (35%)Downloading (40%)Downloading (45%)Downloading (100%)
30-Nov-2019 20:47:39   - Installing sebastian/version (2.0.1): Downloading (connecting...)Downloading (0%)           Downloading (100%)
30-Nov-2019 20:47:40   - Installing sebastian/resource-operations (2.0.1): Downloading (connecting...)Downloading (0%)           Downloading (25%)Downloading (45%)Downloading (70%)Downloading (90%)Downloading (100%)
30-Nov-2019 20:47:40   - Installing sebastian/recursion-context (3.0.0): Downloading (connecting...)Downloading (0%)           Downloading (35%)Downloading (70%)Downloading (100%)
30-Nov-2019 20:47:41   - Installing sebastian/object-reflector (1.1.1): Downloading (connecting...)Downloading (0%)           Downloading (65%)Downloading (100%)
30-Nov-2019 20:47:41   - Installing sebastian/object-enumerator (3.0.3): Downloading (connecting...)Downloading (0%)           Downloading (100%)
30-Nov-2019 20:47:42   - Installing sebastian/global-state (2.0.0): Downloading (connecting...)Downloading (0%)           Downloading (20%)Downloading (75%)Downloading (95%)Downloading (100%)
30-Nov-2019 20:47:43   - Installing sebastian/exporter (3.1.2): Downloading (connecting...)Downloading (0%)           Downloading (10%)Downloading (20%)Downloading (30%)Downloading (40%)Downloading (50%)Downloading (60%)Downloading (70%)Downloading (80%)Downloading (90%)Downloading (100%)
30-Nov-2019 20:47:43   - Installing sebastian/environment (4.2.2): Downloading (connecting...)Downloading (0%)           Downloading (35%)Downloading (100%)
30-Nov-2019 20:47:44   - Installing sebastian/diff (3.0.2): Downloading (connecting...)Downloading (0%)           Downloading (20%)Downloading (40%)Downloading (50%)Downloading (55%)Downloading (70%)Downloading (75%)Downloading (90%)Downloading (95%)Downloading (100%)
30-Nov-2019 20:47:44   - Installing sebastian/comparator (3.0.2): Downloading (connecting...)Downloading (0%)           Downloading (25%)Downloading (50%)Downloading (60%)Downloading (80%)Downloading (90%)Downloading (100%)
30-Nov-2019 20:47:45   - Installing phpunit/php-timer (2.1.2): Downloading (connecting...)Downloading (0%)           Downloading (35%)Downloading (70%)Downloading (100%)
30-Nov-2019 20:47:46   - Installing phpunit/php-text-template (1.2.1): Downloading (connecting...)Downloading (0%)           Downloading (35%)Downloading (100%)
30-Nov-2019 20:47:46   - Installing phpunit/php-file-iterator (2.0.2): Downloading (connecting...)Downloading (0%)           Downloading (35%)Downloading (70%)Downloading (100%)
30-Nov-2019 20:47:47   - Installing theseer/tokenizer (1.1.3): Downloading (connecting...)Downloading (0%)           Downloading (15%)Downloading (30%)Downloading (100%)
30-Nov-2019 20:47:48   - Installing sebastian/code-unit-reverse-lookup (1.0.1): Downloading (connecting...)Downloading (0%)           Downloading (55%)Downloading (100%)
30-Nov-2019 20:47:48   - Installing phpunit/php-token-stream (3.1.1): Downloading (connecting...)Downloading (0%)           Downloading (5%)Downloading (75%)Downloading (80%)Downloading (85%)Downloading (100%)
30-Nov-2019 20:47:49   - Installing phpunit/php-code-coverage (6.1.4): Downloading (connecting...)Downloading (0%)           Downloading (5%)Downloading (10%)Downloading (15%)Downloading (20%)Downloading (25%)Downloading (30%)Downloading (35%)Downloading (40%)Downloading (45%)Downloading (50%)Downloading (55%)Downloading (60%)Downloading (65%)Downloading (70%)Downloading (75%)Downloading (80%)Downloading (85%)Downloading (90%)Downloading (95%)Downloading (100%)
30-Nov-2019 20:47:49   - Installing doctrine/instantiator (1.2.0): Downloading (connecting...)Downloading (0%)           Downloading (95%)Downloading (100%)
30-Nov-2019 20:47:50   - Installing phpspec/prophecy (1.9.0): Downloading (connecting...)Downloading (0%)           Downloading (10%)Downloading (20%)Downloading (25%)Downloading (35%)Downloading (40%)Downloading (45%)Downloading (50%)Downloading (55%)Downloading (60%)Downloading (65%)Downloading (70%)Downloading (80%)Downloading (90%)Downloading (95%)Downloading (100%)
30-Nov-2019 20:47:51   - Installing phar-io/version (2.0.1): Downloading (connecting...)Downloading (0%)           Downloading (5%)Downloading (10%)Downloading (100%)
30-Nov-2019 20:47:51   - Installing phar-io/manifest (1.0.3): Downloading (connecting...)Downloading (0%)           Downloading (10%)Downloading (15%)Downloading (25%)Downloading (35%)Downloading (40%)Downloading (55%)Downloading (65%)Downloading (75%)Downloading (80%)Downloading (85%)Downloading (95%)Downloading (100%)
30-Nov-2019 20:47:53   - Installing myclabs/deep-copy (1.9.3): Downloading (connecting...)Downloading (0%)           Downloading (5%)Downloading (10%)Downloading (15%)Downloading (20%)Downloading (25%)Downloading (30%)Downloading (65%)Downloading (70%)Downloading (75%)Downloading (80%)Downloading (85%)Downloading (90%)Downloading (95%)Downloading (100%)
30-Nov-2019 20:47:53   - Installing phpunit/phpunit (7.5.16): Downloading (connecting...)Downloading (100%)         
30-Nov-2019 20:47:54   - Installing phpunit/dbunit (4.0.0): Downloading (connecting...)Downloading (100%)         
30-Nov-2019 20:47:55   - Installing squizlabs/php_codesniffer (3.5.0): Downloading (connecting...)Downloading (0%)           Downloading (5%)Downloading (10%)Downloading (15%)Downloading (20%)Downloading (25%)Downloading (30%)Downloading (35%)Downloading (40%)Downloading (45%)Downloading (50%)Downloading (55%)Downloading (60%)Downloading (65%)Downloading (70%)Downloading (75%)Downloading (80%)Downloading (85%)Downloading (90%)Downloading (95%)Downloading (100%)
30-Nov-2019 20:47:56 symfony/console suggests installing symfony/lock
30-Nov-2019 20:47:56 guzzlehttp/psr7 suggests installing zendframework/zend-httphandlerrunner (Emit PSR-7 responses)
30-Nov-2019 20:47:56 lusitanian/oauth suggests installing predis/predis (Allows using the Redis storage backend.)
30-Nov-2019 20:47:56 patchwork/utf8 suggests installing ext-intl (Use Intl for best performance)
30-Nov-2019 20:47:56 patchwork/utf8 suggests installing ext-wfio (Use WFIO for UTF-8 filesystem access on Windows)
30-Nov-2019 20:47:56 s9e/text-formatter suggests installing ext-intl (Allows international URLs to be accepted by the URL filter)
30-Nov-2019 20:47:56 s9e/text-formatter suggests installing ext-xsl (Enables the XSLT renderer)
30-Nov-2019 20:47:56 paragonie/random_compat suggests installing ext-libsodium (Provides a modern crypto API that can be used to generate random bytes.)
30-Nov-2019 20:47:56 symfony/http-kernel suggests installing symfony/var-dumper
30-Nov-2019 20:47:56 symfony/dependency-injection suggests installing symfony/expression-language (For using expressions in service container configuration)
30-Nov-2019 20:47:56 zendframework/zend-eventmanager suggests installing container-interop/container-interop (^1.1.0, to use the lazy listeners feature)
30-Nov-2019 20:47:56 zendframework/zend-eventmanager suggests installing zendframework/zend-stdlib (^2.7.3 || ^3.0, to use the FilterChain feature)
30-Nov-2019 20:47:56 zendframework/zend-code suggests installing doctrine/annotations (Doctrine\Common\Annotations >=1.0 for annotation features)
30-Nov-2019 20:47:56 zendframework/zend-code suggests installing zendframework/zend-stdlib (Zend\Stdlib component)
30-Nov-2019 20:47:56 ocramius/proxy-manager suggests installing ocramius/generated-hydrator (To have very fast object to array to object conversion for ghost objects)
30-Nov-2019 20:47:56 ocramius/proxy-manager suggests installing zendframework/zend-json (To have the JsonRpc adapter (Remote Object feature))
30-Nov-2019 20:47:56 ocramius/proxy-manager suggests installing zendframework/zend-soap (To have the Soap adapter (Remote Object feature))
30-Nov-2019 20:47:56 ocramius/proxy-manager suggests installing zendframework/zend-xmlrpc (To have the XmlRpc adapter (Remote Object feature))
30-Nov-2019 20:47:56 symfony/routing suggests installing doctrine/annotations (For using the annotation loader)
30-Nov-2019 20:47:56 symfony/routing suggests installing symfony/expression-language (For using expression matching)
30-Nov-2019 20:47:56 symfony/twig-bridge suggests installing symfony/asset (For using the AssetExtension)
30-Nov-2019 20:47:56 symfony/twig-bridge suggests installing symfony/expression-language (For using the ExpressionExtension)
30-Nov-2019 20:47:56 symfony/twig-bridge suggests installing symfony/form (For using the FormExtension)
30-Nov-2019 20:47:56 symfony/twig-bridge suggests installing symfony/security (For using the SecurityExtension)
30-Nov-2019 20:47:56 symfony/twig-bridge suggests installing symfony/stopwatch (For using the StopwatchExtension)
30-Nov-2019 20:47:56 symfony/twig-bridge suggests installing symfony/templating (For using the TwigEngine)
30-Nov-2019 20:47:56 symfony/twig-bridge suggests installing symfony/translation (For using the TranslationExtension)
30-Nov-2019 20:47:56 symfony/twig-bridge suggests installing symfony/var-dumper (For using the DumpExtension)
30-Nov-2019 20:47:56 symfony/twig-bridge suggests installing symfony/web-link (For using the WebLinkExtension)
30-Nov-2019 20:47:56 facebook/webdriver suggests installing ext-SimpleXML (For Firefox profile creation)
30-Nov-2019 20:47:56 phing/phing suggests installing pdepend/pdepend (PHP version of JDepend)
30-Nov-2019 20:47:56 phing/phing suggests installing pear/archive_tar (Tar file management class)
30-Nov-2019 20:47:56 phing/phing suggests installing pear/versioncontrol_git (A library that provides OO interface to handle Git repository)
30-Nov-2019 20:47:56 phing/phing suggests installing pear/versioncontrol_svn (A simple OO-style interface for Subversion, the free/open-source version control system)
30-Nov-2019 20:47:56 phing/phing suggests installing phpdocumentor/phpdocumentor (Documentation Generator for PHP)
30-Nov-2019 20:47:56 phing/phing suggests installing phploc/phploc (A tool for quickly measuring the size of a PHP project)
30-Nov-2019 20:47:56 phing/phing suggests installing phpmd/phpmd (PHP version of PMD tool)
30-Nov-2019 20:47:56 phing/phing suggests installing sebastian/phpcpd (Copy/Paste Detector (CPD) for PHP code)
30-Nov-2019 20:47:56 phing/phing suggests installing siad007/versioncontrol_hg (A library for interfacing with Mercurial repositories.)
30-Nov-2019 20:47:56 phing/phing suggests installing tedivm/jshrink (Javascript Minifier built in PHP)
30-Nov-2019 20:47:56 sebastian/global-state suggests installing ext-uopz (*)
30-Nov-2019 20:47:56 phpunit/phpunit suggests installing ext-soap (*)
30-Nov-2019 20:47:56 phpunit/phpunit suggests installing phpunit/php-invoker (^2.0)
30-Nov-2019 20:47:56 Package phpunit/dbunit is abandoned, you should avoid using it. No replacement was suggested.
30-Nov-2019 20:47:56 Generating autoload files
30-Nov-2019 20:47:56 ocramius/package-versions:  Generating version class...
30-Nov-2019 20:47:56 ocramius/package-versions: ...done generating version class
30-Nov-2019 20:47:56 Buildfile: /data/build/build.xml
30-Nov-2019 20:47:56
30-Nov-2019 20:47:56 phpBB > clean:
30-Nov-2019 20:47:56
30-Nov-2019 20:47:56    [delete] Directory /data/build/logs does not exist or is not a directory.
30-Nov-2019 20:47:56    [delete] Directory /data/build/api does not exist or is not a directory.
30-Nov-2019 20:47:56    [delete] Directory /data/build/codebrowser does not exist or is not a directory.
30-Nov-2019 20:47:56    [delete] Directory /data/build/coverage does not exist or is not a directory.
30-Nov-2019 20:47:56    [delete] Directory /data/build/cpd does not exist or is not a directory.
30-Nov-2019 20:47:56    [delete] Directory /data/build/dependencies does not exist or is not a directory.
30-Nov-2019 20:47:56    [delete] Directory /data/build/new_version does not exist or is not a directory.
30-Nov-2019 20:47:56    [delete] Directory /data/build/old_versions does not exist or is not a directory.
30-Nov-2019 20:47:56    [delete] Directory /data/build/save does not exist or is not a directory.
30-Nov-2019 20:47:56
30-Nov-2019 20:47:56 phpBB > prepare:
30-Nov-2019 20:47:56
30-Nov-2019 20:47:56     [mkdir] Created dir: /data/build/logs
30-Nov-2019 20:47:56     [mkdir] Created dir: /data/build/api
30-Nov-2019 20:47:56     [mkdir] Created dir: /data/build/codebrowser
30-Nov-2019 20:47:56     [mkdir] Created dir: /data/build/coverage
30-Nov-2019 20:47:56     [mkdir] Created dir: /data/build/cpd
30-Nov-2019 20:47:56     [mkdir] Created dir: /data/build/dependencies
30-Nov-2019 20:47:56     [mkdir] Created dir: /data/build/new_version
30-Nov-2019 20:47:56     [mkdir] Created dir: /data/build/new_version/files
30-Nov-2019 20:47:56     [mkdir] Created dir: /data/build/new_version/patches
30-Nov-2019 20:47:56     [mkdir] Created dir: /data/build/new_version/release_files
30-Nov-2019 20:47:56     [mkdir] Created dir: /data/build/new_version/update
30-Nov-2019 20:47:56     [mkdir] Created dir: /data/build/old_versions
30-Nov-2019 20:47:56     [mkdir] Created dir: /data/build/save
30-Nov-2019 20:47:56
30-Nov-2019 20:47:56 BUILD FINISHED
30-Nov-2019 20:47:56
30-Nov-2019 20:47:56 Total time: 0.0877 seconds
30-Nov-2019 20:47:56
30-Nov-2019 20:47:57 Finished task 'Prepare directory' with result: Success
30-Nov-2019 20:47:57 Skipping execution of task 'Run sniffs' as it is disabled
30-Nov-2019 20:47:57
Substituting variable: ${bamboo.working.directory} with /home/bamboo/xml-data/build-dir/PHPBB3-PR-JOB1
30-Nov-2019 20:47:57 Starting task 'Run sniffs' of type 'com.atlassian.bamboo.plugins.bamboo-docker-plugin:task.docker.cli'
30-Nov-2019 20:47:57 Running image name (phpbb:php-7.1)
30-Nov-2019 20:47:57
Beginning to execute external process for build 'phpBB3 - Pull Requests - Build and Test Job #9738 (PHPBB3-PR-JOB1-9738)'
... running command line:
/usr/bin/docker run --volume /home/bamboo/xml-data/build-dir/PHPBB3-PR-JOB1:/data --workdir /data/build --rm -u=991 phpbb:php-7.1 ../phpBB/vendor/bin/phing sniff
... in: /home/bamboo/xml-data/build-dir/PHPBB3-PR-JOB1
... using extra environment variables:
bamboo_planRepository_1_branch=3.1.x
bamboo_planRepository_1_branchDisplayName=3.1.x
bamboo_repository_revision_number=dc8ff9da28b8ab4ad11c7ea94cca526f17c87fe5
bamboo_PRref=master
bamboo_resultsUrl=https://bamboo.phpbb.com/browse/PHPBB3-PR-JOB1-9738
bamboo_capability_system_builder_command_Git=/usr/bin/git
bamboo_repository_75956235_git_username=bantu
bamboo_build_working_directory=/home/bamboo/xml-data/build-dir/PHPBB3-PR-JOB1
bamboo_planRepository_1_name=phpBB Ascraeus
bamboo_buildKey=PHPBB3-PR-JOB1
bamboo_capability_phpbb_tests=true
bamboo_shortPlanName=Pull Requests
bamboo_capability_system_builder_command_fop=/usr/bin/fop
bamboo_capability_dbms_sqlite_2=true
bamboo_planRepository_name=phpBB Ascraeus
bamboo_PRnumber=5753
bamboo_buildNumber=9738
bamboo_repository_75956235_git_repositoryUrl=https://github.com/phpbb/phpbb.git
bamboo_capability_system_builder_phpunit_PHPUnit=/usr/bin/phpunit
bamboo_shortJobName=Build and Test Job
bamboo_buildResultsUrl=https://bamboo.phpbb.com/browse/PHPBB3-PR-JOB1-9738
bamboo_repository_75956235_branch_name=3.1.x
bamboo_planRepository_repositoryUrl=https://github.com/phpbb/phpbb.git
bamboo_agentId=131073
bamboo_planName=phpBB3 - Pull Requests
bamboo_build_commandline_com_atlassian_bamboo_plugins_scripttask_task_builder_script_7=/bin/sh /home/bamboo/temp/PHPBB3-PR-JOB1-9738-ScriptBuildTask-5660838944896039843.sh
bamboo_shortPlanKey=PR
bamboo_shortJobKey=JOB1
bamboo_capability_dbms_mysql_55=true
bamboo_capability_system_jdk_JDK_1_7_0_65=/usr/lib/jvm/java-7-openjdk-amd64
bamboo_planRepository_revision=dc8ff9da28b8ab4ad11c7ea94cca526f17c87fe5
bamboo_buildTimeStamp=2019-11-30T20:46:40.070Z
bamboo_repository_previous_revision_number=dc8ff9da28b8ab4ad11c7ea94cca526f17c87fe5
bamboo_capability_system_jdk_JDK_1_6_0_16=/usr/lib/jvm/java-6-sun-1.6.0.16
bamboo_capability_system_builder_mvn2_Maven_2=/usr/share/maven2
bamboo_planRepository_previousRevision=dc8ff9da28b8ab4ad11c7ea94cca526f17c87fe5
bamboo_build_commandline_com_atlassian_bamboo_plugins_scripttask_task_builder_script_4=/bin/sh /home/bamboo/temp/PHPBB3-PR-JOB1-9738-ScriptBuildTask-7700656022281140120.sh
bamboo_repository_git_branch=3.1.x
bamboo_buildResultKey=PHPBB3-PR-JOB1-9738
bamboo_repository_branch_name=3.1.x
bamboo_buildPlanName=phpBB3 - Pull Requests - Build and Test Job
bamboo_planRepository_1_revision=dc8ff9da28b8ab4ad11c7ea94cca526f17c87fe5
bamboo_repository_name=phpBB Ascraeus
bamboo_buildFailed=false
bamboo_capability_system_docker_executable=/usr/bin/docker
bamboo_build_commandline_com_atlassian_bamboo_plugins_bamboo_docker_plugin_task_docker_cli_12=/usr/bin/docker run --volume /home/bamboo/xml-data/build-dir/PHPBB3-PR-JOB1:/data --workdir /data/phpBB --rm -e HOME=/home/bamboo -u=991 phpbb:php-7.1 /bin/bash -c php ../composer.phar install --dev; cd ../build; ../phpBB/vendor/bin/phing clean prepare
bamboo_build_commandline_com_atlassian_bamboo_plugins_bamboo_docker_plugin_task_docker_cli_13=/usr/bin/docker build --force-rm=true --tag=phpbb:php-7.1 /home/bamboo/xml-data/build-dir/PHPBB3-PR-JOB1
bamboo_planRepository_branch=3.1.x
bamboo_agentWorkingDirectory=/home/bamboo/xml-data/build-dir
bamboo_capability_system_git_executable=/usr/bin/git
bamboo_capability_system_builder_phpunit_PHPUnit_3_4=/usr/bin/phpunit
bamboo_repository_git_username=bantu
bamboo_planRepository_1_previousRevision=dc8ff9da28b8ab4ad11c7ea94cca526f17c87fe5
bamboo_repository_75956235_revision_number=dc8ff9da28b8ab4ad11c7ea94cca526f17c87fe5
bamboo_planRepository_branchDisplayName=3.1.x
bamboo_planRepository_1_type=gitv2
bamboo_planRepository_branchName=3.1.x
bamboo_repository_75956235_previous_revision_number=dc8ff9da28b8ab4ad11c7ea94cca526f17c87fe5
bamboo_capability_system_jdk_JDK=/usr/lib/jvm/java-6-sun
bamboo_plan_storageTag=PHPBB3-PR
bamboo_hg_cache_directory=/home/bamboo/xml-data/build-dir/_hg-repositories-cache
bamboo_planRepository_1_username=bantu
bamboo_planRepository_type=gitv2
bamboo_git_cache_directory=/home/bamboo/xml-data/build-dir/_git-repositories-cache
bamboo_ManualBuildTriggerReason_userName=Build Robot
bamboo_repository_git_repositoryUrl=https://github.com/phpbb/phpbb.git
bamboo_repository_75956235_git_branch=3.1.x
bamboo_capability_system_builder_ant_Ant=/usr/share/ant
bamboo_repository_75956235_name=phpBB Ascraeus
bamboo_tmp_directory=/home/bamboo/temp
bamboo_working_directory=/home/bamboo/xml-data/build-dir/PHPBB3-PR-JOB1
bamboo_planKey=PHPBB3-PR
bamboo_capability_local=true
bamboo_planRepository_1_repositoryUrl=https://github.com/phpbb/phpbb.git
bamboo_planRepository_username=bantu
bamboo_capability_system_jdk_JDK_1_6=/usr/lib/jvm/java-6-sun
bamboo_capability_system_jdk_JDK_1_7=/usr/lib/jvm/java-7-openjdk-amd64
bamboo_planRepository_1_branchName=3.1.x
30-Nov-2019 20:47:57 Buildfile: /data/build/build.xml
30-Nov-2019 20:47:57
30-Nov-2019 20:47:57 phpBB > sniff:
30-Nov-2019 20:47:57
30-Nov-2019 20:48:03 ............................................................  60 / 783 (8%)
30-Nov-2019 20:48:04 ............................................................ 120 / 783 (15%)
30-Nov-2019 20:48:04 ............................................................ 180 / 783 (23%)
30-Nov-2019 20:48:05 ............................................................ 240 / 783 (31%)
30-Nov-2019 20:48:06 ............................................................ 300 / 783 (38%)
30-Nov-2019 20:48:10 ............................................................ 360 / 783 (46%)
30-Nov-2019 20:48:13 ............................................................ 420 / 783 (54%)
30-Nov-2019 20:48:17 ............................................................ 480 / 783 (61%)
30-Nov-2019 20:48:21 ............................................................ 540 / 783 (69%)
30-Nov-2019 20:48:24 ............................................................ 600 / 783 (77%)
30-Nov-2019 20:48:27 ............................................................ 660 / 783 (84%)
30-Nov-2019 20:48:31 ............................................................ 720 / 783 (92%)
30-Nov-2019 20:48:33 ............................................................ 780 / 783 (100%)
30-Nov-2019 20:48:33 ...                                                          783 / 783 (100%)
30-Nov-2019 20:48:33
30-Nov-2019 20:48:33
30-Nov-2019 20:48:33 Time: 35.73 secs; Memory: 50.01MB
30-Nov-2019 20:48:33
30-Nov-2019 20:48:33       [php] Calling PHP function: preg_replace()
30-Nov-2019 20:48:37 ............................................................  60 / 208 (29%)
30-Nov-2019 20:48:49 ............................................................ 120 / 208 (58%)
30-Nov-2019 20:48:58 ............................................................ 180 / 208 (87%)
30-Nov-2019 20:49:03 ............................                                 208 / 208 (100%)
30-Nov-2019 20:49:03
30-Nov-2019 20:49:03
30-Nov-2019 20:49:03 Time: 29.66 secs; Memory: 38.01MB
30-Nov-2019 20:49:03
30-Nov-2019 20:49:03
30-Nov-2019 20:49:03
30-Nov-2019 20:49:03 Time: 29ms; Memory: 4MB
30-Nov-2019 20:49:03
30-Nov-2019 20:49:03
30-Nov-2019 20:49:03 BUILD FINISHED
30-Nov-2019 20:49:03
30-Nov-2019 20:49:03 Total time: 1 minute  5.61 seconds
30-Nov-2019 20:49:03
30-Nov-2019 20:49:03 Finished task 'Run sniffs' with result: Success
30-Nov-2019 20:49:03 Skipping execution of task 'Run tests' as it is disabled
30-Nov-2019 20:49:03
Substituting variable: ${bamboo.working.directory} with /home/bamboo/xml-data/build-dir/PHPBB3-PR-JOB1
30-Nov-2019 20:49:03 Starting task 'Run tests' of type 'com.atlassian.bamboo.plugins.bamboo-docker-plugin:task.docker.cli'
30-Nov-2019 20:49:03 Running image name (phpbb:php-7.1)
30-Nov-2019 20:49:03
Beginning to execute external process for build 'phpBB3 - Pull Requests - Build and Test Job #9738 (PHPBB3-PR-JOB1-9738)'
... running command line:
/usr/bin/docker run --volume /home/bamboo/xml-data/build-dir/PHPBB3-PR-JOB1:/data --workdir /data --rm -u=991 -t phpbb:php-7.1 /bin/bash -c phpBB/vendor/bin/phpunit --log-junit build/logs/phpunit.xml
... in: /home/bamboo/xml-data/build-dir/PHPBB3-PR-JOB1
... using extra environment variables:
bamboo_planRepository_1_branch=3.1.x
bamboo_planRepository_1_branchDisplayName=3.1.x
bamboo_repository_revision_number=dc8ff9da28b8ab4ad11c7ea94cca526f17c87fe5
bamboo_PRref=master
bamboo_resultsUrl=https://bamboo.phpbb.com/browse/PHPBB3-PR-JOB1-9738
bamboo_capability_system_builder_command_Git=/usr/bin/git
bamboo_repository_75956235_git_username=bantu
bamboo_build_working_directory=/home/bamboo/xml-data/build-dir/PHPBB3-PR-JOB1
bamboo_planRepository_1_name=phpBB Ascraeus
bamboo_buildKey=PHPBB3-PR-JOB1
bamboo_capability_phpbb_tests=true
bamboo_shortPlanName=Pull Requests
bamboo_capability_system_builder_command_fop=/usr/bin/fop
bamboo_capability_dbms_sqlite_2=true
bamboo_planRepository_name=phpBB Ascraeus
bamboo_PRnumber=5753
bamboo_buildNumber=9738
bamboo_repository_75956235_git_repositoryUrl=https://github.com/phpbb/phpbb.git
bamboo_capability_system_builder_phpunit_PHPUnit=/usr/bin/phpunit
bamboo_shortJobName=Build and Test Job
bamboo_buildResultsUrl=https://bamboo.phpbb.com/browse/PHPBB3-PR-JOB1-9738
bamboo_repository_75956235_branch_name=3.1.x
bamboo_planRepository_repositoryUrl=https://github.com/phpbb/phpbb.git
bamboo_agentId=131073
bamboo_planName=phpBB3 - Pull Requests
bamboo_build_commandline_com_atlassian_bamboo_plugins_scripttask_task_builder_script_7=/bin/sh /home/bamboo/temp/PHPBB3-PR-JOB1-9738-ScriptBuildTask-5660838944896039843.sh
bamboo_shortPlanKey=PR
bamboo_shortJobKey=JOB1
bamboo_capability_dbms_mysql_55=true
bamboo_capability_system_jdk_JDK_1_7_0_65=/usr/lib/jvm/java-7-openjdk-amd64
bamboo_planRepository_revision=dc8ff9da28b8ab4ad11c7ea94cca526f17c87fe5
bamboo_buildTimeStamp=2019-11-30T20:46:40.070Z
bamboo_repository_previous_revision_number=dc8ff9da28b8ab4ad11c7ea94cca526f17c87fe5
bamboo_capability_system_jdk_JDK_1_6_0_16=/usr/lib/jvm/java-6-sun-1.6.0.16
bamboo_capability_system_builder_mvn2_Maven_2=/usr/share/maven2
bamboo_planRepository_previousRevision=dc8ff9da28b8ab4ad11c7ea94cca526f17c87fe5
bamboo_build_commandline_com_atlassian_bamboo_plugins_scripttask_task_builder_script_4=/bin/sh /home/bamboo/temp/PHPBB3-PR-JOB1-9738-ScriptBuildTask-7700656022281140120.sh
bamboo_repository_git_branch=3.1.x
bamboo_buildResultKey=PHPBB3-PR-JOB1-9738
bamboo_repository_branch_name=3.1.x
bamboo_buildPlanName=phpBB3 - Pull Requests - Build and Test Job
bamboo_planRepository_1_revision=dc8ff9da28b8ab4ad11c7ea94cca526f17c87fe5
bamboo_repository_name=phpBB Ascraeus
bamboo_buildFailed=false
bamboo_capability_system_docker_executable=/usr/bin/docker
bamboo_build_commandline_com_atlassian_bamboo_plugins_bamboo_docker_plugin_task_docker_cli_11=/usr/bin/docker run --volume /home/bamboo/xml-data/build-dir/PHPBB3-PR-JOB1:/data --workdir /data/build --rm -u=991 phpbb:php-7.1 ../phpBB/vendor/bin/phing sniff
bamboo_build_commandline_com_atlassian_bamboo_plugins_bamboo_docker_plugin_task_docker_cli_12=/usr/bin/docker run --volume /home/bamboo/xml-data/build-dir/PHPBB3-PR-JOB1:/data --workdir /data/phpBB --rm -e HOME=/home/bamboo -u=991 phpbb:php-7.1 /bin/bash -c php ../composer.phar install --dev; cd ../build; ../phpBB/vendor/bin/phing clean prepare
bamboo_build_commandline_com_atlassian_bamboo_plugins_bamboo_docker_plugin_task_docker_cli_13=/usr/bin/docker build --force-rm=true --tag=phpbb:php-7.1 /home/bamboo/xml-data/build-dir/PHPBB3-PR-JOB1
bamboo_planRepository_branch=3.1.x
bamboo_agentWorkingDirectory=/home/bamboo/xml-data/build-dir
bamboo_capability_system_git_executable=/usr/bin/git
bamboo_capability_system_builder_phpunit_PHPUnit_3_4=/usr/bin/phpunit
bamboo_repository_git_username=bantu
bamboo_planRepository_1_previousRevision=dc8ff9da28b8ab4ad11c7ea94cca526f17c87fe5
bamboo_repository_75956235_revision_number=dc8ff9da28b8ab4ad11c7ea94cca526f17c87fe5
bamboo_planRepository_branchDisplayName=3.1.x
bamboo_planRepository_1_type=gitv2
bamboo_planRepository_branchName=3.1.x
bamboo_repository_75956235_previous_revision_number=dc8ff9da28b8ab4ad11c7ea94cca526f17c87fe5
bamboo_capability_system_jdk_JDK=/usr/lib/jvm/java-6-sun
bamboo_plan_storageTag=PHPBB3-PR
bamboo_hg_cache_directory=/home/bamboo/xml-data/build-dir/_hg-repositories-cache
bamboo_planRepository_1_username=bantu
bamboo_planRepository_type=gitv2
bamboo_git_cache_directory=/home/bamboo/xml-data/build-dir/_git-repositories-cache
bamboo_ManualBuildTriggerReason_userName=Build Robot
bamboo_repository_git_repositoryUrl=https://github.com/phpbb/phpbb.git
bamboo_repository_75956235_git_branch=3.1.x
bamboo_capability_system_builder_ant_Ant=/usr/share/ant
bamboo_repository_75956235_name=phpBB Ascraeus
bamboo_tmp_directory=/home/bamboo/temp
bamboo_working_directory=/home/bamboo/xml-data/build-dir/PHPBB3-PR-JOB1
bamboo_planKey=PHPBB3-PR
bamboo_capability_local=true
bamboo_planRepository_1_repositoryUrl=https://github.com/phpbb/phpbb.git
bamboo_planRepository_username=bantu
bamboo_capability_system_jdk_JDK_1_6=/usr/lib/jvm/java-6-sun
bamboo_capability_system_jdk_JDK_1_7=/usr/lib/jvm/java-7-openjdk-amd64
bamboo_planRepository_1_branchName=3.1.x
30-Nov-2019 20:49:05 PHPUnit 7.5.16 by Sebastian Bergmann and contributors.
30-Nov-2019 20:49:05
30-Nov-2019 20:49:10 .........................................F...................   61 / 7244 (  0%)
30-Nov-2019 20:49:11 .............................................................  122 / 7244 (  1%)
30-Nov-2019 20:49:11 .............I.....SSSS............SSSSSSSS.........S...S....  183 / 7244 (  2%)
30-Nov-2019 20:49:12 .............................................................  244 / 7244 (  3%)
30-Nov-2019 20:49:18 .....S.......................................................  305 / 7244 (  4%)
30-Nov-2019 20:49:18 .............................................................  366 / 7244 (  5%)
30-Nov-2019 20:49:18 .............................................................  427 / 7244 (  5%)
30-Nov-2019 20:49:19 .............................................................  488 / 7244 (  6%)
30-Nov-2019 20:49:19 .............................................................  549 / 7244 (  7%)
30-Nov-2019 20:49:19 .............................................................  610 / 7244 (  8%)
30-Nov-2019 20:49:20 .............................................................  671 / 7244 (  9%)
30-Nov-2019 20:49:20 .............................................................  732 / 7244 ( 10%)
30-Nov-2019 20:49:20 .............................................................  793 / 7244 ( 10%)
30-Nov-2019 20:49:20 .............................................................  854 / 7244 ( 11%)
30-Nov-2019 20:49:21 .............................................................  915 / 7244 ( 12%)
30-Nov-2019 20:49:21 .............................................................  976 / 7244 ( 13%)
30-Nov-2019 20:49:21 ............................................................. 1037 / 7244 ( 14%)
30-Nov-2019 20:49:24 ....................................................I........ 1098 / 7244 ( 15%)
30-Nov-2019 20:49:27 ............................................................. 1159 / 7244 ( 15%)
30-Nov-2019 20:49:31 ............................................................. 1220 / 7244 ( 16%)
30-Nov-2019 20:49:33 ...........................................S.S.S............. 1281 / 7244 ( 17%)
30-Nov-2019 20:49:34 ............................................................. 1342 / 7244 ( 18%)
30-Nov-2019 20:49:34 ............................................................. 1403 / 7244 ( 19%)
30-Nov-2019 20:49:34 ............................................................. 1464 / 7244 ( 20%)
30-Nov-2019 20:49:34 ............................................................. 1525 / 7244 ( 21%)
30-Nov-2019 20:49:34 ............................................................. 1586 / 7244 ( 21%)
30-Nov-2019 20:49:34 ............................................................. 1647 / 7244 ( 22%)
30-Nov-2019 20:49:34 ............................................................. 1708 / 7244 ( 23%)
30-Nov-2019 20:49:34 ............................................................. 1769 / 7244 ( 24%)
30-Nov-2019 20:49:34 ............................................................. 1830 / 7244 ( 25%)
30-Nov-2019 20:49:34 ............................................................. 1891 / 7244 ( 26%)
30-Nov-2019 20:49:34 ............................................................. 1952 / 7244 ( 26%)
30-Nov-2019 20:49:34 ............................................................. 2013 / 7244 ( 27%)
30-Nov-2019 20:49:35 ............................................................. 2074 / 7244 ( 28%)
30-Nov-2019 20:49:35 ............................................................. 2135 / 7244 ( 29%)
30-Nov-2019 20:49:36 ......................E...................................... 2196 / 7244 ( 30%)
30-Nov-2019 20:49:36 ............................................................. 2257 / 7244 ( 31%)
30-Nov-2019 20:49:37 ............................................................. 2318 / 7244 ( 31%)
30-Nov-2019 20:49:37 ............................................................. 2379 / 7244 ( 32%)
30-Nov-2019 20:49:39 .................I.II........................................ 2440 / 7244 ( 33%)
30-Nov-2019 20:49:39 ............................................................. 2501 / 7244 ( 34%)
30-Nov-2019 20:49:39 ............................................................. 2562 / 7244 ( 35%)
30-Nov-2019 20:49:40 ............................................................. 2623 / 7244 ( 36%)
30-Nov-2019 20:49:40 ............................................................. 2684 / 7244 ( 37%)
30-Nov-2019 20:49:42 ............................................................. 2745 / 7244 ( 37%)
30-Nov-2019 20:49:43 ............................................................. 2806 / 7244 ( 38%)
30-Nov-2019 20:49:43 ............................................................. 2867 / 7244 ( 39%)
30-Nov-2019 20:49:43 ............................................................. 2928 / 7244 ( 40%)
30-Nov-2019 20:49:50 ............................................................. 2989 / 7244 ( 41%)
30-Nov-2019 20:49:54 ............................................................. 3050 / 7244 ( 42%)
30-Nov-2019 20:49:57 .........................S................................... 3111 / 7244 ( 42%)
30-Nov-2019 20:50:00 ............................................................. 3172 / 7244 ( 43%)
30-Nov-2019 20:50:04 ............................................................. 3233 / 7244 ( 44%)
30-Nov-2019 20:50:13 .........................SSSSSSS............................. 3294 / 7244 ( 45%)
30-Nov-2019 20:50:19 ............................................................. 3355 / 7244 ( 46%)
30-Nov-2019 20:50:20 ............................................................. 3416 / 7244 ( 47%)
30-Nov-2019 20:50:20 ............................................................. 3477 / 7244 ( 47%)
30-Nov-2019 20:50:20 ............................................................. 3538 / 7244 ( 48%)
30-Nov-2019 20:50:20 ............................................................. 3599 / 7244 ( 49%)
30-Nov-2019 20:50:20 ............................................................. 3660 / 7244 ( 50%)
30-Nov-2019 20:50:21 ............................................................. 3721 / 7244 ( 51%)
30-Nov-2019 20:50:21 ............................................................. 3782 / 7244 ( 52%)
30-Nov-2019 20:50:21 ............................................................. 3843 / 7244 ( 53%)
30-Nov-2019 20:50:23 ............................................................. 3904 / 7244 ( 53%)
30-Nov-2019 20:50:23 ............................................................. 3965 / 7244 ( 54%)
30-Nov-2019 20:50:25 ............................................................. 4026 / 7244 ( 55%)
30-Nov-2019 20:50:25 ............................................................. 4087 / 7244 ( 56%)
30-Nov-2019 20:50:26 ............................................................. 4148 / 7244 ( 57%)
30-Nov-2019 20:50:27 ............................................................. 4209 / 7244 ( 58%)
30-Nov-2019 20:50:32 ............................................................. 4270 / 7244 ( 58%)
30-Nov-2019 20:50:35 ............................................................. 4331 / 7244 ( 59%)
30-Nov-2019 20:50:35 ............................................................. 4392 / 7244 ( 60%)
30-Nov-2019 20:50:36 ............................................................. 4453 / 7244 ( 61%)
30-Nov-2019 20:50:36 ............................................................. 4514 / 7244 ( 62%)
30-Nov-2019 20:50:36 ............................................................. 4575 / 7244 ( 63%)
30-Nov-2019 20:50:36 ............................................................. 4636 / 7244 ( 63%)
30-Nov-2019 20:50:36 ............................................................. 4697 / 7244 ( 64%)
30-Nov-2019 20:50:36 ............................................................. 4758 / 7244 ( 65%)
30-Nov-2019 20:50:36 ............................................................. 4819 / 7244 ( 66%)
30-Nov-2019 20:50:36 ............................................................. 4880 / 7244 ( 67%)
30-Nov-2019 20:50:40 ............................................................. 4941 / 7244 ( 68%)
30-Nov-2019 20:50:47 ...........................................S................. 5002 / 7244 ( 69%)
30-Nov-2019 20:50:53 ............................................................. 5063 / 7244 ( 69%)
30-Nov-2019 20:50:58 ............................................................. 5124 / 7244 ( 70%)
30-Nov-2019 20:50:59 ............................................................. 5185 / 7244 ( 71%)
30-Nov-2019 20:50:59 ............................................................. 5246 / 7244 ( 72%)
30-Nov-2019 20:51:00 ............................................................. 5307 / 7244 ( 73%)
30-Nov-2019 20:51:00 ............................................................S 5368 / 7244 ( 74%)
30-Nov-2019 20:51:00 SSSSSSSSSSSSSSSSSSSSSSSSSSSSSSSSSSSSSSSSSSSSSSSSSSSSSSSSSSSSS 5429 / 7244 ( 74%)
30-Nov-2019 20:51:00 SSSSSSSSSSSSSSSSSSSSSSSSSSSSSSSSSSSSSSSSSSSSSSSSSSSSSSSSSSSSS 5490 / 7244 ( 75%)
30-Nov-2019 20:51:00 SSSSSSSSSSSSSSSSSSSSSSSSSSSSSSSSSSSSSSSSSSSSSSSSSSSSSSSSSSSSS 5551 / 7244 ( 76%)
30-Nov-2019 20:51:01 SSSSSSSSSSSSSSSSSSSSSSSSSSSSSSSS............................. 5612 / 7244 ( 77%)
30-Nov-2019 20:51:03 ............................................................. 5673 / 7244 ( 78%)
30-Nov-2019 20:51:05 ............................................................. 5734 / 7244 ( 79%)
30-Nov-2019 20:51:07 ............................................................. 5795 / 7244 ( 79%)
30-Nov-2019 20:51:09 ............................................................. 5856 / 7244 ( 80%)
30-Nov-2019 20:51:11 ............................................................. 5917 / 7244 ( 81%)
30-Nov-2019 20:51:14 ............................................................. 5978 / 7244 ( 82%)
30-Nov-2019 20:51:16 ............................................................. 6039 / 7244 ( 83%)
30-Nov-2019 20:51:18 ............................................................. 6100 / 7244 ( 84%)
30-Nov-2019 20:51:20 ............................................................. 6161 / 7244 ( 85%)
30-Nov-2019 20:51:22 ............................................................. 6222 / 7244 ( 85%)
30-Nov-2019 20:51:24 ............................................................. 6283 / 7244 ( 86%)
30-Nov-2019 20:51:26 ............................................................. 6344 / 7244 ( 87%)
30-Nov-2019 20:51:29 ............................................................. 6405 / 7244 ( 88%)
30-Nov-2019 20:51:31 ............................................................. 6466 / 7244 ( 89%)
30-Nov-2019 20:51:33 ............................................................. 6527 / 7244 ( 90%)
30-Nov-2019 20:51:35 ............................................................. 6588 / 7244 ( 90%)
30-Nov-2019 20:51:37 ............................................................. 6649 / 7244 ( 91%)
30-Nov-2019 20:51:39 ............................................................. 6710 / 7244 ( 92%)
30-Nov-2019 20:51:41 ............................................................. 6771 / 7244 ( 93%)
30-Nov-2019 20:51:43 ............................................................. 6832 / 7244 ( 94%)
30-Nov-2019 20:51:45 ............................................................. 6893 / 7244 ( 95%)
30-Nov-2019 20:51:47 ............................................................. 6954 / 7244 ( 95%)
30-Nov-2019 20:51:49 ............................................................. 7015 / 7244 ( 96%)
30-Nov-2019 20:51:51 ............................................................. 7076 / 7244 ( 97%)
30-Nov-2019 20:51:53 ............................................................. 7137 / 7244 ( 98%)
30-Nov-2019 20:51:55 ......................................................SS
30-Nov-2019 20:51:55
30-Nov-2019 20:51:55 Time: 2.86 minutes, Memory: 282.00 MB
30-Nov-2019 20:51:55
30-Nov-2019 20:51:55 There was 1 error:
30-Nov-2019 20:51:55
30-Nov-2019 20:51:55 1) phpbb_event_md_exporter_test::test_crawl_template_file with data set #97 ('styles', 'styles/prosilver/template/sea...s.html')
30-Nov-2019 20:51:55 LogicException: File 'styles/prosilver/template/search_results.html' does not contain events: 'topiclist_row_topic_by_author_after', 'topiclist_row_topic_by_author_before'
30-Nov-2019 20:51:55
30-Nov-2019 20:51:55 /data/phpBB/phpbb/event/md_exporter.php:501
30-Nov-2019 20:51:55 /data/tests/event/md_exporter_test.php:150
30-Nov-2019 20:51:55
30-Nov-2019 20:51:55 --
30-Nov-2019 20:51:55
30-Nov-2019 20:51:55 There was 1 failure:
30-Nov-2019 20:51:55
30-Nov-2019 20:51:55 1) phpbb_auth_provider_apache_test::test_autologin
30-Nov-2019 20:51:55 Failed asserting that two arrays are equal.
30-Nov-2019 20:51:55 --- Expected
30-Nov-2019 20:51:55 +++ Actual
30-Nov-2019 20:51:55 @@ @@
30-Nov-2019 20:51:55 Array (
30-Nov-2019 20:51:55 -    'user_id' => '1'
30-Nov-2019 20:51:55 -    'user_type' => '0'
30-Nov-2019 20:51:55 -    'group_id' => '3'
30-Nov-2019 20:51:55 +    'user_id' => 1
30-Nov-2019 20:51:55 +    'user_type' => 0
30-Nov-2019 20:51:55 +    'group_id' => 3
30-Nov-2019 20:51:55      'user_permissions' => ''
30-Nov-2019 20:51:55 -    'user_perm_from' => '0'
30-Nov-2019 20:51:55 +    'user_perm_from' => 0
30-Nov-2019 20:51:55      'user_ip' => ''
30-Nov-2019 20:51:55 -    'user_regdate' => '0'
30-Nov-2019 20:51:55 +    'user_regdate' => 0
30-Nov-2019 20:51:55      'username' => 'foobar'
30-Nov-2019 20:51:55      'username_clean' => 'foobar'
30-Nov-2019 20:51:55      'user_password' => '$2y$10$4RmpyVu2y8Yf/lP3.yQBqu...bCGz9i'
30-Nov-2019 20:51:55 -    'user_passchg' => '0'
30-Nov-2019 20:51:55 +    'user_passchg' => 0
30-Nov-2019 20:51:55      'user_email' => 'example@example.com'
30-Nov-2019 20:51:55      'user_birthday' => ''
30-Nov-2019 20:51:55 -    'user_lastvisit' => '0'
30-Nov-2019 20:51:55 -    'user_lastmark' => '0'
30-Nov-2019 20:51:55 -    'user_lastpost_time' => '0'
30-Nov-2019 20:51:55 +    'user_lastvisit' => 0
30-Nov-2019 20:51:55 +    'user_lastmark' => 0
30-Nov-2019 20:51:55 +    'user_lastpost_time' => 0
30-Nov-2019 20:51:55      'user_lastpage' => ''
30-Nov-2019 20:51:55      'user_last_confirm_key' => ''
30-Nov-2019 20:51:55 -    'user_last_search' => '0'
30-Nov-2019 20:51:55 -    'user_warnings' => '0'
30-Nov-2019 20:51:55 -    'user_last_warning' => '0'
30-Nov-2019 20:51:55 -    'user_login_attempts' => '0'
30-Nov-2019 20:51:55 -    'user_inactive_reason' => '0'
30-Nov-2019 20:51:55 -    'user_inactive_time' => '0'
30-Nov-2019 20:51:55 -    'user_posts' => '0'
30-Nov-2019 20:51:55 +    'user_last_search' => 0
30-Nov-2019 20:51:55 +    'user_warnings' => 0
30-Nov-2019 20:51:55 +    'user_last_warning' => 0
30-Nov-2019 20:51:55 +    'user_login_attempts' => 0
30-Nov-2019 20:51:55 +    'user_inactive_reason' => 0
30-Nov-2019 20:51:55 +    'user_inactive_time' => 0
30-Nov-2019 20:51:55 +    'user_posts' => 0
30-Nov-2019 20:51:55      'user_lang' => ''
30-Nov-2019 20:51:55      'user_timezone' => ''
30-Nov-2019 20:51:55      'user_dateformat' => 'd M Y H:i'
30-Nov-2019 20:51:55 -    'user_style' => '0'
30-Nov-2019 20:51:55 -    'user_rank' => '0'
30-Nov-2019 20:51:55 +    'user_style' => 0
30-Nov-2019 20:51:55 +    'user_rank' => 0
30-Nov-2019 20:51:55      'user_colour' => ''
30-Nov-2019 20:51:55 -    'user_new_privmsg' => '0'
30-Nov-2019 20:51:55 -    'user_unread_privmsg' => '0'
30-Nov-2019 20:51:55 -    'user_last_privmsg' => '0'
30-Nov-2019 20:51:55 -    'user_message_rules' => '0'
30-Nov-2019 20:51:55 -    'user_full_folder' => '-3'
30-Nov-2019 20:51:55 -    'user_emailtime' => '0'
30-Nov-2019 20:51:55 -    'user_topic_show_days' => '0'
30-Nov-2019 20:51:55 +    'user_new_privmsg' => 0
30-Nov-2019 20:51:55 +    'user_unread_privmsg' => 0
30-Nov-2019 20:51:55 +    'user_last_privmsg' => 0
30-Nov-2019 20:51:55 +    'user_message_rules' => 0
30-Nov-2019 20:51:55 +    'user_full_folder' => -3
30-Nov-2019 20:51:55 +    'user_emailtime' => 0
30-Nov-2019 20:51:55 +    'user_topic_show_days' => 0
30-Nov-2019 20:51:55      'user_topic_sortby_type' => 't'
30-Nov-2019 20:51:55      'user_topic_sortby_dir' => 'd'
30-Nov-2019 20:51:55 -    'user_post_show_days' => '0'
30-Nov-2019 20:51:55 +    'user_post_show_days' => 0
30-Nov-2019 20:51:55      'user_post_sortby_type' => 't'
30-Nov-2019 20:51:55      'user_post_sortby_dir' => 'a'
30-Nov-2019 20:51:55 -    'user_notify' => '0'
30-Nov-2019 20:51:55 -    'user_notify_pm' => '1'
30-Nov-2019 20:51:55 -    'user_notify_type' => '0'
30-Nov-2019 20:51:55 -    'user_allow_pm' => '1'
30-Nov-2019 20:51:55 -    'user_allow_viewonline' => '1'
30-Nov-2019 20:51:55 -    'user_allow_viewemail' => '1'
30-Nov-2019 20:51:55 -    'user_allow_massemail' => '1'
30-Nov-2019 20:51:55 -    'user_options' => '230271'
30-Nov-2019 20:51:55 +    'user_notify' => 0
30-Nov-2019 20:51:55 +    'user_notify_pm' => 1
30-Nov-2019 20:51:55 +    'user_notify_type' => 0
30-Nov-2019 20:51:55 +    'user_allow_pm' => 1
30-Nov-2019 20:51:55 +    'user_allow_viewonline' => 1
30-Nov-2019 20:51:55 +    'user_allow_viewemail' => 1
30-Nov-2019 20:51:55 +    'user_allow_massemail' => 1
30-Nov-2019 20:51:55 +    'user_options' => 230271
30-Nov-2019 20:51:55      'user_avatar' => ''
30-Nov-2019 20:51:55      'user_avatar_type' => ''
30-Nov-2019 20:51:55 -    'user_avatar_width' => '0'
30-Nov-2019 20:51:55 -    'user_avatar_height' => '0'
30-Nov-2019 20:51:55 +    'user_avatar_width' => 0
30-Nov-2019 20:51:55 +    'user_avatar_height' => 0
30-Nov-2019 20:51:55      'user_sig' => ''
30-Nov-2019 20:51:55      'user_sig_bbcode_uid' => ''
30-Nov-2019 20:51:55      'user_sig_bbcode_bitfield' => ''
30-Nov-2019 20:51:55 @@ @@
30-Nov-2019 20:51:55      'user_actkey' => ''
30-Nov-2019 20:51:55      'user_newpasswd' => ''
30-Nov-2019 20:51:55      'user_form_salt' => ''
30-Nov-2019 20:51:55 -    'user_new' => '1'
30-Nov-2019 20:51:55 -    'user_reminded' => '0'
30-Nov-2019 20:51:55 -    'user_reminded_time' => '0'
30-Nov-2019 20:51:55 +    'user_new' => 1
30-Nov-2019 20:51:55 +    'user_reminded' => 0
30-Nov-2019 20:51:55 +    'user_reminded_time' => 0
30-Nov-2019 20:51:55      'reset_token' => ''
30-Nov-2019 20:51:55 -    'reset_token_expiration' => '0'
30-Nov-2019 20:51:55 +    'reset_token_expiration' => 0
30-Nov-2019 20:51:55 +    'user_email_hash' => 0
30-Nov-2019 20:51:55 )
30-Nov-2019 20:51:55
30-Nov-2019 20:51:55 /data/tests/auth/provider_apache_test.php:181
30-Nov-2019 20:51:55
30-Nov-2019 20:51:55 ERRORS!
30-Nov-2019 20:51:55 Tests: 7244, Assertions: 124340, Errors: 1, Failures: 1, Skipped: 245, Incomplete: 5.
30-Nov-2019 20:51:56 Error occurred while running Task 'Run tests(10)' of type com.atlassian.bamboo.plugins.bamboo-docker-plugin:task.docker.cli.
30-Nov-2019 20:51:56 com.atlassian.bamboo.task.TaskException: Failed to execute task
30-Nov-2019 20:51:56         at com.atlassian.bamboo.plugins.docker.service.RunService.execute(RunService.java:75)
30-Nov-2019 20:51:56         at com.atlassian.bamboo.plugins.docker.tasks.cli.DockerCliTask.execute(DockerCliTask.java:70)
30-Nov-2019 20:51:56         at com.atlassian.bamboo.task.TaskExecutorImpl.lambda$executeTasks$3(TaskExecutorImpl.java:285)
30-Nov-2019 20:51:56         at com.atlassian.bamboo.task.TaskExecutorImpl.executeTaskWithPrePostActions(TaskExecutorImpl.java:224)
30-Nov-2019 20:51:56         at com.atlassian.bamboo.task.TaskExecutorImpl.executeTasks(TaskExecutorImpl.java:285)
30-Nov-2019 20:51:56         at com.atlassian.bamboo.task.TaskExecutorImpl.execute(TaskExecutorImpl.java:112)
30-Nov-2019 20:51:56         at com.atlassian.bamboo.build.pipeline.tasks.ExecuteBuildTask.call(ExecuteBuildTask.java:71)
30-Nov-2019 20:51:56         at com.atlassian.bamboo.v2.build.agent.DefaultBuildAgent.executeBuildPhase(DefaultBuildAgent.java:203)
30-Nov-2019 20:51:56         at com.atlassian.bamboo.v2.build.agent.DefaultBuildAgent.build(DefaultBuildAgent.java:175)
30-Nov-2019 20:51:56         at com.atlassian.bamboo.v2.build.agent.BuildAgentControllerImpl.lambda$waitAndPerformBuild$0(BuildAgentControllerImpl.java:122)
30-Nov-2019 20:51:56         at com.atlassian.bamboo.variable.CustomVariableContextImpl.withVariableSubstitutor(CustomVariableContextImpl.java:185)
30-Nov-2019 20:51:56         at com.atlassian.bamboo.v2.build.agent.BuildAgentControllerImpl.waitAndPerformBuild(BuildAgentControllerImpl.java:117)
30-Nov-2019 20:51:56         at com.atlassian.bamboo.v2.build.agent.DefaultBuildAgent$1.run(DefaultBuildAgent.java:126)
30-Nov-2019 20:51:56         at com.atlassian.bamboo.utils.BambooRunnables$1.run(BambooRunnables.java:48)
30-Nov-2019 20:51:56         at com.atlassian.bamboo.security.ImpersonationHelper.runWith(ImpersonationHelper.java:26)
30-Nov-2019 20:51:56         at com.atlassian.bamboo.security.ImpersonationHelper.runWithSystemAuthority(ImpersonationHelper.java:17)
30-Nov-2019 20:51:56         at com.atlassian.bamboo.security.ImpersonationHelper$1.run(ImpersonationHelper.java:41)
30-Nov-2019 20:51:56         at java.lang.Thread.run(Thread.java:748)
30-Nov-2019 20:51:56 Caused by: com.atlassian.bamboo.docker.DockerException: Error running Docker run command
30-Nov-2019 20:51:56         at com.atlassian.bamboo.docker.DockerContainerServiceImpl.run(DockerContainerServiceImpl.java:118)
30-Nov-2019 20:51:56         at sun.reflect.GeneratedMethodAccessor2260.invoke(Unknown Source)
30-Nov-2019 20:51:56         at sun.reflect.DelegatingMethodAccessorImpl.invoke(DelegatingMethodAccessorImpl.java:43)
30-Nov-2019 20:51:56         at java.lang.reflect.Method.invoke(Method.java:498)
30-Nov-2019 20:51:56         at com.atlassian.plugin.util.ContextClassLoaderSettingInvocationHandler.invoke(ContextClassLoaderSettingInvocationHandler.java:26)
30-Nov-2019 20:51:56         at com.sun.proxy.$Proxy401.run(Unknown Source)
30-Nov-2019 20:51:56         at sun.reflect.GeneratedMethodAccessor2260.invoke(Unknown Source)
30-Nov-2019 20:51:56         at sun.reflect.DelegatingMethodAccessorImpl.invoke(DelegatingMethodAccessorImpl.java:43)
30-Nov-2019 20:51:56         at java.lang.reflect.Method.invoke(Method.java:498)
30-Nov-2019 20:51:56         at org.springframework.aop.support.AopUtils.invokeJoinpointUsingReflection(AopUtils.java:302)
30-Nov-2019 20:51:56         at org.eclipse.gemini.blueprint.service.importer.support.internal.aop.ServiceInvoker.doInvoke(ServiceInvoker.java:56)
30-Nov-2019 20:51:56         at org.eclipse.gemini.blueprint.service.importer.support.internal.aop.ServiceInvoker.invoke(ServiceInvoker.java:60)
30-Nov-2019 20:51:56         at org.springframework.aop.framework.ReflectiveMethodInvocation.proceed(ReflectiveMethodInvocation.java:179)
30-Nov-2019 20:51:56         at org.springframework.aop.support.DelegatingIntroductionInterceptor.doProceed(DelegatingIntroductionInterceptor.java:133)
30-Nov-2019 20:51:56         at org.springframework.aop.support.DelegatingIntroductionInterceptor.invoke(DelegatingIntroductionInterceptor.java:121)
30-Nov-2019 20:51:56         at org.springframework.aop.framework.ReflectiveMethodInvocation.proceed(ReflectiveMethodInvocation.java:179)
30-Nov-2019 20:51:56         at org.eclipse.gemini.blueprint.service.util.internal.aop.ServiceTCCLInterceptor.invokeUnprivileged(ServiceTCCLInterceptor.java:70)
30-Nov-2019 20:51:56         at org.eclipse.gemini.blueprint.service.util.internal.aop.ServiceTCCLInterceptor.invoke(ServiceTCCLInterceptor.java:53)
30-Nov-2019 20:51:56         at org.springframework.aop.framework.ReflectiveMethodInvocation.proceed(ReflectiveMethodInvocation.java:179)
30-Nov-2019 20:51:56         at org.eclipse.gemini.blueprint.service.importer.support.LocalBundleContextAdvice.invoke(LocalBundleContextAdvice.java:57)
30-Nov-2019 20:51:56         at org.springframework.aop.framework.ReflectiveMethodInvocation.proceed(ReflectiveMethodInvocation.java:179)
30-Nov-2019 20:51:56         at org.springframework.aop.support.DelegatingIntroductionInterceptor.doProceed(DelegatingIntroductionInterceptor.java:133)
30-Nov-2019 20:51:56         at org.springframework.aop.support.DelegatingIntroductionInterceptor.invoke(DelegatingIntroductionInterceptor.java:121)
30-Nov-2019 20:51:56         at org.springframework.aop.framework.ReflectiveMethodInvocation.proceed(ReflectiveMethodInvocation.java:179)
30-Nov-2019 20:51:56         at org.springframework.aop.framework.JdkDynamicAopProxy.invoke(JdkDynamicAopProxy.java:207)
30-Nov-2019 20:51:56         at com.sun.proxy.$Proxy662.run(Unknown Source)
30-Nov-2019 20:51:56         at com.atlassian.bamboo.plugins.docker.client.DockerCmd.run(DockerCmd.java:51)
30-Nov-2019 20:51:56         at com.atlassian.bamboo.plugins.docker.service.RunService.execute(RunService.java:64)
30-Nov-2019 20:51:56         ... 17 more
30-Nov-2019 20:51:56 Caused by: com.atlassian.utils.process.ProcessException: Error executing /usr/bin/docker run --volume /home/bamboo/xml-data/build-dir/PHPBB3-PR-JOB1:/data --workdir /data --rm -u=991 -t phpbb:php-7.1 /bin/bash -c "phpBB/vendor/bin/phpunit --log-junit build/logs/phpunit.xml"
30-Nov-2019 20:51:56         at com.atlassian.bamboo.docker.DockerContainerServiceImpl.execute(DockerContainerServiceImpl.java:252)
30-Nov-2019 20:51:56         at com.atlassian.bamboo.docker.DockerContainerServiceImpl.run(DockerContainerServiceImpl.java:106)
30-Nov-2019 20:51:56         ... 44 more
30-Nov-2019 20:51:56 Starting task 'Parsing test results produced by script' of type 'com.atlassian.bamboo.plugins.testresultparser:task.testresultparser.junit'
30-Nov-2019 20:51:56 Parsing test results under /home/bamboo/xml-data/build-dir/PHPBB3-PR-JOB1...
30-Nov-2019 20:51:56 Failing task since 2 failing test cases were found.
30-Nov-2019 20:51:56 Finished task 'Parsing test results produced by script' with result: Failed
30-Nov-2019 20:51:56
Substituting variable: ${bamboo.PRnumber} with 5753
30-Nov-2019 20:51:56
Substituting variable: ${bamboo.buildResultsUrl} with https://bamboo.phpbb.com/browse/PHPBB3-PR-JOB1-9738
30-Nov-2019 20:51:56
Substituting variable: ${bamboo.buildResultsUrl} with https://bamboo.phpbb.com/browse/PHPBB3-PR-JOB1-9738
30-Nov-2019 20:51:56 Starting task 'Set result build status' of type 'com.atlassian.bamboo.plugins.scripttask:task.builder.script'
30-Nov-2019 20:51:56
Beginning to execute external process for build 'phpBB3 - Pull Requests - Build and Test Job #9738 (PHPBB3-PR-JOB1-9738)'
... running command line:
/bin/sh /home/bamboo/temp/PHPBB3-PR-JOB1-9738-ScriptBuildTask-2892630397576724188.sh
... in: /home/bamboo/xml-data/build-dir/PHPBB3-PR-JOB1
... using extra environment variables:
bamboo_planRepository_1_branch=3.1.x
bamboo_planRepository_1_branchDisplayName=3.1.x
bamboo_repository_revision_number=dc8ff9da28b8ab4ad11c7ea94cca526f17c87fe5
bamboo_PRref=master
bamboo_resultsUrl=https://bamboo.phpbb.com/browse/PHPBB3-PR-JOB1-9738
bamboo_capability_system_builder_command_Git=/usr/bin/git
bamboo_repository_75956235_git_username=bantu
bamboo_build_working_directory=/home/bamboo/xml-data/build-dir/PHPBB3-PR-JOB1
bamboo_planRepository_1_name=phpBB Ascraeus
bamboo_buildKey=PHPBB3-PR-JOB1
bamboo_capability_phpbb_tests=true
bamboo_shortPlanName=Pull Requests
bamboo_capability_system_builder_command_fop=/usr/bin/fop
bamboo_capability_dbms_sqlite_2=true
bamboo_planRepository_name=phpBB Ascraeus
bamboo_PRnumber=5753
bamboo_buildNumber=9738
bamboo_repository_75956235_git_repositoryUrl=https://github.com/phpbb/phpbb.git
bamboo_capability_system_builder_phpunit_PHPUnit=/usr/bin/phpunit
bamboo_shortJobName=Build and Test Job
bamboo_buildResultsUrl=https://bamboo.phpbb.com/browse/PHPBB3-PR-JOB1-9738
bamboo_repository_75956235_branch_name=3.1.x
bamboo_planRepository_repositoryUrl=https://github.com/phpbb/phpbb.git
bamboo_agentId=131073
bamboo_planName=phpBB3 - Pull Requests
bamboo_build_commandline_com_atlassian_bamboo_plugins_scripttask_task_builder_script_7=/bin/sh /home/bamboo/temp/PHPBB3-PR-JOB1-9738-ScriptBuildTask-5660838944896039843.sh
bamboo_shortPlanKey=PR
bamboo_shortJobKey=JOB1
bamboo_capability_dbms_mysql_55=true
bamboo_capability_system_jdk_JDK_1_7_0_65=/usr/lib/jvm/java-7-openjdk-amd64
bamboo_planRepository_revision=dc8ff9da28b8ab4ad11c7ea94cca526f17c87fe5
bamboo_buildTimeStamp=2019-11-30T20:46:40.070Z
bamboo_repository_previous_revision_number=dc8ff9da28b8ab4ad11c7ea94cca526f17c87fe5
bamboo_capability_system_jdk_JDK_1_6_0_16=/usr/lib/jvm/java-6-sun-1.6.0.16
bamboo_capability_system_builder_mvn2_Maven_2=/usr/share/maven2
bamboo_planRepository_previousRevision=dc8ff9da28b8ab4ad11c7ea94cca526f17c87fe5
bamboo_build_commandline_com_atlassian_bamboo_plugins_scripttask_task_builder_script_4=/bin/sh /home/bamboo/temp/PHPBB3-PR-JOB1-9738-ScriptBuildTask-7700656022281140120.sh
bamboo_repository_git_branch=3.1.x
bamboo_buildResultKey=PHPBB3-PR-JOB1-9738
bamboo_repository_branch_name=3.1.x
bamboo_buildPlanName=phpBB3 - Pull Requests - Build and Test Job
bamboo_planRepository_1_revision=dc8ff9da28b8ab4ad11c7ea94cca526f17c87fe5
bamboo_repository_name=phpBB Ascraeus
bamboo_buildFailed=true
bamboo_build_commandline_com_atlassian_bamboo_plugins_bamboo_docker_plugin_task_docker_cli_10=/usr/bin/docker run --volume /home/bamboo/xml-data/build-dir/PHPBB3-PR-JOB1:/data --workdir /data --rm -u=991 -t phpbb:php-7.1 /bin/bash -c phpBB/vendor/bin/phpunit --log-junit build/logs/phpunit.xml
bamboo_capability_system_docker_executable=/usr/bin/docker
bamboo_build_commandline_com_atlassian_bamboo_plugins_bamboo_docker_plugin_task_docker_cli_11=/usr/bin/docker run --volume /home/bamboo/xml-data/build-dir/PHPBB3-PR-JOB1:/data --workdir /data/build --rm -u=991 phpbb:php-7.1 ../phpBB/vendor/bin/phing sniff
bamboo_build_commandline_com_atlassian_bamboo_plugins_bamboo_docker_plugin_task_docker_cli_12=/usr/bin/docker run --volume /home/bamboo/xml-data/build-dir/PHPBB3-PR-JOB1:/data --workdir /data/phpBB --rm -e HOME=/home/bamboo -u=991 phpbb:php-7.1 /bin/bash -c php ../composer.phar install --dev; cd ../build; ../phpBB/vendor/bin/phing clean prepare
bamboo_build_commandline_com_atlassian_bamboo_plugins_bamboo_docker_plugin_task_docker_cli_13=/usr/bin/docker build --force-rm=true --tag=phpbb:php-7.1 /home/bamboo/xml-data/build-dir/PHPBB3-PR-JOB1
bamboo_planRepository_branch=3.1.x
bamboo_agentWorkingDirectory=/home/bamboo/xml-data/build-dir
bamboo_jobFailed=true
bamboo_capability_system_git_executable=/usr/bin/git
bamboo_capability_system_builder_phpunit_PHPUnit_3_4=/usr/bin/phpunit
bamboo_repository_git_username=bantu
bamboo_planRepository_1_previousRevision=dc8ff9da28b8ab4ad11c7ea94cca526f17c87fe5
bamboo_repository_75956235_revision_number=dc8ff9da28b8ab4ad11c7ea94cca526f17c87fe5
bamboo_planRepository_branchDisplayName=3.1.x
bamboo_planRepository_1_type=gitv2
bamboo_planRepository_branchName=3.1.x
bamboo_repository_75956235_previous_revision_number=dc8ff9da28b8ab4ad11c7ea94cca526f17c87fe5
bamboo_capability_system_jdk_JDK=/usr/lib/jvm/java-6-sun
bamboo_plan_storageTag=PHPBB3-PR
bamboo_hg_cache_directory=/home/bamboo/xml-data/build-dir/_hg-repositories-cache
bamboo_planRepository_1_username=bantu
bamboo_planRepository_type=gitv2
bamboo_git_cache_directory=/home/bamboo/xml-data/build-dir/_git-repositories-cache
bamboo_ManualBuildTriggerReason_userName=Build Robot
bamboo_repository_git_repositoryUrl=https://github.com/phpbb/phpbb.git
bamboo_repository_75956235_git_branch=3.1.x
bamboo_capability_system_builder_ant_Ant=/usr/share/ant
bamboo_repository_75956235_name=phpBB Ascraeus
bamboo_tmp_directory=/home/bamboo/temp
bamboo_working_directory=/home/bamboo/xml-data/build-dir/PHPBB3-PR-JOB1
bamboo_planKey=PHPBB3-PR
bamboo_capability_local=true
bamboo_planRepository_1_repositoryUrl=https://github.com/phpbb/phpbb.git
bamboo_planRepository_username=bantu
bamboo_capability_system_jdk_JDK_1_6=/usr/lib/jvm/java-6-sun
bamboo_capability_system_jdk_JDK_1_7=/usr/lib/jvm/java-7-openjdk-amd64
bamboo_planRepository_1_branchName=3.1.x
30-Nov-2019 20:51:57 From https://github.com/phpbb/phpbb
30-Nov-2019 20:51:57 * branch            refs/pull/5753/head -> FETCH_HEAD
30-Nov-2019 20:51:57   <testsuite name="" tests="7193" assertions="124340" errors="1" failures="1" skipped="250" time="166.530933">
30-Nov-2019 20:51:57     <testsuite name="phpBB Test Suite" tests="5367" assertions="122732" errors="1" failures="1" skipped="32" time="111.772313">
30-Nov-2019 20:51:57       <testsuite name="phpbb_auth_provider_apache_test" file="/data/tests/auth/provider_apache_test.php" tests="4" assertions="7" errors="0" failures="1" skipped="0" time="0.156079">
30-Nov-2019 20:51:57   % Total    % Received % Xferd  Average Speed   Time    Time     Time  Current
30-Nov-2019 20:51:57                                  Dload  Upload   Total   Spent    Left  Speed
30-Nov-2019 20:51:57
30-Nov-2019 20:51:57   0     0    0     0    0     0      0      0 --:--:-- --:--:-- --:--:--     0
30-Nov-2019 20:51:57 100   267  100    93  100   174    187    351 --:--:-- --:--:-- --:--:--   351
30-Nov-2019 20:51:57 Finished task 'Set result build status' with result: Success
30-Nov-2019 20:51:57 Running post build plugin 'NCover Results Collector'
30-Nov-2019 20:51:57 Running post build plugin 'Artifact Copier'
30-Nov-2019 20:51:57 Running post build plugin 'npm Cache Cleanup'
30-Nov-2019 20:51:57 Running post build plugin 'Clover Results Collector'
30-Nov-2019 20:51:57 Running post build plugin 'Docker Container Cleanup'
30-Nov-2019 20:51:58 Successfully removed working directory at '/home/bamboo/xml-data/build-dir/PHPBB3-PR-JOB1'
30-Nov-2019 20:51:58 Finalising the build...
30-Nov-2019 20:51:58 Stopping timer.
30-Nov-2019 20:51:58 Build PHPBB3-PR-JOB1-9738 completed.
30-Nov-2019 20:51:58 Running on server: post build plugin 'NCover Results Collector'
30-Nov-2019 20:51:58 Running on server: post build plugin 'Build Hanging Detection Configuration'
30-Nov-2019 20:51:58 Running on server: post build plugin 'Clover Delta Calculator'
30-Nov-2019 20:51:58 Running on server: post build plugin 'Maven Dependencies Postprocessor'
30-Nov-2019 20:51:58 All post build plugins have finished
30-Nov-2019 20:51:58 Generating build results summary...
30-Nov-2019 20:52:05 Saving build results to disk...
30-Nov-2019 20:52:05 Logging substituted variables...
30-Nov-2019 20:52:06 Indexing build results...
30-Nov-2019 20:52:06 Finished building PHPBB3-PR-JOB1-9738.
30-Nov-2019 20:52:06
Substituting variable: ${bamboo.PRnumber} with 5753