Tests pending pull requests

Build: #9838 failed

Job: Build and Test Job failed

Stages & jobs

  1. Build and Test

Build log

The build generated 5,673 lines of output.The output is too long and has been truncated to the last 1,000 lines. Download or view full build log

26-Jan-2020 15:58:04 #4 /data/phpBB/vendor/phpunit/phpunit/src/Framework/TestSuite.php(746): PHPUnit\Framework\TestSuite->run(Object(PHPUnit\Framework\TestResult))
26-Jan-2020 15:58:04 #5 /data/phpBB/vendor/phpunit/phpunit/src/Framework/TestSuite.php(746): PHPUnit\Framework\TestSuite->run(Object(PHPUnit\Framework\TestResult))
26-Jan-2020 15:58:04 #6 /data/phpBB/vendor/phpunit/phpunit/src/TextUI/TestRunner.php(652): PHPUnit\Framework\TestSuite->run(Object(PHPUnit\Framework\TestResult))
26-Jan-2020 15:58:04 #7 /data/phpBB/vendor/phpunit/phpunit/src/TextUI/Command.php(206): PHPUnit\TextUI\TestRunner->doRun(Object(PHPUnit\Framework\TestSuite), Array, true)
26-Jan-2020 15:58:04 #8 /data/phpBB/vendor/phpunit/phpunit/src/TextUI/Command.php(162): PHPUnit\TextUI\Command->run(Array, true)
26-Jan-2020 15:58:04 #9 /data/phpBB/vendor/phpunit/phpunit/phpunit(61): PHPUnit\TextUI\Command::main()
26-Jan-2020 15:58:04 #10 {main}
26-Jan-2020 15:58:04 308) phpbb_textformatter_s9e_factory_test::test_configure_events
26-Jan-2020 15:58:04 Error: Call to a member function getName() on null in /data/phpBB/phpbb/db/driver/doctrine.php:71
26-Jan-2020 15:58:04 Stack trace:
26-Jan-2020 15:58:04 #0 /data/phpBB/phpbb/db/tools/tools.php(167): phpbb\db\driver\doctrine->get_sql_layer()
26-Jan-2020 15:58:04 #1 /data/phpBB/phpbb/db/tools/factory.php(38): phpbb\db\tools\tools->__construct(Object(phpbb\db\driver\sqlite3), true)
26-Jan-2020 15:58:04 #2 /data/tests/test_framework/phpbb_database_test_case.php(82): phpbb\db\tools\factory->get(Object(phpbb\db\driver\sqlite3), true)
26-Jan-2020 15:58:04 #3 /data/phpBB/vendor/phpunit/phpunit/src/Framework/TestSuite.php(703): phpbb_database_test_case::setUpBeforeClass()
26-Jan-2020 15:58:04 #4 /data/phpBB/vendor/phpunit/phpunit/src/Framework/TestSuite.php(746): PHPUnit\Framework\TestSuite->run(Object(PHPUnit\Framework\TestResult))
26-Jan-2020 15:58:04 #5 /data/phpBB/vendor/phpunit/phpunit/src/Framework/TestSuite.php(746): PHPUnit\Framework\TestSuite->run(Object(PHPUnit\Framework\TestResult))
26-Jan-2020 15:58:04 #6 /data/phpBB/vendor/phpunit/phpunit/src/TextUI/TestRunner.php(652): PHPUnit\Framework\TestSuite->run(Object(PHPUnit\Framework\TestResult))
26-Jan-2020 15:58:04 #7 /data/phpBB/vendor/phpunit/phpunit/src/TextUI/Command.php(206): PHPUnit\TextUI\TestRunner->doRun(Object(PHPUnit\Framework\TestSuite), Array, true)
26-Jan-2020 15:58:04 #8 /data/phpBB/vendor/phpunit/phpunit/src/TextUI/Command.php(162): PHPUnit\TextUI\Command->run(Array, true)
26-Jan-2020 15:58:04 #9 /data/phpBB/vendor/phpunit/phpunit/phpunit(61): PHPUnit\TextUI\Command::main()
26-Jan-2020 15:58:04 #10 {main}
26-Jan-2020 15:58:04 309) phpbb_textreparser_base_test::test_reparse_empty
26-Jan-2020 15:58:04 Error: Call to a member function getName() on null in /data/phpBB/phpbb/db/driver/doctrine.php:71
26-Jan-2020 15:58:04 Stack trace:
26-Jan-2020 15:58:04 #0 /data/phpBB/phpbb/db/tools/tools.php(167): phpbb\db\driver\doctrine->get_sql_layer()
26-Jan-2020 15:58:04 #1 /data/phpBB/phpbb/db/tools/factory.php(38): phpbb\db\tools\tools->__construct(Object(phpbb\db\driver\sqlite3), true)
26-Jan-2020 15:58:04 #2 /data/tests/test_framework/phpbb_database_test_case.php(82): phpbb\db\tools\factory->get(Object(phpbb\db\driver\sqlite3), true)
26-Jan-2020 15:58:04 #3 /data/phpBB/vendor/phpunit/phpunit/src/Framework/TestSuite.php(703): phpbb_database_test_case::setUpBeforeClass()
26-Jan-2020 15:58:04 #4 /data/phpBB/vendor/phpunit/phpunit/src/Framework/TestSuite.php(746): PHPUnit\Framework\TestSuite->run(Object(PHPUnit\Framework\TestResult))
26-Jan-2020 15:58:04 #5 /data/phpBB/vendor/phpunit/phpunit/src/Framework/TestSuite.php(746): PHPUnit\Framework\TestSuite->run(Object(PHPUnit\Framework\TestResult))
26-Jan-2020 15:58:04 #6 /data/phpBB/vendor/phpunit/phpunit/src/TextUI/TestRunner.php(652): PHPUnit\Framework\TestSuite->run(Object(PHPUnit\Framework\TestResult))
26-Jan-2020 15:58:04 #7 /data/phpBB/vendor/phpunit/phpunit/src/TextUI/Command.php(206): PHPUnit\TextUI\TestRunner->doRun(Object(PHPUnit\Framework\TestSuite), Array, true)
26-Jan-2020 15:58:04 #8 /data/phpBB/vendor/phpunit/phpunit/src/TextUI/Command.php(162): PHPUnit\TextUI\Command->run(Array, true)
26-Jan-2020 15:58:04 #9 /data/phpBB/vendor/phpunit/phpunit/phpunit(61): PHPUnit\TextUI\Command::main()
26-Jan-2020 15:58:04 #10 {main}
26-Jan-2020 15:58:04 310) phpbb_textreparser_base_test::test_reparse_case_insensitive
26-Jan-2020 15:58:04 Error: Call to a member function getName() on null in /data/phpBB/phpbb/db/driver/doctrine.php:71
26-Jan-2020 15:58:04 Stack trace:
26-Jan-2020 15:58:04 #0 /data/phpBB/phpbb/db/tools/tools.php(167): phpbb\db\driver\doctrine->get_sql_layer()
26-Jan-2020 15:58:04 #1 /data/phpBB/phpbb/db/tools/factory.php(38): phpbb\db\tools\tools->__construct(Object(phpbb\db\driver\sqlite3), true)
26-Jan-2020 15:58:04 #2 /data/tests/test_framework/phpbb_database_test_case.php(82): phpbb\db\tools\factory->get(Object(phpbb\db\driver\sqlite3), true)
26-Jan-2020 15:58:04 #3 /data/phpBB/vendor/phpunit/phpunit/src/Framework/TestSuite.php(703): phpbb_database_test_case::setUpBeforeClass()
26-Jan-2020 15:58:04 #4 /data/phpBB/vendor/phpunit/phpunit/src/Framework/TestSuite.php(746): PHPUnit\Framework\TestSuite->run(Object(PHPUnit\Framework\TestResult))
26-Jan-2020 15:58:04 #5 /data/phpBB/vendor/phpunit/phpunit/src/Framework/TestSuite.php(746): PHPUnit\Framework\TestSuite->run(Object(PHPUnit\Framework\TestResult))
26-Jan-2020 15:58:04 #6 /data/phpBB/vendor/phpunit/phpunit/src/TextUI/TestRunner.php(652): PHPUnit\Framework\TestSuite->run(Object(PHPUnit\Framework\TestResult))
26-Jan-2020 15:58:04 #7 /data/phpBB/vendor/phpunit/phpunit/src/TextUI/Command.php(206): PHPUnit\TextUI\TestRunner->doRun(Object(PHPUnit\Framework\TestSuite), Array, true)
26-Jan-2020 15:58:04 #8 /data/phpBB/vendor/phpunit/phpunit/src/TextUI/Command.php(162): PHPUnit\TextUI\Command->run(Array, true)
26-Jan-2020 15:58:04 #9 /data/phpBB/vendor/phpunit/phpunit/phpunit(61): PHPUnit\TextUI\Command::main()
26-Jan-2020 15:58:04 #10 {main}
26-Jan-2020 15:58:04 311) phpbb_text_reparser_manager_test::test_get_resume_data
26-Jan-2020 15:58:04 Error: Call to a member function getName() on null in /data/phpBB/phpbb/db/driver/doctrine.php:71
26-Jan-2020 15:58:04 Stack trace:
26-Jan-2020 15:58:04 #0 /data/phpBB/phpbb/db/tools/tools.php(167): phpbb\db\driver\doctrine->get_sql_layer()
26-Jan-2020 15:58:04 #1 /data/phpBB/phpbb/db/tools/factory.php(38): phpbb\db\tools\tools->__construct(Object(phpbb\db\driver\sqlite3), true)
26-Jan-2020 15:58:04 #2 /data/tests/test_framework/phpbb_database_test_case.php(82): phpbb\db\tools\factory->get(Object(phpbb\db\driver\sqlite3), true)
26-Jan-2020 15:58:04 #3 /data/phpBB/vendor/phpunit/phpunit/src/Framework/TestSuite.php(703): phpbb_database_test_case::setUpBeforeClass()
26-Jan-2020 15:58:04 #4 /data/phpBB/vendor/phpunit/phpunit/src/Framework/TestSuite.php(746): PHPUnit\Framework\TestSuite->run(Object(PHPUnit\Framework\TestResult))
26-Jan-2020 15:58:04 #5 /data/phpBB/vendor/phpunit/phpunit/src/Framework/TestSuite.php(746): PHPUnit\Framework\TestSuite->run(Object(PHPUnit\Framework\TestResult))
26-Jan-2020 15:58:04 #6 /data/phpBB/vendor/phpunit/phpunit/src/TextUI/TestRunner.php(652): PHPUnit\Framework\TestSuite->run(Object(PHPUnit\Framework\TestResult))
26-Jan-2020 15:58:04 #7 /data/phpBB/vendor/phpunit/phpunit/src/TextUI/Command.php(206): PHPUnit\TextUI\TestRunner->doRun(Object(PHPUnit\Framework\TestSuite), Array, true)
26-Jan-2020 15:58:04 #8 /data/phpBB/vendor/phpunit/phpunit/src/TextUI/Command.php(162): PHPUnit\TextUI\Command->run(Array, true)
26-Jan-2020 15:58:04 #9 /data/phpBB/vendor/phpunit/phpunit/phpunit(61): PHPUnit\TextUI\Command::main()
26-Jan-2020 15:58:04 #10 {main}
26-Jan-2020 15:58:04 312) phpbb_text_reparser_manager_test::test_update_resume_data
26-Jan-2020 15:58:04 Error: Call to a member function getName() on null in /data/phpBB/phpbb/db/driver/doctrine.php:71
26-Jan-2020 15:58:04 Stack trace:
26-Jan-2020 15:58:04 #0 /data/phpBB/phpbb/db/tools/tools.php(167): phpbb\db\driver\doctrine->get_sql_layer()
26-Jan-2020 15:58:04 #1 /data/phpBB/phpbb/db/tools/factory.php(38): phpbb\db\tools\tools->__construct(Object(phpbb\db\driver\sqlite3), true)
26-Jan-2020 15:58:04 #2 /data/tests/test_framework/phpbb_database_test_case.php(82): phpbb\db\tools\factory->get(Object(phpbb\db\driver\sqlite3), true)
26-Jan-2020 15:58:04 #3 /data/phpBB/vendor/phpunit/phpunit/src/Framework/TestSuite.php(703): phpbb_database_test_case::setUpBeforeClass()
26-Jan-2020 15:58:04 #4 /data/phpBB/vendor/phpunit/phpunit/src/Framework/TestSuite.php(746): PHPUnit\Framework\TestSuite->run(Object(PHPUnit\Framework\TestResult))
26-Jan-2020 15:58:04 #5 /data/phpBB/vendor/phpunit/phpunit/src/Framework/TestSuite.php(746): PHPUnit\Framework\TestSuite->run(Object(PHPUnit\Framework\TestResult))
26-Jan-2020 15:58:04 #6 /data/phpBB/vendor/phpunit/phpunit/src/TextUI/TestRunner.php(652): PHPUnit\Framework\TestSuite->run(Object(PHPUnit\Framework\TestResult))
26-Jan-2020 15:58:04 #7 /data/phpBB/vendor/phpunit/phpunit/src/TextUI/Command.php(206): PHPUnit\TextUI\TestRunner->doRun(Object(PHPUnit\Framework\TestSuite), Array, true)
26-Jan-2020 15:58:04 #8 /data/phpBB/vendor/phpunit/phpunit/src/TextUI/Command.php(162): PHPUnit\TextUI\Command->run(Array, true)
26-Jan-2020 15:58:04 #9 /data/phpBB/vendor/phpunit/phpunit/phpunit(61): PHPUnit\TextUI\Command::main()
26-Jan-2020 15:58:04 #10 {main}
26-Jan-2020 15:58:04 313) phpbb_text_reparser_manager_test::test_schedule
26-Jan-2020 15:58:04 Error: Call to a member function getName() on null in /data/phpBB/phpbb/db/driver/doctrine.php:71
26-Jan-2020 15:58:04 Stack trace:
26-Jan-2020 15:58:04 #0 /data/phpBB/phpbb/db/tools/tools.php(167): phpbb\db\driver\doctrine->get_sql_layer()
26-Jan-2020 15:58:04 #1 /data/phpBB/phpbb/db/tools/factory.php(38): phpbb\db\tools\tools->__construct(Object(phpbb\db\driver\sqlite3), true)
26-Jan-2020 15:58:04 #2 /data/tests/test_framework/phpbb_database_test_case.php(82): phpbb\db\tools\factory->get(Object(phpbb\db\driver\sqlite3), true)
26-Jan-2020 15:58:04 #3 /data/phpBB/vendor/phpunit/phpunit/src/Framework/TestSuite.php(703): phpbb_database_test_case::setUpBeforeClass()
26-Jan-2020 15:58:04 #4 /data/phpBB/vendor/phpunit/phpunit/src/Framework/TestSuite.php(746): PHPUnit\Framework\TestSuite->run(Object(PHPUnit\Framework\TestResult))
26-Jan-2020 15:58:04 #5 /data/phpBB/vendor/phpunit/phpunit/src/Framework/TestSuite.php(746): PHPUnit\Framework\TestSuite->run(Object(PHPUnit\Framework\TestResult))
26-Jan-2020 15:58:04 #6 /data/phpBB/vendor/phpunit/phpunit/src/TextUI/TestRunner.php(652): PHPUnit\Framework\TestSuite->run(Object(PHPUnit\Framework\TestResult))
26-Jan-2020 15:58:04 #7 /data/phpBB/vendor/phpunit/phpunit/src/TextUI/Command.php(206): PHPUnit\TextUI\TestRunner->doRun(Object(PHPUnit\Framework\TestSuite), Array, true)
26-Jan-2020 15:58:04 #8 /data/phpBB/vendor/phpunit/phpunit/src/TextUI/Command.php(162): PHPUnit\TextUI\Command->run(Array, true)
26-Jan-2020 15:58:04 #9 /data/phpBB/vendor/phpunit/phpunit/phpunit(61): PHPUnit\TextUI\Command::main()
26-Jan-2020 15:58:04 #10 {main}
26-Jan-2020 15:58:04 314) phpbb_text_reparser_manager_test::test_schedule_all
26-Jan-2020 15:58:04 Error: Call to a member function getName() on null in /data/phpBB/phpbb/db/driver/doctrine.php:71
26-Jan-2020 15:58:04 Stack trace:
26-Jan-2020 15:58:04 #0 /data/phpBB/phpbb/db/tools/tools.php(167): phpbb\db\driver\doctrine->get_sql_layer()
26-Jan-2020 15:58:04 #1 /data/phpBB/phpbb/db/tools/factory.php(38): phpbb\db\tools\tools->__construct(Object(phpbb\db\driver\sqlite3), true)
26-Jan-2020 15:58:04 #2 /data/tests/test_framework/phpbb_database_test_case.php(82): phpbb\db\tools\factory->get(Object(phpbb\db\driver\sqlite3), true)
26-Jan-2020 15:58:04 #3 /data/phpBB/vendor/phpunit/phpunit/src/Framework/TestSuite.php(703): phpbb_database_test_case::setUpBeforeClass()
26-Jan-2020 15:58:04 #4 /data/phpBB/vendor/phpunit/phpunit/src/Framework/TestSuite.php(746): PHPUnit\Framework\TestSuite->run(Object(PHPUnit\Framework\TestResult))
26-Jan-2020 15:58:04 #5 /data/phpBB/vendor/phpunit/phpunit/src/Framework/TestSuite.php(746): PHPUnit\Framework\TestSuite->run(Object(PHPUnit\Framework\TestResult))
26-Jan-2020 15:58:04 #6 /data/phpBB/vendor/phpunit/phpunit/src/TextUI/TestRunner.php(652): PHPUnit\Framework\TestSuite->run(Object(PHPUnit\Framework\TestResult))
26-Jan-2020 15:58:04 #7 /data/phpBB/vendor/phpunit/phpunit/src/TextUI/Command.php(206): PHPUnit\TextUI\TestRunner->doRun(Object(PHPUnit\Framework\TestSuite), Array, true)
26-Jan-2020 15:58:04 #8 /data/phpBB/vendor/phpunit/phpunit/src/TextUI/Command.php(162): PHPUnit\TextUI\Command->run(Array, true)
26-Jan-2020 15:58:04 #9 /data/phpBB/vendor/phpunit/phpunit/phpunit(61): PHPUnit\TextUI\Command::main()
26-Jan-2020 15:58:04 #10 {main}
26-Jan-2020 15:58:04 315) phpbb_textreparser_contact_admin_info_test::test_get_max_id
26-Jan-2020 15:58:04 Error: Call to a member function getName() on null in /data/phpBB/phpbb/db/driver/doctrine.php:71
26-Jan-2020 15:58:04 Stack trace:
26-Jan-2020 15:58:04 #0 /data/phpBB/phpbb/db/tools/tools.php(167): phpbb\db\driver\doctrine->get_sql_layer()
26-Jan-2020 15:58:04 #1 /data/phpBB/phpbb/db/tools/factory.php(38): phpbb\db\tools\tools->__construct(Object(phpbb\db\driver\sqlite3), true)
26-Jan-2020 15:58:04 #2 /data/tests/test_framework/phpbb_database_test_case.php(82): phpbb\db\tools\factory->get(Object(phpbb\db\driver\sqlite3), true)
26-Jan-2020 15:58:04 #3 /data/phpBB/vendor/phpunit/phpunit/src/Framework/TestSuite.php(703): phpbb_database_test_case::setUpBeforeClass()
26-Jan-2020 15:58:04 #4 /data/phpBB/vendor/phpunit/phpunit/src/Framework/TestSuite.php(746): PHPUnit\Framework\TestSuite->run(Object(PHPUnit\Framework\TestResult))
26-Jan-2020 15:58:04 #5 /data/phpBB/vendor/phpunit/phpunit/src/Framework/TestSuite.php(746): PHPUnit\Framework\TestSuite->run(Object(PHPUnit\Framework\TestResult))
26-Jan-2020 15:58:04 #6 /data/phpBB/vendor/phpunit/phpunit/src/TextUI/TestRunner.php(652): PHPUnit\Framework\TestSuite->run(Object(PHPUnit\Framework\TestResult))
26-Jan-2020 15:58:04 #7 /data/phpBB/vendor/phpunit/phpunit/src/TextUI/Command.php(206): PHPUnit\TextUI\TestRunner->doRun(Object(PHPUnit\Framework\TestSuite), Array, true)
26-Jan-2020 15:58:04 #8 /data/phpBB/vendor/phpunit/phpunit/src/TextUI/Command.php(162): PHPUnit\TextUI\Command->run(Array, true)
26-Jan-2020 15:58:04 #9 /data/phpBB/vendor/phpunit/phpunit/phpunit(61): PHPUnit\TextUI\Command::main()
26-Jan-2020 15:58:04 #10 {main}
26-Jan-2020 15:58:04 316) phpbb_textreparser_contact_admin_info_test::test_dry_run
26-Jan-2020 15:58:04 Error: Call to a member function getName() on null in /data/phpBB/phpbb/db/driver/doctrine.php:71
26-Jan-2020 15:58:04 Stack trace:
26-Jan-2020 15:58:04 #0 /data/phpBB/phpbb/db/tools/tools.php(167): phpbb\db\driver\doctrine->get_sql_layer()
26-Jan-2020 15:58:04 #1 /data/phpBB/phpbb/db/tools/factory.php(38): phpbb\db\tools\tools->__construct(Object(phpbb\db\driver\sqlite3), true)
26-Jan-2020 15:58:04 #2 /data/tests/test_framework/phpbb_database_test_case.php(82): phpbb\db\tools\factory->get(Object(phpbb\db\driver\sqlite3), true)
26-Jan-2020 15:58:04 #3 /data/phpBB/vendor/phpunit/phpunit/src/Framework/TestSuite.php(703): phpbb_database_test_case::setUpBeforeClass()
26-Jan-2020 15:58:04 #4 /data/phpBB/vendor/phpunit/phpunit/src/Framework/TestSuite.php(746): PHPUnit\Framework\TestSuite->run(Object(PHPUnit\Framework\TestResult))
26-Jan-2020 15:58:04 #5 /data/phpBB/vendor/phpunit/phpunit/src/Framework/TestSuite.php(746): PHPUnit\Framework\TestSuite->run(Object(PHPUnit\Framework\TestResult))
26-Jan-2020 15:58:04 #6 /data/phpBB/vendor/phpunit/phpunit/src/TextUI/TestRunner.php(652): PHPUnit\Framework\TestSuite->run(Object(PHPUnit\Framework\TestResult))
26-Jan-2020 15:58:04 #7 /data/phpBB/vendor/phpunit/phpunit/src/TextUI/Command.php(206): PHPUnit\TextUI\TestRunner->doRun(Object(PHPUnit\Framework\TestSuite), Array, true)
26-Jan-2020 15:58:04 #8 /data/phpBB/vendor/phpunit/phpunit/src/TextUI/Command.php(162): PHPUnit\TextUI\Command->run(Array, true)
26-Jan-2020 15:58:04 #9 /data/phpBB/vendor/phpunit/phpunit/phpunit(61): PHPUnit\TextUI\Command::main()
26-Jan-2020 15:58:04 #10 {main}
26-Jan-2020 15:58:04 317) phpbb_textreparser_contact_admin_info_test::test_reparse
26-Jan-2020 15:58:04 Error: Call to a member function getName() on null in /data/phpBB/phpbb/db/driver/doctrine.php:71
26-Jan-2020 15:58:04 Stack trace:
26-Jan-2020 15:58:04 #0 /data/phpBB/phpbb/db/tools/tools.php(167): phpbb\db\driver\doctrine->get_sql_layer()
26-Jan-2020 15:58:04 #1 /data/phpBB/phpbb/db/tools/factory.php(38): phpbb\db\tools\tools->__construct(Object(phpbb\db\driver\sqlite3), true)
26-Jan-2020 15:58:04 #2 /data/tests/test_framework/phpbb_database_test_case.php(82): phpbb\db\tools\factory->get(Object(phpbb\db\driver\sqlite3), true)
26-Jan-2020 15:58:04 #3 /data/phpBB/vendor/phpunit/phpunit/src/Framework/TestSuite.php(703): phpbb_database_test_case::setUpBeforeClass()
26-Jan-2020 15:58:04 #4 /data/phpBB/vendor/phpunit/phpunit/src/Framework/TestSuite.php(746): PHPUnit\Framework\TestSuite->run(Object(PHPUnit\Framework\TestResult))
26-Jan-2020 15:58:04 #5 /data/phpBB/vendor/phpunit/phpunit/src/Framework/TestSuite.php(746): PHPUnit\Framework\TestSuite->run(Object(PHPUnit\Framework\TestResult))
26-Jan-2020 15:58:04 #6 /data/phpBB/vendor/phpunit/phpunit/src/TextUI/TestRunner.php(652): PHPUnit\Framework\TestSuite->run(Object(PHPUnit\Framework\TestResult))
26-Jan-2020 15:58:04 #7 /data/phpBB/vendor/phpunit/phpunit/src/TextUI/Command.php(206): PHPUnit\TextUI\TestRunner->doRun(Object(PHPUnit\Framework\TestSuite), Array, true)
26-Jan-2020 15:58:04 #8 /data/phpBB/vendor/phpunit/phpunit/src/TextUI/Command.php(162): PHPUnit\TextUI\Command->run(Array, true)
26-Jan-2020 15:58:04 #9 /data/phpBB/vendor/phpunit/phpunit/phpunit(61): PHPUnit\TextUI\Command::main()
26-Jan-2020 15:58:04 #10 {main}
26-Jan-2020 15:58:04 318) phpbb_textreparser_forum_description_test::test_get_max_id
26-Jan-2020 15:58:04 Error: Call to a member function getName() on null in /data/phpBB/phpbb/db/driver/doctrine.php:71
26-Jan-2020 15:58:04 Stack trace:
26-Jan-2020 15:58:04 #0 /data/phpBB/phpbb/db/tools/tools.php(167): phpbb\db\driver\doctrine->get_sql_layer()
26-Jan-2020 15:58:04 #1 /data/phpBB/phpbb/db/tools/factory.php(38): phpbb\db\tools\tools->__construct(Object(phpbb\db\driver\sqlite3), true)
26-Jan-2020 15:58:04 #2 /data/tests/test_framework/phpbb_database_test_case.php(82): phpbb\db\tools\factory->get(Object(phpbb\db\driver\sqlite3), true)
26-Jan-2020 15:58:04 #3 /data/phpBB/vendor/phpunit/phpunit/src/Framework/TestSuite.php(703): phpbb_database_test_case::setUpBeforeClass()
26-Jan-2020 15:58:04 #4 /data/phpBB/vendor/phpunit/phpunit/src/Framework/TestSuite.php(746): PHPUnit\Framework\TestSuite->run(Object(PHPUnit\Framework\TestResult))
26-Jan-2020 15:58:04 #5 /data/phpBB/vendor/phpunit/phpunit/src/Framework/TestSuite.php(746): PHPUnit\Framework\TestSuite->run(Object(PHPUnit\Framework\TestResult))
26-Jan-2020 15:58:04 #6 /data/phpBB/vendor/phpunit/phpunit/src/TextUI/TestRunner.php(652): PHPUnit\Framework\TestSuite->run(Object(PHPUnit\Framework\TestResult))
26-Jan-2020 15:58:04 #7 /data/phpBB/vendor/phpunit/phpunit/src/TextUI/Command.php(206): PHPUnit\TextUI\TestRunner->doRun(Object(PHPUnit\Framework\TestSuite), Array, true)
26-Jan-2020 15:58:04 #8 /data/phpBB/vendor/phpunit/phpunit/src/TextUI/Command.php(162): PHPUnit\TextUI\Command->run(Array, true)
26-Jan-2020 15:58:04 #9 /data/phpBB/vendor/phpunit/phpunit/phpunit(61): PHPUnit\TextUI\Command::main()
26-Jan-2020 15:58:04 #10 {main}
26-Jan-2020 15:58:04 319) phpbb_textreparser_forum_description_test::test_dry_run
26-Jan-2020 15:58:04 Error: Call to a member function getName() on null in /data/phpBB/phpbb/db/driver/doctrine.php:71
26-Jan-2020 15:58:04 Stack trace:
26-Jan-2020 15:58:04 #0 /data/phpBB/phpbb/db/tools/tools.php(167): phpbb\db\driver\doctrine->get_sql_layer()
26-Jan-2020 15:58:04 #1 /data/phpBB/phpbb/db/tools/factory.php(38): phpbb\db\tools\tools->__construct(Object(phpbb\db\driver\sqlite3), true)
26-Jan-2020 15:58:04 #2 /data/tests/test_framework/phpbb_database_test_case.php(82): phpbb\db\tools\factory->get(Object(phpbb\db\driver\sqlite3), true)
26-Jan-2020 15:58:04 #3 /data/phpBB/vendor/phpunit/phpunit/src/Framework/TestSuite.php(703): phpbb_database_test_case::setUpBeforeClass()
26-Jan-2020 15:58:04 #4 /data/phpBB/vendor/phpunit/phpunit/src/Framework/TestSuite.php(746): PHPUnit\Framework\TestSuite->run(Object(PHPUnit\Framework\TestResult))
26-Jan-2020 15:58:04 #5 /data/phpBB/vendor/phpunit/phpunit/src/Framework/TestSuite.php(746): PHPUnit\Framework\TestSuite->run(Object(PHPUnit\Framework\TestResult))
26-Jan-2020 15:58:04 #6 /data/phpBB/vendor/phpunit/phpunit/src/TextUI/TestRunner.php(652): PHPUnit\Framework\TestSuite->run(Object(PHPUnit\Framework\TestResult))
26-Jan-2020 15:58:04 #7 /data/phpBB/vendor/phpunit/phpunit/src/TextUI/Command.php(206): PHPUnit\TextUI\TestRunner->doRun(Object(PHPUnit\Framework\TestSuite), Array, true)
26-Jan-2020 15:58:04 #8 /data/phpBB/vendor/phpunit/phpunit/src/TextUI/Command.php(162): PHPUnit\TextUI\Command->run(Array, true)
26-Jan-2020 15:58:04 #9 /data/phpBB/vendor/phpunit/phpunit/phpunit(61): PHPUnit\TextUI\Command::main()
26-Jan-2020 15:58:04 #10 {main}
26-Jan-2020 15:58:04 320) phpbb_textreparser_forum_description_test::test_reparse
26-Jan-2020 15:58:04 Error: Call to a member function getName() on null in /data/phpBB/phpbb/db/driver/doctrine.php:71
26-Jan-2020 15:58:04 Stack trace:
26-Jan-2020 15:58:04 #0 /data/phpBB/phpbb/db/tools/tools.php(167): phpbb\db\driver\doctrine->get_sql_layer()
26-Jan-2020 15:58:04 #1 /data/phpBB/phpbb/db/tools/factory.php(38): phpbb\db\tools\tools->__construct(Object(phpbb\db\driver\sqlite3), true)
26-Jan-2020 15:58:04 #2 /data/tests/test_framework/phpbb_database_test_case.php(82): phpbb\db\tools\factory->get(Object(phpbb\db\driver\sqlite3), true)
26-Jan-2020 15:58:04 #3 /data/phpBB/vendor/phpunit/phpunit/src/Framework/TestSuite.php(703): phpbb_database_test_case::setUpBeforeClass()
26-Jan-2020 15:58:04 #4 /data/phpBB/vendor/phpunit/phpunit/src/Framework/TestSuite.php(746): PHPUnit\Framework\TestSuite->run(Object(PHPUnit\Framework\TestResult))
26-Jan-2020 15:58:04 #5 /data/phpBB/vendor/phpunit/phpunit/src/Framework/TestSuite.php(746): PHPUnit\Framework\TestSuite->run(Object(PHPUnit\Framework\TestResult))
26-Jan-2020 15:58:04 #6 /data/phpBB/vendor/phpunit/phpunit/src/TextUI/TestRunner.php(652): PHPUnit\Framework\TestSuite->run(Object(PHPUnit\Framework\TestResult))
26-Jan-2020 15:58:04 #7 /data/phpBB/vendor/phpunit/phpunit/src/TextUI/Command.php(206): PHPUnit\TextUI\TestRunner->doRun(Object(PHPUnit\Framework\TestSuite), Array, true)
26-Jan-2020 15:58:04 #8 /data/phpBB/vendor/phpunit/phpunit/src/TextUI/Command.php(162): PHPUnit\TextUI\Command->run(Array, true)
26-Jan-2020 15:58:04 #9 /data/phpBB/vendor/phpunit/phpunit/phpunit(61): PHPUnit\TextUI\Command::main()
26-Jan-2020 15:58:04 #10 {main}
26-Jan-2020 15:58:04 321) phpbb_textreparser_forum_rules_test::test_get_max_id
26-Jan-2020 15:58:04 Error: Call to a member function getName() on null in /data/phpBB/phpbb/db/driver/doctrine.php:71
26-Jan-2020 15:58:04 Stack trace:
26-Jan-2020 15:58:04 #0 /data/phpBB/phpbb/db/tools/tools.php(167): phpbb\db\driver\doctrine->get_sql_layer()
26-Jan-2020 15:58:04 #1 /data/phpBB/phpbb/db/tools/factory.php(38): phpbb\db\tools\tools->__construct(Object(phpbb\db\driver\sqlite3), true)
26-Jan-2020 15:58:04 #2 /data/tests/test_framework/phpbb_database_test_case.php(82): phpbb\db\tools\factory->get(Object(phpbb\db\driver\sqlite3), true)
26-Jan-2020 15:58:04 #3 /data/phpBB/vendor/phpunit/phpunit/src/Framework/TestSuite.php(703): phpbb_database_test_case::setUpBeforeClass()
26-Jan-2020 15:58:04 #4 /data/phpBB/vendor/phpunit/phpunit/src/Framework/TestSuite.php(746): PHPUnit\Framework\TestSuite->run(Object(PHPUnit\Framework\TestResult))
26-Jan-2020 15:58:04 #5 /data/phpBB/vendor/phpunit/phpunit/src/Framework/TestSuite.php(746): PHPUnit\Framework\TestSuite->run(Object(PHPUnit\Framework\TestResult))
26-Jan-2020 15:58:04 #6 /data/phpBB/vendor/phpunit/phpunit/src/TextUI/TestRunner.php(652): PHPUnit\Framework\TestSuite->run(Object(PHPUnit\Framework\TestResult))
26-Jan-2020 15:58:04 #7 /data/phpBB/vendor/phpunit/phpunit/src/TextUI/Command.php(206): PHPUnit\TextUI\TestRunner->doRun(Object(PHPUnit\Framework\TestSuite), Array, true)
26-Jan-2020 15:58:04 #8 /data/phpBB/vendor/phpunit/phpunit/src/TextUI/Command.php(162): PHPUnit\TextUI\Command->run(Array, true)
26-Jan-2020 15:58:04 #9 /data/phpBB/vendor/phpunit/phpunit/phpunit(61): PHPUnit\TextUI\Command::main()
26-Jan-2020 15:58:04 #10 {main}
26-Jan-2020 15:58:04 322) phpbb_textreparser_forum_rules_test::test_dry_run
26-Jan-2020 15:58:04 Error: Call to a member function getName() on null in /data/phpBB/phpbb/db/driver/doctrine.php:71
26-Jan-2020 15:58:04 Stack trace:
26-Jan-2020 15:58:04 #0 /data/phpBB/phpbb/db/tools/tools.php(167): phpbb\db\driver\doctrine->get_sql_layer()
26-Jan-2020 15:58:04 #1 /data/phpBB/phpbb/db/tools/factory.php(38): phpbb\db\tools\tools->__construct(Object(phpbb\db\driver\sqlite3), true)
26-Jan-2020 15:58:04 #2 /data/tests/test_framework/phpbb_database_test_case.php(82): phpbb\db\tools\factory->get(Object(phpbb\db\driver\sqlite3), true)
26-Jan-2020 15:58:04 #3 /data/phpBB/vendor/phpunit/phpunit/src/Framework/TestSuite.php(703): phpbb_database_test_case::setUpBeforeClass()
26-Jan-2020 15:58:04 #4 /data/phpBB/vendor/phpunit/phpunit/src/Framework/TestSuite.php(746): PHPUnit\Framework\TestSuite->run(Object(PHPUnit\Framework\TestResult))
26-Jan-2020 15:58:04 #5 /data/phpBB/vendor/phpunit/phpunit/src/Framework/TestSuite.php(746): PHPUnit\Framework\TestSuite->run(Object(PHPUnit\Framework\TestResult))
26-Jan-2020 15:58:04 #6 /data/phpBB/vendor/phpunit/phpunit/src/TextUI/TestRunner.php(652): PHPUnit\Framework\TestSuite->run(Object(PHPUnit\Framework\TestResult))
26-Jan-2020 15:58:04 #7 /data/phpBB/vendor/phpunit/phpunit/src/TextUI/Command.php(206): PHPUnit\TextUI\TestRunner->doRun(Object(PHPUnit\Framework\TestSuite), Array, true)
26-Jan-2020 15:58:04 #8 /data/phpBB/vendor/phpunit/phpunit/src/TextUI/Command.php(162): PHPUnit\TextUI\Command->run(Array, true)
26-Jan-2020 15:58:04 #9 /data/phpBB/vendor/phpunit/phpunit/phpunit(61): PHPUnit\TextUI\Command::main()
26-Jan-2020 15:58:04 #10 {main}
26-Jan-2020 15:58:04 323) phpbb_textreparser_forum_rules_test::test_reparse
26-Jan-2020 15:58:04 Error: Call to a member function getName() on null in /data/phpBB/phpbb/db/driver/doctrine.php:71
26-Jan-2020 15:58:04 Stack trace:
26-Jan-2020 15:58:04 #0 /data/phpBB/phpbb/db/tools/tools.php(167): phpbb\db\driver\doctrine->get_sql_layer()
26-Jan-2020 15:58:04 #1 /data/phpBB/phpbb/db/tools/factory.php(38): phpbb\db\tools\tools->__construct(Object(phpbb\db\driver\sqlite3), true)
26-Jan-2020 15:58:04 #2 /data/tests/test_framework/phpbb_database_test_case.php(82): phpbb\db\tools\factory->get(Object(phpbb\db\driver\sqlite3), true)
26-Jan-2020 15:58:04 #3 /data/phpBB/vendor/phpunit/phpunit/src/Framework/TestSuite.php(703): phpbb_database_test_case::setUpBeforeClass()
26-Jan-2020 15:58:04 #4 /data/phpBB/vendor/phpunit/phpunit/src/Framework/TestSuite.php(746): PHPUnit\Framework\TestSuite->run(Object(PHPUnit\Framework\TestResult))
26-Jan-2020 15:58:04 #5 /data/phpBB/vendor/phpunit/phpunit/src/Framework/TestSuite.php(746): PHPUnit\Framework\TestSuite->run(Object(PHPUnit\Framework\TestResult))
26-Jan-2020 15:58:04 #6 /data/phpBB/vendor/phpunit/phpunit/src/TextUI/TestRunner.php(652): PHPUnit\Framework\TestSuite->run(Object(PHPUnit\Framework\TestResult))
26-Jan-2020 15:58:04 #7 /data/phpBB/vendor/phpunit/phpunit/src/TextUI/Command.php(206): PHPUnit\TextUI\TestRunner->doRun(Object(PHPUnit\Framework\TestSuite), Array, true)
26-Jan-2020 15:58:04 #8 /data/phpBB/vendor/phpunit/phpunit/src/TextUI/Command.php(162): PHPUnit\TextUI\Command->run(Array, true)
26-Jan-2020 15:58:04 #9 /data/phpBB/vendor/phpunit/phpunit/phpunit(61): PHPUnit\TextUI\Command::main()
26-Jan-2020 15:58:04 #10 {main}
26-Jan-2020 15:58:04 324) phpbb_textreparser_group_description_test::test_get_max_id
26-Jan-2020 15:58:04 Error: Call to a member function getName() on null in /data/phpBB/phpbb/db/driver/doctrine.php:71
26-Jan-2020 15:58:04 Stack trace:
26-Jan-2020 15:58:04 #0 /data/phpBB/phpbb/db/tools/tools.php(167): phpbb\db\driver\doctrine->get_sql_layer()
26-Jan-2020 15:58:04 #1 /data/phpBB/phpbb/db/tools/factory.php(38): phpbb\db\tools\tools->__construct(Object(phpbb\db\driver\sqlite3), true)
26-Jan-2020 15:58:04 #2 /data/tests/test_framework/phpbb_database_test_case.php(82): phpbb\db\tools\factory->get(Object(phpbb\db\driver\sqlite3), true)
26-Jan-2020 15:58:04 #3 /data/phpBB/vendor/phpunit/phpunit/src/Framework/TestSuite.php(703): phpbb_database_test_case::setUpBeforeClass()
26-Jan-2020 15:58:04 #4 /data/phpBB/vendor/phpunit/phpunit/src/Framework/TestSuite.php(746): PHPUnit\Framework\TestSuite->run(Object(PHPUnit\Framework\TestResult))
26-Jan-2020 15:58:04 #5 /data/phpBB/vendor/phpunit/phpunit/src/Framework/TestSuite.php(746): PHPUnit\Framework\TestSuite->run(Object(PHPUnit\Framework\TestResult))
26-Jan-2020 15:58:04 #6 /data/phpBB/vendor/phpunit/phpunit/src/TextUI/TestRunner.php(652): PHPUnit\Framework\TestSuite->run(Object(PHPUnit\Framework\TestResult))
26-Jan-2020 15:58:04 #7 /data/phpBB/vendor/phpunit/phpunit/src/TextUI/Command.php(206): PHPUnit\TextUI\TestRunner->doRun(Object(PHPUnit\Framework\TestSuite), Array, true)
26-Jan-2020 15:58:04 #8 /data/phpBB/vendor/phpunit/phpunit/src/TextUI/Command.php(162): PHPUnit\TextUI\Command->run(Array, true)
26-Jan-2020 15:58:04 #9 /data/phpBB/vendor/phpunit/phpunit/phpunit(61): PHPUnit\TextUI\Command::main()
26-Jan-2020 15:58:04 #10 {main}
26-Jan-2020 15:58:04 325) phpbb_textreparser_group_description_test::test_dry_run
26-Jan-2020 15:58:04 Error: Call to a member function getName() on null in /data/phpBB/phpbb/db/driver/doctrine.php:71
26-Jan-2020 15:58:04 Stack trace:
26-Jan-2020 15:58:04 #0 /data/phpBB/phpbb/db/tools/tools.php(167): phpbb\db\driver\doctrine->get_sql_layer()
26-Jan-2020 15:58:04 #1 /data/phpBB/phpbb/db/tools/factory.php(38): phpbb\db\tools\tools->__construct(Object(phpbb\db\driver\sqlite3), true)
26-Jan-2020 15:58:04 #2 /data/tests/test_framework/phpbb_database_test_case.php(82): phpbb\db\tools\factory->get(Object(phpbb\db\driver\sqlite3), true)
26-Jan-2020 15:58:04 #3 /data/phpBB/vendor/phpunit/phpunit/src/Framework/TestSuite.php(703): phpbb_database_test_case::setUpBeforeClass()
26-Jan-2020 15:58:04 #4 /data/phpBB/vendor/phpunit/phpunit/src/Framework/TestSuite.php(746): PHPUnit\Framework\TestSuite->run(Object(PHPUnit\Framework\TestResult))
26-Jan-2020 15:58:04 #5 /data/phpBB/vendor/phpunit/phpunit/src/Framework/TestSuite.php(746): PHPUnit\Framework\TestSuite->run(Object(PHPUnit\Framework\TestResult))
26-Jan-2020 15:58:04 #6 /data/phpBB/vendor/phpunit/phpunit/src/TextUI/TestRunner.php(652): PHPUnit\Framework\TestSuite->run(Object(PHPUnit\Framework\TestResult))
26-Jan-2020 15:58:04 #7 /data/phpBB/vendor/phpunit/phpunit/src/TextUI/Command.php(206): PHPUnit\TextUI\TestRunner->doRun(Object(PHPUnit\Framework\TestSuite), Array, true)
26-Jan-2020 15:58:04 #8 /data/phpBB/vendor/phpunit/phpunit/src/TextUI/Command.php(162): PHPUnit\TextUI\Command->run(Array, true)
26-Jan-2020 15:58:04 #9 /data/phpBB/vendor/phpunit/phpunit/phpunit(61): PHPUnit\TextUI\Command::main()
26-Jan-2020 15:58:04 #10 {main}
26-Jan-2020 15:58:04 326) phpbb_textreparser_group_description_test::test_reparse
26-Jan-2020 15:58:04 Error: Call to a member function getName() on null in /data/phpBB/phpbb/db/driver/doctrine.php:71
26-Jan-2020 15:58:04 Stack trace:
26-Jan-2020 15:58:04 #0 /data/phpBB/phpbb/db/tools/tools.php(167): phpbb\db\driver\doctrine->get_sql_layer()
26-Jan-2020 15:58:04 #1 /data/phpBB/phpbb/db/tools/factory.php(38): phpbb\db\tools\tools->__construct(Object(phpbb\db\driver\sqlite3), true)
26-Jan-2020 15:58:04 #2 /data/tests/test_framework/phpbb_database_test_case.php(82): phpbb\db\tools\factory->get(Object(phpbb\db\driver\sqlite3), true)
26-Jan-2020 15:58:04 #3 /data/phpBB/vendor/phpunit/phpunit/src/Framework/TestSuite.php(703): phpbb_database_test_case::setUpBeforeClass()
26-Jan-2020 15:58:04 #4 /data/phpBB/vendor/phpunit/phpunit/src/Framework/TestSuite.php(746): PHPUnit\Framework\TestSuite->run(Object(PHPUnit\Framework\TestResult))
26-Jan-2020 15:58:04 #5 /data/phpBB/vendor/phpunit/phpunit/src/Framework/TestSuite.php(746): PHPUnit\Framework\TestSuite->run(Object(PHPUnit\Framework\TestResult))
26-Jan-2020 15:58:04 #6 /data/phpBB/vendor/phpunit/phpunit/src/TextUI/TestRunner.php(652): PHPUnit\Framework\TestSuite->run(Object(PHPUnit\Framework\TestResult))
26-Jan-2020 15:58:04 #7 /data/phpBB/vendor/phpunit/phpunit/src/TextUI/Command.php(206): PHPUnit\TextUI\TestRunner->doRun(Object(PHPUnit\Framework\TestSuite), Array, true)
26-Jan-2020 15:58:04 #8 /data/phpBB/vendor/phpunit/phpunit/src/TextUI/Command.php(162): PHPUnit\TextUI\Command->run(Array, true)
26-Jan-2020 15:58:04 #9 /data/phpBB/vendor/phpunit/phpunit/phpunit(61): PHPUnit\TextUI\Command::main()
26-Jan-2020 15:58:04 #10 {main}
26-Jan-2020 15:58:04 327) phpbb_textreparser_pm_text_test::test_get_max_id
26-Jan-2020 15:58:04 Error: Call to a member function getName() on null in /data/phpBB/phpbb/db/driver/doctrine.php:71
26-Jan-2020 15:58:04 Stack trace:
26-Jan-2020 15:58:04 #0 /data/phpBB/phpbb/db/tools/tools.php(167): phpbb\db\driver\doctrine->get_sql_layer()
26-Jan-2020 15:58:04 #1 /data/phpBB/phpbb/db/tools/factory.php(38): phpbb\db\tools\tools->__construct(Object(phpbb\db\driver\sqlite3), true)
26-Jan-2020 15:58:04 #2 /data/tests/test_framework/phpbb_database_test_case.php(82): phpbb\db\tools\factory->get(Object(phpbb\db\driver\sqlite3), true)
26-Jan-2020 15:58:04 #3 /data/phpBB/vendor/phpunit/phpunit/src/Framework/TestSuite.php(703): phpbb_database_test_case::setUpBeforeClass()
26-Jan-2020 15:58:04 #4 /data/phpBB/vendor/phpunit/phpunit/src/Framework/TestSuite.php(746): PHPUnit\Framework\TestSuite->run(Object(PHPUnit\Framework\TestResult))
26-Jan-2020 15:58:04 #5 /data/phpBB/vendor/phpunit/phpunit/src/Framework/TestSuite.php(746): PHPUnit\Framework\TestSuite->run(Object(PHPUnit\Framework\TestResult))
26-Jan-2020 15:58:04 #6 /data/phpBB/vendor/phpunit/phpunit/src/TextUI/TestRunner.php(652): PHPUnit\Framework\TestSuite->run(Object(PHPUnit\Framework\TestResult))
26-Jan-2020 15:58:04 #7 /data/phpBB/vendor/phpunit/phpunit/src/TextUI/Command.php(206): PHPUnit\TextUI\TestRunner->doRun(Object(PHPUnit\Framework\TestSuite), Array, true)
26-Jan-2020 15:58:04 #8 /data/phpBB/vendor/phpunit/phpunit/src/TextUI/Command.php(162): PHPUnit\TextUI\Command->run(Array, true)
26-Jan-2020 15:58:04 #9 /data/phpBB/vendor/phpunit/phpunit/phpunit(61): PHPUnit\TextUI\Command::main()
26-Jan-2020 15:58:04 #10 {main}
26-Jan-2020 15:58:04 328) phpbb_textreparser_pm_text_test::test_dry_run
26-Jan-2020 15:58:04 Error: Call to a member function getName() on null in /data/phpBB/phpbb/db/driver/doctrine.php:71
26-Jan-2020 15:58:04 Stack trace:
26-Jan-2020 15:58:04 #0 /data/phpBB/phpbb/db/tools/tools.php(167): phpbb\db\driver\doctrine->get_sql_layer()
26-Jan-2020 15:58:04 #1 /data/phpBB/phpbb/db/tools/factory.php(38): phpbb\db\tools\tools->__construct(Object(phpbb\db\driver\sqlite3), true)
26-Jan-2020 15:58:04 #2 /data/tests/test_framework/phpbb_database_test_case.php(82): phpbb\db\tools\factory->get(Object(phpbb\db\driver\sqlite3), true)
26-Jan-2020 15:58:04 #3 /data/phpBB/vendor/phpunit/phpunit/src/Framework/TestSuite.php(703): phpbb_database_test_case::setUpBeforeClass()
26-Jan-2020 15:58:04 #4 /data/phpBB/vendor/phpunit/phpunit/src/Framework/TestSuite.php(746): PHPUnit\Framework\TestSuite->run(Object(PHPUnit\Framework\TestResult))
26-Jan-2020 15:58:04 #5 /data/phpBB/vendor/phpunit/phpunit/src/Framework/TestSuite.php(746): PHPUnit\Framework\TestSuite->run(Object(PHPUnit\Framework\TestResult))
26-Jan-2020 15:58:04 #6 /data/phpBB/vendor/phpunit/phpunit/src/TextUI/TestRunner.php(652): PHPUnit\Framework\TestSuite->run(Object(PHPUnit\Framework\TestResult))
26-Jan-2020 15:58:04 #7 /data/phpBB/vendor/phpunit/phpunit/src/TextUI/Command.php(206): PHPUnit\TextUI\TestRunner->doRun(Object(PHPUnit\Framework\TestSuite), Array, true)
26-Jan-2020 15:58:04 #8 /data/phpBB/vendor/phpunit/phpunit/src/TextUI/Command.php(162): PHPUnit\TextUI\Command->run(Array, true)
26-Jan-2020 15:58:04 #9 /data/phpBB/vendor/phpunit/phpunit/phpunit(61): PHPUnit\TextUI\Command::main()
26-Jan-2020 15:58:04 #10 {main}
26-Jan-2020 15:58:04 329) phpbb_textreparser_pm_text_test::test_reparse
26-Jan-2020 15:58:04 Error: Call to a member function getName() on null in /data/phpBB/phpbb/db/driver/doctrine.php:71
26-Jan-2020 15:58:04 Stack trace:
26-Jan-2020 15:58:04 #0 /data/phpBB/phpbb/db/tools/tools.php(167): phpbb\db\driver\doctrine->get_sql_layer()
26-Jan-2020 15:58:04 #1 /data/phpBB/phpbb/db/tools/factory.php(38): phpbb\db\tools\tools->__construct(Object(phpbb\db\driver\sqlite3), true)
26-Jan-2020 15:58:04 #2 /data/tests/test_framework/phpbb_database_test_case.php(82): phpbb\db\tools\factory->get(Object(phpbb\db\driver\sqlite3), true)
26-Jan-2020 15:58:04 #3 /data/phpBB/vendor/phpunit/phpunit/src/Framework/TestSuite.php(703): phpbb_database_test_case::setUpBeforeClass()
26-Jan-2020 15:58:04 #4 /data/phpBB/vendor/phpunit/phpunit/src/Framework/TestSuite.php(746): PHPUnit\Framework\TestSuite->run(Object(PHPUnit\Framework\TestResult))
26-Jan-2020 15:58:04 #5 /data/phpBB/vendor/phpunit/phpunit/src/Framework/TestSuite.php(746): PHPUnit\Framework\TestSuite->run(Object(PHPUnit\Framework\TestResult))
26-Jan-2020 15:58:04 #6 /data/phpBB/vendor/phpunit/phpunit/src/TextUI/TestRunner.php(652): PHPUnit\Framework\TestSuite->run(Object(PHPUnit\Framework\TestResult))
26-Jan-2020 15:58:04 #7 /data/phpBB/vendor/phpunit/phpunit/src/TextUI/Command.php(206): PHPUnit\TextUI\TestRunner->doRun(Object(PHPUnit\Framework\TestSuite), Array, true)
26-Jan-2020 15:58:04 #8 /data/phpBB/vendor/phpunit/phpunit/src/TextUI/Command.php(162): PHPUnit\TextUI\Command->run(Array, true)
26-Jan-2020 15:58:04 #9 /data/phpBB/vendor/phpunit/phpunit/phpunit(61): PHPUnit\TextUI\Command::main()
26-Jan-2020 15:58:04 #10 {main}
26-Jan-2020 15:58:04 330) phpbb_textreparser_poll_option_test::test_get_max_id
26-Jan-2020 15:58:04 Error: Call to a member function getName() on null in /data/phpBB/phpbb/db/driver/doctrine.php:71
26-Jan-2020 15:58:04 Stack trace:
26-Jan-2020 15:58:04 #0 /data/phpBB/phpbb/db/tools/tools.php(167): phpbb\db\driver\doctrine->get_sql_layer()
26-Jan-2020 15:58:04 #1 /data/phpBB/phpbb/db/tools/factory.php(38): phpbb\db\tools\tools->__construct(Object(phpbb\db\driver\sqlite3), true)
26-Jan-2020 15:58:04 #2 /data/tests/test_framework/phpbb_database_test_case.php(82): phpbb\db\tools\factory->get(Object(phpbb\db\driver\sqlite3), true)
26-Jan-2020 15:58:04 #3 /data/phpBB/vendor/phpunit/phpunit/src/Framework/TestSuite.php(703): phpbb_database_test_case::setUpBeforeClass()
26-Jan-2020 15:58:04 #4 /data/phpBB/vendor/phpunit/phpunit/src/Framework/TestSuite.php(746): PHPUnit\Framework\TestSuite->run(Object(PHPUnit\Framework\TestResult))
26-Jan-2020 15:58:04 #5 /data/phpBB/vendor/phpunit/phpunit/src/Framework/TestSuite.php(746): PHPUnit\Framework\TestSuite->run(Object(PHPUnit\Framework\TestResult))
26-Jan-2020 15:58:04 #6 /data/phpBB/vendor/phpunit/phpunit/src/TextUI/TestRunner.php(652): PHPUnit\Framework\TestSuite->run(Object(PHPUnit\Framework\TestResult))
26-Jan-2020 15:58:04 #7 /data/phpBB/vendor/phpunit/phpunit/src/TextUI/Command.php(206): PHPUnit\TextUI\TestRunner->doRun(Object(PHPUnit\Framework\TestSuite), Array, true)
26-Jan-2020 15:58:04 #8 /data/phpBB/vendor/phpunit/phpunit/src/TextUI/Command.php(162): PHPUnit\TextUI\Command->run(Array, true)
26-Jan-2020 15:58:04 #9 /data/phpBB/vendor/phpunit/phpunit/phpunit(61): PHPUnit\TextUI\Command::main()
26-Jan-2020 15:58:04 #10 {main}
26-Jan-2020 15:58:04 331) phpbb_textreparser_poll_option_test::test_dry_run
26-Jan-2020 15:58:04 Error: Call to a member function getName() on null in /data/phpBB/phpbb/db/driver/doctrine.php:71
26-Jan-2020 15:58:04 Stack trace:
26-Jan-2020 15:58:04 #0 /data/phpBB/phpbb/db/tools/tools.php(167): phpbb\db\driver\doctrine->get_sql_layer()
26-Jan-2020 15:58:04 #1 /data/phpBB/phpbb/db/tools/factory.php(38): phpbb\db\tools\tools->__construct(Object(phpbb\db\driver\sqlite3), true)
26-Jan-2020 15:58:04 #2 /data/tests/test_framework/phpbb_database_test_case.php(82): phpbb\db\tools\factory->get(Object(phpbb\db\driver\sqlite3), true)
26-Jan-2020 15:58:04 #3 /data/phpBB/vendor/phpunit/phpunit/src/Framework/TestSuite.php(703): phpbb_database_test_case::setUpBeforeClass()
26-Jan-2020 15:58:04 #4 /data/phpBB/vendor/phpunit/phpunit/src/Framework/TestSuite.php(746): PHPUnit\Framework\TestSuite->run(Object(PHPUnit\Framework\TestResult))
26-Jan-2020 15:58:04 #5 /data/phpBB/vendor/phpunit/phpunit/src/Framework/TestSuite.php(746): PHPUnit\Framework\TestSuite->run(Object(PHPUnit\Framework\TestResult))
26-Jan-2020 15:58:04 #6 /data/phpBB/vendor/phpunit/phpunit/src/TextUI/TestRunner.php(652): PHPUnit\Framework\TestSuite->run(Object(PHPUnit\Framework\TestResult))
26-Jan-2020 15:58:04 #7 /data/phpBB/vendor/phpunit/phpunit/src/TextUI/Command.php(206): PHPUnit\TextUI\TestRunner->doRun(Object(PHPUnit\Framework\TestSuite), Array, true)
26-Jan-2020 15:58:04 #8 /data/phpBB/vendor/phpunit/phpunit/src/TextUI/Command.php(162): PHPUnit\TextUI\Command->run(Array, true)
26-Jan-2020 15:58:04 #9 /data/phpBB/vendor/phpunit/phpunit/phpunit(61): PHPUnit\TextUI\Command::main()
26-Jan-2020 15:58:04 #10 {main}
26-Jan-2020 15:58:04 332) phpbb_textreparser_poll_option_test::testReparse
26-Jan-2020 15:58:04 Error: Call to a member function getName() on null in /data/phpBB/phpbb/db/driver/doctrine.php:71
26-Jan-2020 15:58:04 Stack trace:
26-Jan-2020 15:58:04 #0 /data/phpBB/phpbb/db/tools/tools.php(167): phpbb\db\driver\doctrine->get_sql_layer()
26-Jan-2020 15:58:04 #1 /data/phpBB/phpbb/db/tools/factory.php(38): phpbb\db\tools\tools->__construct(Object(phpbb\db\driver\sqlite3), true)
26-Jan-2020 15:58:04 #2 /data/tests/test_framework/phpbb_database_test_case.php(82): phpbb\db\tools\factory->get(Object(phpbb\db\driver\sqlite3), true)
26-Jan-2020 15:58:04 #3 /data/phpBB/vendor/phpunit/phpunit/src/Framework/TestSuite.php(703): phpbb_database_test_case::setUpBeforeClass()
26-Jan-2020 15:58:04 #4 /data/phpBB/vendor/phpunit/phpunit/src/Framework/TestSuite.php(746): PHPUnit\Framework\TestSuite->run(Object(PHPUnit\Framework\TestResult))
26-Jan-2020 15:58:04 #5 /data/phpBB/vendor/phpunit/phpunit/src/Framework/TestSuite.php(746): PHPUnit\Framework\TestSuite->run(Object(PHPUnit\Framework\TestResult))
26-Jan-2020 15:58:04 #6 /data/phpBB/vendor/phpunit/phpunit/src/TextUI/TestRunner.php(652): PHPUnit\Framework\TestSuite->run(Object(PHPUnit\Framework\TestResult))
26-Jan-2020 15:58:04 #7 /data/phpBB/vendor/phpunit/phpunit/src/TextUI/Command.php(206): PHPUnit\TextUI\TestRunner->doRun(Object(PHPUnit\Framework\TestSuite), Array, true)
26-Jan-2020 15:58:04 #8 /data/phpBB/vendor/phpunit/phpunit/src/TextUI/Command.php(162): PHPUnit\TextUI\Command->run(Array, true)
26-Jan-2020 15:58:04 #9 /data/phpBB/vendor/phpunit/phpunit/phpunit(61): PHPUnit\TextUI\Command::main()
26-Jan-2020 15:58:04 #10 {main}
26-Jan-2020 15:58:04 333) phpbb_textreparser_poll_title_test::test_get_max_id
26-Jan-2020 15:58:04 Error: Call to a member function getName() on null in /data/phpBB/phpbb/db/driver/doctrine.php:71
26-Jan-2020 15:58:04 Stack trace:
26-Jan-2020 15:58:04 #0 /data/phpBB/phpbb/db/tools/tools.php(167): phpbb\db\driver\doctrine->get_sql_layer()
26-Jan-2020 15:58:04 #1 /data/phpBB/phpbb/db/tools/factory.php(38): phpbb\db\tools\tools->__construct(Object(phpbb\db\driver\sqlite3), true)
26-Jan-2020 15:58:04 #2 /data/tests/test_framework/phpbb_database_test_case.php(82): phpbb\db\tools\factory->get(Object(phpbb\db\driver\sqlite3), true)
26-Jan-2020 15:58:04 #3 /data/phpBB/vendor/phpunit/phpunit/src/Framework/TestSuite.php(703): phpbb_database_test_case::setUpBeforeClass()
26-Jan-2020 15:58:04 #4 /data/phpBB/vendor/phpunit/phpunit/src/Framework/TestSuite.php(746): PHPUnit\Framework\TestSuite->run(Object(PHPUnit\Framework\TestResult))
26-Jan-2020 15:58:04 #5 /data/phpBB/vendor/phpunit/phpunit/src/Framework/TestSuite.php(746): PHPUnit\Framework\TestSuite->run(Object(PHPUnit\Framework\TestResult))
26-Jan-2020 15:58:04 #6 /data/phpBB/vendor/phpunit/phpunit/src/TextUI/TestRunner.php(652): PHPUnit\Framework\TestSuite->run(Object(PHPUnit\Framework\TestResult))
26-Jan-2020 15:58:04 #7 /data/phpBB/vendor/phpunit/phpunit/src/TextUI/Command.php(206): PHPUnit\TextUI\TestRunner->doRun(Object(PHPUnit\Framework\TestSuite), Array, true)
26-Jan-2020 15:58:04 #8 /data/phpBB/vendor/phpunit/phpunit/src/TextUI/Command.php(162): PHPUnit\TextUI\Command->run(Array, true)
26-Jan-2020 15:58:04 #9 /data/phpBB/vendor/phpunit/phpunit/phpunit(61): PHPUnit\TextUI\Command::main()
26-Jan-2020 15:58:04 #10 {main}
26-Jan-2020 15:58:04 334) phpbb_textreparser_poll_title_test::test_dry_run
26-Jan-2020 15:58:04 Error: Call to a member function getName() on null in /data/phpBB/phpbb/db/driver/doctrine.php:71
26-Jan-2020 15:58:04 Stack trace:
26-Jan-2020 15:58:04 #0 /data/phpBB/phpbb/db/tools/tools.php(167): phpbb\db\driver\doctrine->get_sql_layer()
26-Jan-2020 15:58:04 #1 /data/phpBB/phpbb/db/tools/factory.php(38): phpbb\db\tools\tools->__construct(Object(phpbb\db\driver\sqlite3), true)
26-Jan-2020 15:58:04 #2 /data/tests/test_framework/phpbb_database_test_case.php(82): phpbb\db\tools\factory->get(Object(phpbb\db\driver\sqlite3), true)
26-Jan-2020 15:58:04 #3 /data/phpBB/vendor/phpunit/phpunit/src/Framework/TestSuite.php(703): phpbb_database_test_case::setUpBeforeClass()
26-Jan-2020 15:58:04 #4 /data/phpBB/vendor/phpunit/phpunit/src/Framework/TestSuite.php(746): PHPUnit\Framework\TestSuite->run(Object(PHPUnit\Framework\TestResult))
26-Jan-2020 15:58:04 #5 /data/phpBB/vendor/phpunit/phpunit/src/Framework/TestSuite.php(746): PHPUnit\Framework\TestSuite->run(Object(PHPUnit\Framework\TestResult))
26-Jan-2020 15:58:04 #6 /data/phpBB/vendor/phpunit/phpunit/src/TextUI/TestRunner.php(652): PHPUnit\Framework\TestSuite->run(Object(PHPUnit\Framework\TestResult))
26-Jan-2020 15:58:04 #7 /data/phpBB/vendor/phpunit/phpunit/src/TextUI/Command.php(206): PHPUnit\TextUI\TestRunner->doRun(Object(PHPUnit\Framework\TestSuite), Array, true)
26-Jan-2020 15:58:04 #8 /data/phpBB/vendor/phpunit/phpunit/src/TextUI/Command.php(162): PHPUnit\TextUI\Command->run(Array, true)
26-Jan-2020 15:58:04 #9 /data/phpBB/vendor/phpunit/phpunit/phpunit(61): PHPUnit\TextUI\Command::main()
26-Jan-2020 15:58:04 #10 {main}
26-Jan-2020 15:58:04 335) phpbb_textreparser_poll_title_test::test_reparse
26-Jan-2020 15:58:04 Error: Call to a member function getName() on null in /data/phpBB/phpbb/db/driver/doctrine.php:71
26-Jan-2020 15:58:04 Stack trace:
26-Jan-2020 15:58:04 #0 /data/phpBB/phpbb/db/tools/tools.php(167): phpbb\db\driver\doctrine->get_sql_layer()
26-Jan-2020 15:58:04 #1 /data/phpBB/phpbb/db/tools/factory.php(38): phpbb\db\tools\tools->__construct(Object(phpbb\db\driver\sqlite3), true)
26-Jan-2020 15:58:04 #2 /data/tests/test_framework/phpbb_database_test_case.php(82): phpbb\db\tools\factory->get(Object(phpbb\db\driver\sqlite3), true)
26-Jan-2020 15:58:04 #3 /data/phpBB/vendor/phpunit/phpunit/src/Framework/TestSuite.php(703): phpbb_database_test_case::setUpBeforeClass()
26-Jan-2020 15:58:04 #4 /data/phpBB/vendor/phpunit/phpunit/src/Framework/TestSuite.php(746): PHPUnit\Framework\TestSuite->run(Object(PHPUnit\Framework\TestResult))
26-Jan-2020 15:58:04 #5 /data/phpBB/vendor/phpunit/phpunit/src/Framework/TestSuite.php(746): PHPUnit\Framework\TestSuite->run(Object(PHPUnit\Framework\TestResult))
26-Jan-2020 15:58:04 #6 /data/phpBB/vendor/phpunit/phpunit/src/TextUI/TestRunner.php(652): PHPUnit\Framework\TestSuite->run(Object(PHPUnit\Framework\TestResult))
26-Jan-2020 15:58:04 #7 /data/phpBB/vendor/phpunit/phpunit/src/TextUI/Command.php(206): PHPUnit\TextUI\TestRunner->doRun(Object(PHPUnit\Framework\TestSuite), Array, true)
26-Jan-2020 15:58:04 #8 /data/phpBB/vendor/phpunit/phpunit/src/TextUI/Command.php(162): PHPUnit\TextUI\Command->run(Array, true)
26-Jan-2020 15:58:04 #9 /data/phpBB/vendor/phpunit/phpunit/phpunit(61): PHPUnit\TextUI\Command::main()
26-Jan-2020 15:58:04 #10 {main}
26-Jan-2020 15:58:04 336) phpbb_textreparser_post_text_test::test_get_max_id
26-Jan-2020 15:58:04 Error: Call to a member function getName() on null in /data/phpBB/phpbb/db/driver/doctrine.php:71
26-Jan-2020 15:58:04 Stack trace:
26-Jan-2020 15:58:04 #0 /data/phpBB/phpbb/db/tools/tools.php(167): phpbb\db\driver\doctrine->get_sql_layer()
26-Jan-2020 15:58:04 #1 /data/phpBB/phpbb/db/tools/factory.php(38): phpbb\db\tools\tools->__construct(Object(phpbb\db\driver\sqlite3), true)
26-Jan-2020 15:58:04 #2 /data/tests/test_framework/phpbb_database_test_case.php(82): phpbb\db\tools\factory->get(Object(phpbb\db\driver\sqlite3), true)
26-Jan-2020 15:58:04 #3 /data/phpBB/vendor/phpunit/phpunit/src/Framework/TestSuite.php(703): phpbb_database_test_case::setUpBeforeClass()
26-Jan-2020 15:58:04 #4 /data/phpBB/vendor/phpunit/phpunit/src/Framework/TestSuite.php(746): PHPUnit\Framework\TestSuite->run(Object(PHPUnit\Framework\TestResult))
26-Jan-2020 15:58:04 #5 /data/phpBB/vendor/phpunit/phpunit/src/Framework/TestSuite.php(746): PHPUnit\Framework\TestSuite->run(Object(PHPUnit\Framework\TestResult))
26-Jan-2020 15:58:04 #6 /data/phpBB/vendor/phpunit/phpunit/src/TextUI/TestRunner.php(652): PHPUnit\Framework\TestSuite->run(Object(PHPUnit\Framework\TestResult))
26-Jan-2020 15:58:04 #7 /data/phpBB/vendor/phpunit/phpunit/src/TextUI/Command.php(206): PHPUnit\TextUI\TestRunner->doRun(Object(PHPUnit\Framework\TestSuite), Array, true)
26-Jan-2020 15:58:04 #8 /data/phpBB/vendor/phpunit/phpunit/src/TextUI/Command.php(162): PHPUnit\TextUI\Command->run(Array, true)
26-Jan-2020 15:58:04 #9 /data/phpBB/vendor/phpunit/phpunit/phpunit(61): PHPUnit\TextUI\Command::main()
26-Jan-2020 15:58:04 #10 {main}
26-Jan-2020 15:58:04 337) phpbb_textreparser_post_text_test::test_dry_run
26-Jan-2020 15:58:04 Error: Call to a member function getName() on null in /data/phpBB/phpbb/db/driver/doctrine.php:71
26-Jan-2020 15:58:04 Stack trace:
26-Jan-2020 15:58:04 #0 /data/phpBB/phpbb/db/tools/tools.php(167): phpbb\db\driver\doctrine->get_sql_layer()
26-Jan-2020 15:58:04 #1 /data/phpBB/phpbb/db/tools/factory.php(38): phpbb\db\tools\tools->__construct(Object(phpbb\db\driver\sqlite3), true)
26-Jan-2020 15:58:04 #2 /data/tests/test_framework/phpbb_database_test_case.php(82): phpbb\db\tools\factory->get(Object(phpbb\db\driver\sqlite3), true)
26-Jan-2020 15:58:04 #3 /data/phpBB/vendor/phpunit/phpunit/src/Framework/TestSuite.php(703): phpbb_database_test_case::setUpBeforeClass()
26-Jan-2020 15:58:04 #4 /data/phpBB/vendor/phpunit/phpunit/src/Framework/TestSuite.php(746): PHPUnit\Framework\TestSuite->run(Object(PHPUnit\Framework\TestResult))
26-Jan-2020 15:58:04 #5 /data/phpBB/vendor/phpunit/phpunit/src/Framework/TestSuite.php(746): PHPUnit\Framework\TestSuite->run(Object(PHPUnit\Framework\TestResult))
26-Jan-2020 15:58:04 #6 /data/phpBB/vendor/phpunit/phpunit/src/TextUI/TestRunner.php(652): PHPUnit\Framework\TestSuite->run(Object(PHPUnit\Framework\TestResult))
26-Jan-2020 15:58:04 #7 /data/phpBB/vendor/phpunit/phpunit/src/TextUI/Command.php(206): PHPUnit\TextUI\TestRunner->doRun(Object(PHPUnit\Framework\TestSuite), Array, true)
26-Jan-2020 15:58:04 #8 /data/phpBB/vendor/phpunit/phpunit/src/TextUI/Command.php(162): PHPUnit\TextUI\Command->run(Array, true)
26-Jan-2020 15:58:04 #9 /data/phpBB/vendor/phpunit/phpunit/phpunit(61): PHPUnit\TextUI\Command::main()
26-Jan-2020 15:58:04 #10 {main}
26-Jan-2020 15:58:04 338) phpbb_textreparser_post_text_test::test_reparse
26-Jan-2020 15:58:04 Error: Call to a member function getName() on null in /data/phpBB/phpbb/db/driver/doctrine.php:71
26-Jan-2020 15:58:04 Stack trace:
26-Jan-2020 15:58:04 #0 /data/phpBB/phpbb/db/tools/tools.php(167): phpbb\db\driver\doctrine->get_sql_layer()
26-Jan-2020 15:58:04 #1 /data/phpBB/phpbb/db/tools/factory.php(38): phpbb\db\tools\tools->__construct(Object(phpbb\db\driver\sqlite3), true)
26-Jan-2020 15:58:04 #2 /data/tests/test_framework/phpbb_database_test_case.php(82): phpbb\db\tools\factory->get(Object(phpbb\db\driver\sqlite3), true)
26-Jan-2020 15:58:04 #3 /data/phpBB/vendor/phpunit/phpunit/src/Framework/TestSuite.php(703): phpbb_database_test_case::setUpBeforeClass()
26-Jan-2020 15:58:04 #4 /data/phpBB/vendor/phpunit/phpunit/src/Framework/TestSuite.php(746): PHPUnit\Framework\TestSuite->run(Object(PHPUnit\Framework\TestResult))
26-Jan-2020 15:58:04 #5 /data/phpBB/vendor/phpunit/phpunit/src/Framework/TestSuite.php(746): PHPUnit\Framework\TestSuite->run(Object(PHPUnit\Framework\TestResult))
26-Jan-2020 15:58:04 #6 /data/phpBB/vendor/phpunit/phpunit/src/TextUI/TestRunner.php(652): PHPUnit\Framework\TestSuite->run(Object(PHPUnit\Framework\TestResult))
26-Jan-2020 15:58:04 #7 /data/phpBB/vendor/phpunit/phpunit/src/TextUI/Command.php(206): PHPUnit\TextUI\TestRunner->doRun(Object(PHPUnit\Framework\TestSuite), Array, true)
26-Jan-2020 15:58:04 #8 /data/phpBB/vendor/phpunit/phpunit/src/TextUI/Command.php(162): PHPUnit\TextUI\Command->run(Array, true)
26-Jan-2020 15:58:04 #9 /data/phpBB/vendor/phpunit/phpunit/phpunit(61): PHPUnit\TextUI\Command::main()
26-Jan-2020 15:58:04 #10 {main}
26-Jan-2020 15:58:04 339) phpbb_textreparser_user_signature_test::test_get_max_id
26-Jan-2020 15:58:04 Error: Call to a member function getName() on null in /data/phpBB/phpbb/db/driver/doctrine.php:71
26-Jan-2020 15:58:04 Stack trace:
26-Jan-2020 15:58:04 #0 /data/phpBB/phpbb/db/tools/tools.php(167): phpbb\db\driver\doctrine->get_sql_layer()
26-Jan-2020 15:58:04 #1 /data/phpBB/phpbb/db/tools/factory.php(38): phpbb\db\tools\tools->__construct(Object(phpbb\db\driver\sqlite3), true)
26-Jan-2020 15:58:04 #2 /data/tests/test_framework/phpbb_database_test_case.php(82): phpbb\db\tools\factory->get(Object(phpbb\db\driver\sqlite3), true)
26-Jan-2020 15:58:04 #3 /data/phpBB/vendor/phpunit/phpunit/src/Framework/TestSuite.php(703): phpbb_database_test_case::setUpBeforeClass()
26-Jan-2020 15:58:04 #4 /data/phpBB/vendor/phpunit/phpunit/src/Framework/TestSuite.php(746): PHPUnit\Framework\TestSuite->run(Object(PHPUnit\Framework\TestResult))
26-Jan-2020 15:58:04 #5 /data/phpBB/vendor/phpunit/phpunit/src/Framework/TestSuite.php(746): PHPUnit\Framework\TestSuite->run(Object(PHPUnit\Framework\TestResult))
26-Jan-2020 15:58:04 #6 /data/phpBB/vendor/phpunit/phpunit/src/TextUI/TestRunner.php(652): PHPUnit\Framework\TestSuite->run(Object(PHPUnit\Framework\TestResult))
26-Jan-2020 15:58:04 #7 /data/phpBB/vendor/phpunit/phpunit/src/TextUI/Command.php(206): PHPUnit\TextUI\TestRunner->doRun(Object(PHPUnit\Framework\TestSuite), Array, true)
26-Jan-2020 15:58:04 #8 /data/phpBB/vendor/phpunit/phpunit/src/TextUI/Command.php(162): PHPUnit\TextUI\Command->run(Array, true)
26-Jan-2020 15:58:04 #9 /data/phpBB/vendor/phpunit/phpunit/phpunit(61): PHPUnit\TextUI\Command::main()
26-Jan-2020 15:58:04 #10 {main}
26-Jan-2020 15:58:04 340) phpbb_textreparser_user_signature_test::test_dry_run
26-Jan-2020 15:58:04 Error: Call to a member function getName() on null in /data/phpBB/phpbb/db/driver/doctrine.php:71
26-Jan-2020 15:58:04 Stack trace:
26-Jan-2020 15:58:04 #0 /data/phpBB/phpbb/db/tools/tools.php(167): phpbb\db\driver\doctrine->get_sql_layer()
26-Jan-2020 15:58:04 #1 /data/phpBB/phpbb/db/tools/factory.php(38): phpbb\db\tools\tools->__construct(Object(phpbb\db\driver\sqlite3), true)
26-Jan-2020 15:58:04 #2 /data/tests/test_framework/phpbb_database_test_case.php(82): phpbb\db\tools\factory->get(Object(phpbb\db\driver\sqlite3), true)
26-Jan-2020 15:58:04 #3 /data/phpBB/vendor/phpunit/phpunit/src/Framework/TestSuite.php(703): phpbb_database_test_case::setUpBeforeClass()
26-Jan-2020 15:58:04 #4 /data/phpBB/vendor/phpunit/phpunit/src/Framework/TestSuite.php(746): PHPUnit\Framework\TestSuite->run(Object(PHPUnit\Framework\TestResult))
26-Jan-2020 15:58:04 #5 /data/phpBB/vendor/phpunit/phpunit/src/Framework/TestSuite.php(746): PHPUnit\Framework\TestSuite->run(Object(PHPUnit\Framework\TestResult))
26-Jan-2020 15:58:04 #6 /data/phpBB/vendor/phpunit/phpunit/src/TextUI/TestRunner.php(652): PHPUnit\Framework\TestSuite->run(Object(PHPUnit\Framework\TestResult))
26-Jan-2020 15:58:04 #7 /data/phpBB/vendor/phpunit/phpunit/src/TextUI/Command.php(206): PHPUnit\TextUI\TestRunner->doRun(Object(PHPUnit\Framework\TestSuite), Array, true)
26-Jan-2020 15:58:04 #8 /data/phpBB/vendor/phpunit/phpunit/src/TextUI/Command.php(162): PHPUnit\TextUI\Command->run(Array, true)
26-Jan-2020 15:58:04 #9 /data/phpBB/vendor/phpunit/phpunit/phpunit(61): PHPUnit\TextUI\Command::main()
26-Jan-2020 15:58:04 #10 {main}
26-Jan-2020 15:58:04 341) phpbb_textreparser_user_signature_test::test_reparse
26-Jan-2020 15:58:04 Error: Call to a member function getName() on null in /data/phpBB/phpbb/db/driver/doctrine.php:71
26-Jan-2020 15:58:04 Stack trace:
26-Jan-2020 15:58:04 #0 /data/phpBB/phpbb/db/tools/tools.php(167): phpbb\db\driver\doctrine->get_sql_layer()
26-Jan-2020 15:58:04 #1 /data/phpBB/phpbb/db/tools/factory.php(38): phpbb\db\tools\tools->__construct(Object(phpbb\db\driver\sqlite3), true)
26-Jan-2020 15:58:04 #2 /data/tests/test_framework/phpbb_database_test_case.php(82): phpbb\db\tools\factory->get(Object(phpbb\db\driver\sqlite3), true)
26-Jan-2020 15:58:04 #3 /data/phpBB/vendor/phpunit/phpunit/src/Framework/TestSuite.php(703): phpbb_database_test_case::setUpBeforeClass()
26-Jan-2020 15:58:04 #4 /data/phpBB/vendor/phpunit/phpunit/src/Framework/TestSuite.php(746): PHPUnit\Framework\TestSuite->run(Object(PHPUnit\Framework\TestResult))
26-Jan-2020 15:58:04 #5 /data/phpBB/vendor/phpunit/phpunit/src/Framework/TestSuite.php(746): PHPUnit\Framework\TestSuite->run(Object(PHPUnit\Framework\TestResult))
26-Jan-2020 15:58:04 #6 /data/phpBB/vendor/phpunit/phpunit/src/TextUI/TestRunner.php(652): PHPUnit\Framework\TestSuite->run(Object(PHPUnit\Framework\TestResult))
26-Jan-2020 15:58:04 #7 /data/phpBB/vendor/phpunit/phpunit/src/TextUI/Command.php(206): PHPUnit\TextUI\TestRunner->doRun(Object(PHPUnit\Framework\TestSuite), Array, true)
26-Jan-2020 15:58:04 #8 /data/phpBB/vendor/phpunit/phpunit/src/TextUI/Command.php(162): PHPUnit\TextUI\Command->run(Array, true)
26-Jan-2020 15:58:04 #9 /data/phpBB/vendor/phpunit/phpunit/phpunit(61): PHPUnit\TextUI\Command::main()
26-Jan-2020 15:58:04 #10 {main}
26-Jan-2020 15:58:04 342) phpbb_tests_tree_nestedset_forum_get_data_test::test_get_path_and_subtree_data
26-Jan-2020 15:58:04 Error: Call to a member function getName() on null in /data/phpBB/phpbb/db/driver/doctrine.php:71
26-Jan-2020 15:58:04 Stack trace:
26-Jan-2020 15:58:04 #0 /data/phpBB/phpbb/db/tools/tools.php(167): phpbb\db\driver\doctrine->get_sql_layer()
26-Jan-2020 15:58:04 #1 /data/phpBB/phpbb/db/tools/factory.php(38): phpbb\db\tools\tools->__construct(Object(phpbb\db\driver\sqlite3), true)
26-Jan-2020 15:58:04 #2 /data/tests/test_framework/phpbb_database_test_case.php(82): phpbb\db\tools\factory->get(Object(phpbb\db\driver\sqlite3), true)
26-Jan-2020 15:58:04 #3 /data/phpBB/vendor/phpunit/phpunit/src/Framework/TestSuite.php(703): phpbb_database_test_case::setUpBeforeClass()
26-Jan-2020 15:58:04 #4 /data/phpBB/vendor/phpunit/phpunit/src/Framework/TestSuite.php(746): PHPUnit\Framework\TestSuite->run(Object(PHPUnit\Framework\TestResult))
26-Jan-2020 15:58:04 #5 /data/phpBB/vendor/phpunit/phpunit/src/Framework/TestSuite.php(746): PHPUnit\Framework\TestSuite->run(Object(PHPUnit\Framework\TestResult))
26-Jan-2020 15:58:04 #6 /data/phpBB/vendor/phpunit/phpunit/src/TextUI/TestRunner.php(652): PHPUnit\Framework\TestSuite->run(Object(PHPUnit\Framework\TestResult))
26-Jan-2020 15:58:04 #7 /data/phpBB/vendor/phpunit/phpunit/src/TextUI/Command.php(206): PHPUnit\TextUI\TestRunner->doRun(Object(PHPUnit\Framework\TestSuite), Array, true)
26-Jan-2020 15:58:04 #8 /data/phpBB/vendor/phpunit/phpunit/src/TextUI/Command.php(162): PHPUnit\TextUI\Command->run(Array, true)
26-Jan-2020 15:58:04 #9 /data/phpBB/vendor/phpunit/phpunit/phpunit(61): PHPUnit\TextUI\Command::main()
26-Jan-2020 15:58:04 #10 {main}
26-Jan-2020 15:58:04 343) phpbb_tests_tree_nestedset_forum_get_data_test::test_get_path_data
26-Jan-2020 15:58:04 Error: Call to a member function getName() on null in /data/phpBB/phpbb/db/driver/doctrine.php:71
26-Jan-2020 15:58:04 Stack trace:
26-Jan-2020 15:58:04 #0 /data/phpBB/phpbb/db/tools/tools.php(167): phpbb\db\driver\doctrine->get_sql_layer()
26-Jan-2020 15:58:04 #1 /data/phpBB/phpbb/db/tools/factory.php(38): phpbb\db\tools\tools->__construct(Object(phpbb\db\driver\sqlite3), true)
26-Jan-2020 15:58:04 #2 /data/tests/test_framework/phpbb_database_test_case.php(82): phpbb\db\tools\factory->get(Object(phpbb\db\driver\sqlite3), true)
26-Jan-2020 15:58:04 #3 /data/phpBB/vendor/phpunit/phpunit/src/Framework/TestSuite.php(703): phpbb_database_test_case::setUpBeforeClass()
26-Jan-2020 15:58:04 #4 /data/phpBB/vendor/phpunit/phpunit/src/Framework/TestSuite.php(746): PHPUnit\Framework\TestSuite->run(Object(PHPUnit\Framework\TestResult))
26-Jan-2020 15:58:04 #5 /data/phpBB/vendor/phpunit/phpunit/src/Framework/TestSuite.php(746): PHPUnit\Framework\TestSuite->run(Object(PHPUnit\Framework\TestResult))
26-Jan-2020 15:58:04 #6 /data/phpBB/vendor/phpunit/phpunit/src/TextUI/TestRunner.php(652): PHPUnit\Framework\TestSuite->run(Object(PHPUnit\Framework\TestResult))
26-Jan-2020 15:58:04 #7 /data/phpBB/vendor/phpunit/phpunit/src/TextUI/Command.php(206): PHPUnit\TextUI\TestRunner->doRun(Object(PHPUnit\Framework\TestSuite), Array, true)
26-Jan-2020 15:58:04 #8 /data/phpBB/vendor/phpunit/phpunit/src/TextUI/Command.php(162): PHPUnit\TextUI\Command->run(Array, true)
26-Jan-2020 15:58:04 #9 /data/phpBB/vendor/phpunit/phpunit/phpunit(61): PHPUnit\TextUI\Command::main()
26-Jan-2020 15:58:04 #10 {main}
26-Jan-2020 15:58:04 344) phpbb_tests_tree_nestedset_forum_get_data_test::test_get_subtree_data
26-Jan-2020 15:58:04 Error: Call to a member function getName() on null in /data/phpBB/phpbb/db/driver/doctrine.php:71
26-Jan-2020 15:58:04 Stack trace:
26-Jan-2020 15:58:04 #0 /data/phpBB/phpbb/db/tools/tools.php(167): phpbb\db\driver\doctrine->get_sql_layer()
26-Jan-2020 15:58:04 #1 /data/phpBB/phpbb/db/tools/factory.php(38): phpbb\db\tools\tools->__construct(Object(phpbb\db\driver\sqlite3), true)
26-Jan-2020 15:58:04 #2 /data/tests/test_framework/phpbb_database_test_case.php(82): phpbb\db\tools\factory->get(Object(phpbb\db\driver\sqlite3), true)
26-Jan-2020 15:58:04 #3 /data/phpBB/vendor/phpunit/phpunit/src/Framework/TestSuite.php(703): phpbb_database_test_case::setUpBeforeClass()
26-Jan-2020 15:58:04 #4 /data/phpBB/vendor/phpunit/phpunit/src/Framework/TestSuite.php(746): PHPUnit\Framework\TestSuite->run(Object(PHPUnit\Framework\TestResult))
26-Jan-2020 15:58:04 #5 /data/phpBB/vendor/phpunit/phpunit/src/Framework/TestSuite.php(746): PHPUnit\Framework\TestSuite->run(Object(PHPUnit\Framework\TestResult))
26-Jan-2020 15:58:04 #6 /data/phpBB/vendor/phpunit/phpunit/src/TextUI/TestRunner.php(652): PHPUnit\Framework\TestSuite->run(Object(PHPUnit\Framework\TestResult))
26-Jan-2020 15:58:04 #7 /data/phpBB/vendor/phpunit/phpunit/src/TextUI/Command.php(206): PHPUnit\TextUI\TestRunner->doRun(Object(PHPUnit\Framework\TestSuite), Array, true)
26-Jan-2020 15:58:04 #8 /data/phpBB/vendor/phpunit/phpunit/src/TextUI/Command.php(162): PHPUnit\TextUI\Command->run(Array, true)
26-Jan-2020 15:58:04 #9 /data/phpBB/vendor/phpunit/phpunit/phpunit(61): PHPUnit\TextUI\Command::main()
26-Jan-2020 15:58:04 #10 {main}
26-Jan-2020 15:58:04 345) phpbb_tests_tree_nestedset_forum_get_data_test::test_get_path_basic_data
26-Jan-2020 15:58:04 Error: Call to a member function getName() on null in /data/phpBB/phpbb/db/driver/doctrine.php:71
26-Jan-2020 15:58:04 Stack trace:
26-Jan-2020 15:58:04 #0 /data/phpBB/phpbb/db/tools/tools.php(167): phpbb\db\driver\doctrine->get_sql_layer()
26-Jan-2020 15:58:04 #1 /data/phpBB/phpbb/db/tools/factory.php(38): phpbb\db\tools\tools->__construct(Object(phpbb\db\driver\sqlite3), true)
26-Jan-2020 15:58:04 #2 /data/tests/test_framework/phpbb_database_test_case.php(82): phpbb\db\tools\factory->get(Object(phpbb\db\driver\sqlite3), true)
26-Jan-2020 15:58:04 #3 /data/phpBB/vendor/phpunit/phpunit/src/Framework/TestSuite.php(703): phpbb_database_test_case::setUpBeforeClass()
26-Jan-2020 15:58:04 #4 /data/phpBB/vendor/phpunit/phpunit/src/Framework/TestSuite.php(746): PHPUnit\Framework\TestSuite->run(Object(PHPUnit\Framework\TestResult))
26-Jan-2020 15:58:04 #5 /data/phpBB/vendor/phpunit/phpunit/src/Framework/TestSuite.php(746): PHPUnit\Framework\TestSuite->run(Object(PHPUnit\Framework\TestResult))
26-Jan-2020 15:58:04 #6 /data/phpBB/vendor/phpunit/phpunit/src/TextUI/TestRunner.php(652): PHPUnit\Framework\TestSuite->run(Object(PHPUnit\Framework\TestResult))
26-Jan-2020 15:58:04 #7 /data/phpBB/vendor/phpunit/phpunit/src/TextUI/Command.php(206): PHPUnit\TextUI\TestRunner->doRun(Object(PHPUnit\Framework\TestSuite), Array, true)
26-Jan-2020 15:58:04 #8 /data/phpBB/vendor/phpunit/phpunit/src/TextUI/Command.php(162): PHPUnit\TextUI\Command->run(Array, true)
26-Jan-2020 15:58:04 #9 /data/phpBB/vendor/phpunit/phpunit/phpunit(61): PHPUnit\TextUI\Command::main()
26-Jan-2020 15:58:04 #10 {main}
26-Jan-2020 15:58:04 346) phpbb_tests_tree_nestedset_forum_get_data_test::test_get_all_tree_data
26-Jan-2020 15:58:04 Error: Call to a member function getName() on null in /data/phpBB/phpbb/db/driver/doctrine.php:71
26-Jan-2020 15:58:04 Stack trace:
26-Jan-2020 15:58:04 #0 /data/phpBB/phpbb/db/tools/tools.php(167): phpbb\db\driver\doctrine->get_sql_layer()
26-Jan-2020 15:58:04 #1 /data/phpBB/phpbb/db/tools/factory.php(38): phpbb\db\tools\tools->__construct(Object(phpbb\db\driver\sqlite3), true)
26-Jan-2020 15:58:04 #2 /data/tests/test_framework/phpbb_database_test_case.php(82): phpbb\db\tools\factory->get(Object(phpbb\db\driver\sqlite3), true)
26-Jan-2020 15:58:04 #3 /data/phpBB/vendor/phpunit/phpunit/src/Framework/TestSuite.php(703): phpbb_database_test_case::setUpBeforeClass()
26-Jan-2020 15:58:04 #4 /data/phpBB/vendor/phpunit/phpunit/src/Framework/TestSuite.php(746): PHPUnit\Framework\TestSuite->run(Object(PHPUnit\Framework\TestResult))
26-Jan-2020 15:58:04 #5 /data/phpBB/vendor/phpunit/phpunit/src/Framework/TestSuite.php(746): PHPUnit\Framework\TestSuite->run(Object(PHPUnit\Framework\TestResult))
26-Jan-2020 15:58:04 #6 /data/phpBB/vendor/phpunit/phpunit/src/TextUI/TestRunner.php(652): PHPUnit\Framework\TestSuite->run(Object(PHPUnit\Framework\TestResult))
26-Jan-2020 15:58:04 #7 /data/phpBB/vendor/phpunit/phpunit/src/TextUI/Command.php(206): PHPUnit\TextUI\TestRunner->doRun(Object(PHPUnit\Framework\TestSuite), Array, true)
26-Jan-2020 15:58:04 #8 /data/phpBB/vendor/phpunit/phpunit/src/TextUI/Command.php(162): PHPUnit\TextUI\Command->run(Array, true)
26-Jan-2020 15:58:04 #9 /data/phpBB/vendor/phpunit/phpunit/phpunit(61): PHPUnit\TextUI\Command::main()
26-Jan-2020 15:58:04 #10 {main}
26-Jan-2020 15:58:04 347) phpbb_tests_tree_nestedset_forum_add_remove_test::test_delete
26-Jan-2020 15:58:04 Error: Call to a member function getName() on null in /data/phpBB/phpbb/db/driver/doctrine.php:71
26-Jan-2020 15:58:04 Stack trace:
26-Jan-2020 15:58:04 #0 /data/phpBB/phpbb/db/tools/tools.php(167): phpbb\db\driver\doctrine->get_sql_layer()
26-Jan-2020 15:58:04 #1 /data/phpBB/phpbb/db/tools/factory.php(38): phpbb\db\tools\tools->__construct(Object(phpbb\db\driver\sqlite3), true)
26-Jan-2020 15:58:04 #2 /data/tests/test_framework/phpbb_database_test_case.php(82): phpbb\db\tools\factory->get(Object(phpbb\db\driver\sqlite3), true)
26-Jan-2020 15:58:04 #3 /data/phpBB/vendor/phpunit/phpunit/src/Framework/TestSuite.php(703): phpbb_database_test_case::setUpBeforeClass()
26-Jan-2020 15:58:04 #4 /data/phpBB/vendor/phpunit/phpunit/src/Framework/TestSuite.php(746): PHPUnit\Framework\TestSuite->run(Object(PHPUnit\Framework\TestResult))
26-Jan-2020 15:58:04 #5 /data/phpBB/vendor/phpunit/phpunit/src/Framework/TestSuite.php(746): PHPUnit\Framework\TestSuite->run(Object(PHPUnit\Framework\TestResult))
26-Jan-2020 15:58:04 #6 /data/phpBB/vendor/phpunit/phpunit/src/TextUI/TestRunner.php(652): PHPUnit\Framework\TestSuite->run(Object(PHPUnit\Framework\TestResult))
26-Jan-2020 15:58:04 #7 /data/phpBB/vendor/phpunit/phpunit/src/TextUI/Command.php(206): PHPUnit\TextUI\TestRunner->doRun(Object(PHPUnit\Framework\TestSuite), Array, true)
26-Jan-2020 15:58:04 #8 /data/phpBB/vendor/phpunit/phpunit/src/TextUI/Command.php(162): PHPUnit\TextUI\Command->run(Array, true)
26-Jan-2020 15:58:04 #9 /data/phpBB/vendor/phpunit/phpunit/phpunit(61): PHPUnit\TextUI\Command::main()
26-Jan-2020 15:58:04 #10 {main}
26-Jan-2020 15:58:04 348) phpbb_tests_tree_nestedset_forum_add_remove_test::test_delete_throws
26-Jan-2020 15:58:04 Error: Call to a member function getName() on null in /data/phpBB/phpbb/db/driver/doctrine.php:71
26-Jan-2020 15:58:04 Stack trace:
26-Jan-2020 15:58:04 #0 /data/phpBB/phpbb/db/tools/tools.php(167): phpbb\db\driver\doctrine->get_sql_layer()
26-Jan-2020 15:58:04 #1 /data/phpBB/phpbb/db/tools/factory.php(38): phpbb\db\tools\tools->__construct(Object(phpbb\db\driver\sqlite3), true)
26-Jan-2020 15:58:04 #2 /data/tests/test_framework/phpbb_database_test_case.php(82): phpbb\db\tools\factory->get(Object(phpbb\db\driver\sqlite3), true)
26-Jan-2020 15:58:04 #3 /data/phpBB/vendor/phpunit/phpunit/src/Framework/TestSuite.php(703): phpbb_database_test_case::setUpBeforeClass()
26-Jan-2020 15:58:04 #4 /data/phpBB/vendor/phpunit/phpunit/src/Framework/TestSuite.php(746): PHPUnit\Framework\TestSuite->run(Object(PHPUnit\Framework\TestResult))
26-Jan-2020 15:58:04 #5 /data/phpBB/vendor/phpunit/phpunit/src/Framework/TestSuite.php(746): PHPUnit\Framework\TestSuite->run(Object(PHPUnit\Framework\TestResult))
26-Jan-2020 15:58:04 #6 /data/phpBB/vendor/phpunit/phpunit/src/TextUI/TestRunner.php(652): PHPUnit\Framework\TestSuite->run(Object(PHPUnit\Framework\TestResult))
26-Jan-2020 15:58:04 #7 /data/phpBB/vendor/phpunit/phpunit/src/TextUI/Command.php(206): PHPUnit\TextUI\TestRunner->doRun(Object(PHPUnit\Framework\TestSuite), Array, true)
26-Jan-2020 15:58:04 #8 /data/phpBB/vendor/phpunit/phpunit/src/TextUI/Command.php(162): PHPUnit\TextUI\Command->run(Array, true)
26-Jan-2020 15:58:04 #9 /data/phpBB/vendor/phpunit/phpunit/phpunit(61): PHPUnit\TextUI\Command::main()
26-Jan-2020 15:58:04 #10 {main}
26-Jan-2020 15:58:04 349) phpbb_tests_tree_nestedset_forum_add_remove_test::test_insert
26-Jan-2020 15:58:04 Error: Call to a member function getName() on null in /data/phpBB/phpbb/db/driver/doctrine.php:71
26-Jan-2020 15:58:04 Stack trace:
26-Jan-2020 15:58:04 #0 /data/phpBB/phpbb/db/tools/tools.php(167): phpbb\db\driver\doctrine->get_sql_layer()
26-Jan-2020 15:58:04 #1 /data/phpBB/phpbb/db/tools/factory.php(38): phpbb\db\tools\tools->__construct(Object(phpbb\db\driver\sqlite3), true)
26-Jan-2020 15:58:04 #2 /data/tests/test_framework/phpbb_database_test_case.php(82): phpbb\db\tools\factory->get(Object(phpbb\db\driver\sqlite3), true)
26-Jan-2020 15:58:04 #3 /data/phpBB/vendor/phpunit/phpunit/src/Framework/TestSuite.php(703): phpbb_database_test_case::setUpBeforeClass()
26-Jan-2020 15:58:04 #4 /data/phpBB/vendor/phpunit/phpunit/src/Framework/TestSuite.php(746): PHPUnit\Framework\TestSuite->run(Object(PHPUnit\Framework\TestResult))
26-Jan-2020 15:58:04 #5 /data/phpBB/vendor/phpunit/phpunit/src/Framework/TestSuite.php(746): PHPUnit\Framework\TestSuite->run(Object(PHPUnit\Framework\TestResult))
26-Jan-2020 15:58:04 #6 /data/phpBB/vendor/phpunit/phpunit/src/TextUI/TestRunner.php(652): PHPUnit\Framework\TestSuite->run(Object(PHPUnit\Framework\TestResult))
26-Jan-2020 15:58:04 #7 /data/phpBB/vendor/phpunit/phpunit/src/TextUI/Command.php(206): PHPUnit\TextUI\TestRunner->doRun(Object(PHPUnit\Framework\TestSuite), Array, true)
26-Jan-2020 15:58:04 #8 /data/phpBB/vendor/phpunit/phpunit/src/TextUI/Command.php(162): PHPUnit\TextUI\Command->run(Array, true)
26-Jan-2020 15:58:04 #9 /data/phpBB/vendor/phpunit/phpunit/phpunit(61): PHPUnit\TextUI\Command::main()
26-Jan-2020 15:58:04 #10 {main}
26-Jan-2020 15:58:04 350) phpbb_tests_tree_nestedset_forum_move_test::test_move
26-Jan-2020 15:58:04 Error: Call to a member function getName() on null in /data/phpBB/phpbb/db/driver/doctrine.php:71
26-Jan-2020 15:58:04 Stack trace:
26-Jan-2020 15:58:04 #0 /data/phpBB/phpbb/db/tools/tools.php(167): phpbb\db\driver\doctrine->get_sql_layer()
26-Jan-2020 15:58:04 #1 /data/phpBB/phpbb/db/tools/factory.php(38): phpbb\db\tools\tools->__construct(Object(phpbb\db\driver\sqlite3), true)
26-Jan-2020 15:58:04 #2 /data/tests/test_framework/phpbb_database_test_case.php(82): phpbb\db\tools\factory->get(Object(phpbb\db\driver\sqlite3), true)
26-Jan-2020 15:58:04 #3 /data/phpBB/vendor/phpunit/phpunit/src/Framework/TestSuite.php(703): phpbb_database_test_case::setUpBeforeClass()
26-Jan-2020 15:58:04 #4 /data/phpBB/vendor/phpunit/phpunit/src/Framework/TestSuite.php(746): PHPUnit\Framework\TestSuite->run(Object(PHPUnit\Framework\TestResult))
26-Jan-2020 15:58:04 #5 /data/phpBB/vendor/phpunit/phpunit/src/Framework/TestSuite.php(746): PHPUnit\Framework\TestSuite->run(Object(PHPUnit\Framework\TestResult))
26-Jan-2020 15:58:04 #6 /data/phpBB/vendor/phpunit/phpunit/src/TextUI/TestRunner.php(652): PHPUnit\Framework\TestSuite->run(Object(PHPUnit\Framework\TestResult))
26-Jan-2020 15:58:04 #7 /data/phpBB/vendor/phpunit/phpunit/src/TextUI/Command.php(206): PHPUnit\TextUI\TestRunner->doRun(Object(PHPUnit\Framework\TestSuite), Array, true)
26-Jan-2020 15:58:04 #8 /data/phpBB/vendor/phpunit/phpunit/src/TextUI/Command.php(162): PHPUnit\TextUI\Command->run(Array, true)
26-Jan-2020 15:58:04 #9 /data/phpBB/vendor/phpunit/phpunit/phpunit(61): PHPUnit\TextUI\Command::main()
26-Jan-2020 15:58:04 #10 {main}
26-Jan-2020 15:58:04 351) phpbb_tests_tree_nestedset_forum_move_test::test_move_down
26-Jan-2020 15:58:04 Error: Call to a member function getName() on null in /data/phpBB/phpbb/db/driver/doctrine.php:71
26-Jan-2020 15:58:04 Stack trace:
26-Jan-2020 15:58:04 #0 /data/phpBB/phpbb/db/tools/tools.php(167): phpbb\db\driver\doctrine->get_sql_layer()
26-Jan-2020 15:58:04 #1 /data/phpBB/phpbb/db/tools/factory.php(38): phpbb\db\tools\tools->__construct(Object(phpbb\db\driver\sqlite3), true)
26-Jan-2020 15:58:04 #2 /data/tests/test_framework/phpbb_database_test_case.php(82): phpbb\db\tools\factory->get(Object(phpbb\db\driver\sqlite3), true)
26-Jan-2020 15:58:04 #3 /data/phpBB/vendor/phpunit/phpunit/src/Framework/TestSuite.php(703): phpbb_database_test_case::setUpBeforeClass()
26-Jan-2020 15:58:04 #4 /data/phpBB/vendor/phpunit/phpunit/src/Framework/TestSuite.php(746): PHPUnit\Framework\TestSuite->run(Object(PHPUnit\Framework\TestResult))
26-Jan-2020 15:58:04 #5 /data/phpBB/vendor/phpunit/phpunit/src/Framework/TestSuite.php(746): PHPUnit\Framework\TestSuite->run(Object(PHPUnit\Framework\TestResult))
26-Jan-2020 15:58:04 #6 /data/phpBB/vendor/phpunit/phpunit/src/TextUI/TestRunner.php(652): PHPUnit\Framework\TestSuite->run(Object(PHPUnit\Framework\TestResult))
26-Jan-2020 15:58:04 #7 /data/phpBB/vendor/phpunit/phpunit/src/TextUI/Command.php(206): PHPUnit\TextUI\TestRunner->doRun(Object(PHPUnit\Framework\TestSuite), Array, true)
26-Jan-2020 15:58:04 #8 /data/phpBB/vendor/phpunit/phpunit/src/TextUI/Command.php(162): PHPUnit\TextUI\Command->run(Array, true)
26-Jan-2020 15:58:04 #9 /data/phpBB/vendor/phpunit/phpunit/phpunit(61): PHPUnit\TextUI\Command::main()
26-Jan-2020 15:58:04 #10 {main}
26-Jan-2020 15:58:04 352) phpbb_tests_tree_nestedset_forum_move_test::test_move_up
26-Jan-2020 15:58:04 Error: Call to a member function getName() on null in /data/phpBB/phpbb/db/driver/doctrine.php:71
26-Jan-2020 15:58:04 Stack trace:
26-Jan-2020 15:58:04 #0 /data/phpBB/phpbb/db/tools/tools.php(167): phpbb\db\driver\doctrine->get_sql_layer()
26-Jan-2020 15:58:04 #1 /data/phpBB/phpbb/db/tools/factory.php(38): phpbb\db\tools\tools->__construct(Object(phpbb\db\driver\sqlite3), true)
26-Jan-2020 15:58:04 #2 /data/tests/test_framework/phpbb_database_test_case.php(82): phpbb\db\tools\factory->get(Object(phpbb\db\driver\sqlite3), true)
26-Jan-2020 15:58:04 #3 /data/phpBB/vendor/phpunit/phpunit/src/Framework/TestSuite.php(703): phpbb_database_test_case::setUpBeforeClass()
26-Jan-2020 15:58:04 #4 /data/phpBB/vendor/phpunit/phpunit/src/Framework/TestSuite.php(746): PHPUnit\Framework\TestSuite->run(Object(PHPUnit\Framework\TestResult))
26-Jan-2020 15:58:04 #5 /data/phpBB/vendor/phpunit/phpunit/src/Framework/TestSuite.php(746): PHPUnit\Framework\TestSuite->run(Object(PHPUnit\Framework\TestResult))
26-Jan-2020 15:58:04 #6 /data/phpBB/vendor/phpunit/phpunit/src/TextUI/TestRunner.php(652): PHPUnit\Framework\TestSuite->run(Object(PHPUnit\Framework\TestResult))
26-Jan-2020 15:58:04 #7 /data/phpBB/vendor/phpunit/phpunit/src/TextUI/Command.php(206): PHPUnit\TextUI\TestRunner->doRun(Object(PHPUnit\Framework\TestSuite), Array, true)
26-Jan-2020 15:58:04 #8 /data/phpBB/vendor/phpunit/phpunit/src/TextUI/Command.php(162): PHPUnit\TextUI\Command->run(Array, true)
26-Jan-2020 15:58:04 #9 /data/phpBB/vendor/phpunit/phpunit/phpunit(61): PHPUnit\TextUI\Command::main()
26-Jan-2020 15:58:04 #10 {main}
26-Jan-2020 15:58:04 353) phpbb_tests_tree_nestedset_forum_move_test::test_move_children
26-Jan-2020 15:58:04 Error: Call to a member function getName() on null in /data/phpBB/phpbb/db/driver/doctrine.php:71
26-Jan-2020 15:58:04 Stack trace:
26-Jan-2020 15:58:04 #0 /data/phpBB/phpbb/db/tools/tools.php(167): phpbb\db\driver\doctrine->get_sql_layer()
26-Jan-2020 15:58:04 #1 /data/phpBB/phpbb/db/tools/factory.php(38): phpbb\db\tools\tools->__construct(Object(phpbb\db\driver\sqlite3), true)
26-Jan-2020 15:58:04 #2 /data/tests/test_framework/phpbb_database_test_case.php(82): phpbb\db\tools\factory->get(Object(phpbb\db\driver\sqlite3), true)
26-Jan-2020 15:58:04 #3 /data/phpBB/vendor/phpunit/phpunit/src/Framework/TestSuite.php(703): phpbb_database_test_case::setUpBeforeClass()
26-Jan-2020 15:58:04 #4 /data/phpBB/vendor/phpunit/phpunit/src/Framework/TestSuite.php(746): PHPUnit\Framework\TestSuite->run(Object(PHPUnit\Framework\TestResult))
26-Jan-2020 15:58:04 #5 /data/phpBB/vendor/phpunit/phpunit/src/Framework/TestSuite.php(746): PHPUnit\Framework\TestSuite->run(Object(PHPUnit\Framework\TestResult))
26-Jan-2020 15:58:04 #6 /data/phpBB/vendor/phpunit/phpunit/src/TextUI/TestRunner.php(652): PHPUnit\Framework\TestSuite->run(Object(PHPUnit\Framework\TestResult))
26-Jan-2020 15:58:04 #7 /data/phpBB/vendor/phpunit/phpunit/src/TextUI/Command.php(206): PHPUnit\TextUI\TestRunner->doRun(Object(PHPUnit\Framework\TestSuite), Array, true)
26-Jan-2020 15:58:04 #8 /data/phpBB/vendor/phpunit/phpunit/src/TextUI/Command.php(162): PHPUnit\TextUI\Command->run(Array, true)
26-Jan-2020 15:58:04 #9 /data/phpBB/vendor/phpunit/phpunit/phpunit(61): PHPUnit\TextUI\Command::main()
26-Jan-2020 15:58:04 #10 {main}
26-Jan-2020 15:58:04 354) phpbb_tests_tree_nestedset_forum_move_test::test_move_children_throws_item
26-Jan-2020 15:58:04 Error: Call to a member function getName() on null in /data/phpBB/phpbb/db/driver/doctrine.php:71
26-Jan-2020 15:58:04 Stack trace:
26-Jan-2020 15:58:04 #0 /data/phpBB/phpbb/db/tools/tools.php(167): phpbb\db\driver\doctrine->get_sql_layer()
26-Jan-2020 15:58:04 #1 /data/phpBB/phpbb/db/tools/factory.php(38): phpbb\db\tools\tools->__construct(Object(phpbb\db\driver\sqlite3), true)
26-Jan-2020 15:58:04 #2 /data/tests/test_framework/phpbb_database_test_case.php(82): phpbb\db\tools\factory->get(Object(phpbb\db\driver\sqlite3), true)
26-Jan-2020 15:58:04 #3 /data/phpBB/vendor/phpunit/phpunit/src/Framework/TestSuite.php(703): phpbb_database_test_case::setUpBeforeClass()
26-Jan-2020 15:58:04 #4 /data/phpBB/vendor/phpunit/phpunit/src/Framework/TestSuite.php(746): PHPUnit\Framework\TestSuite->run(Object(PHPUnit\Framework\TestResult))
26-Jan-2020 15:58:04 #5 /data/phpBB/vendor/phpunit/phpunit/src/Framework/TestSuite.php(746): PHPUnit\Framework\TestSuite->run(Object(PHPUnit\Framework\TestResult))
26-Jan-2020 15:58:04 #6 /data/phpBB/vendor/phpunit/phpunit/src/TextUI/TestRunner.php(652): PHPUnit\Framework\TestSuite->run(Object(PHPUnit\Framework\TestResult))
26-Jan-2020 15:58:04 #7 /data/phpBB/vendor/phpunit/phpunit/src/TextUI/Command.php(206): PHPUnit\TextUI\TestRunner->doRun(Object(PHPUnit\Framework\TestSuite), Array, true)
26-Jan-2020 15:58:04 #8 /data/phpBB/vendor/phpunit/phpunit/src/TextUI/Command.php(162): PHPUnit\TextUI\Command->run(Array, true)
26-Jan-2020 15:58:04 #9 /data/phpBB/vendor/phpunit/phpunit/phpunit(61): PHPUnit\TextUI\Command::main()
26-Jan-2020 15:58:04 #10 {main}
26-Jan-2020 15:58:04 355) phpbb_tests_tree_nestedset_forum_move_test::test_move_children_throws_parent
26-Jan-2020 15:58:04 Error: Call to a member function getName() on null in /data/phpBB/phpbb/db/driver/doctrine.php:71
26-Jan-2020 15:58:04 Stack trace:
26-Jan-2020 15:58:04 #0 /data/phpBB/phpbb/db/tools/tools.php(167): phpbb\db\driver\doctrine->get_sql_layer()
26-Jan-2020 15:58:04 #1 /data/phpBB/phpbb/db/tools/factory.php(38): phpbb\db\tools\tools->__construct(Object(phpbb\db\driver\sqlite3), true)
26-Jan-2020 15:58:04 #2 /data/tests/test_framework/phpbb_database_test_case.php(82): phpbb\db\tools\factory->get(Object(phpbb\db\driver\sqlite3), true)
26-Jan-2020 15:58:04 #3 /data/phpBB/vendor/phpunit/phpunit/src/Framework/TestSuite.php(703): phpbb_database_test_case::setUpBeforeClass()
26-Jan-2020 15:58:04 #4 /data/phpBB/vendor/phpunit/phpunit/src/Framework/TestSuite.php(746): PHPUnit\Framework\TestSuite->run(Object(PHPUnit\Framework\TestResult))
26-Jan-2020 15:58:04 #5 /data/phpBB/vendor/phpunit/phpunit/src/Framework/TestSuite.php(746): PHPUnit\Framework\TestSuite->run(Object(PHPUnit\Framework\TestResult))
26-Jan-2020 15:58:04 #6 /data/phpBB/vendor/phpunit/phpunit/src/TextUI/TestRunner.php(652): PHPUnit\Framework\TestSuite->run(Object(PHPUnit\Framework\TestResult))
26-Jan-2020 15:58:04 #7 /data/phpBB/vendor/phpunit/phpunit/src/TextUI/Command.php(206): PHPUnit\TextUI\TestRunner->doRun(Object(PHPUnit\Framework\TestSuite), Array, true)
26-Jan-2020 15:58:04 #8 /data/phpBB/vendor/phpunit/phpunit/src/TextUI/Command.php(162): PHPUnit\TextUI\Command->run(Array, true)
26-Jan-2020 15:58:04 #9 /data/phpBB/vendor/phpunit/phpunit/phpunit(61): PHPUnit\TextUI\Command::main()
26-Jan-2020 15:58:04 #10 {main}
26-Jan-2020 15:58:04 356) phpbb_tests_tree_nestedset_forum_move_test::test_change_parent
26-Jan-2020 15:58:04 Error: Call to a member function getName() on null in /data/phpBB/phpbb/db/driver/doctrine.php:71
26-Jan-2020 15:58:04 Stack trace:
26-Jan-2020 15:58:04 #0 /data/phpBB/phpbb/db/tools/tools.php(167): phpbb\db\driver\doctrine->get_sql_layer()
26-Jan-2020 15:58:04 #1 /data/phpBB/phpbb/db/tools/factory.php(38): phpbb\db\tools\tools->__construct(Object(phpbb\db\driver\sqlite3), true)
26-Jan-2020 15:58:04 #2 /data/tests/test_framework/phpbb_database_test_case.php(82): phpbb\db\tools\factory->get(Object(phpbb\db\driver\sqlite3), true)
26-Jan-2020 15:58:04 #3 /data/phpBB/vendor/phpunit/phpunit/src/Framework/TestSuite.php(703): phpbb_database_test_case::setUpBeforeClass()
26-Jan-2020 15:58:04 #4 /data/phpBB/vendor/phpunit/phpunit/src/Framework/TestSuite.php(746): PHPUnit\Framework\TestSuite->run(Object(PHPUnit\Framework\TestResult))
26-Jan-2020 15:58:04 #5 /data/phpBB/vendor/phpunit/phpunit/src/Framework/TestSuite.php(746): PHPUnit\Framework\TestSuite->run(Object(PHPUnit\Framework\TestResult))
26-Jan-2020 15:58:04 #6 /data/phpBB/vendor/phpunit/phpunit/src/TextUI/TestRunner.php(652): PHPUnit\Framework\TestSuite->run(Object(PHPUnit\Framework\TestResult))
26-Jan-2020 15:58:04 #7 /data/phpBB/vendor/phpunit/phpunit/src/TextUI/Command.php(206): PHPUnit\TextUI\TestRunner->doRun(Object(PHPUnit\Framework\TestSuite), Array, true)
26-Jan-2020 15:58:04 #8 /data/phpBB/vendor/phpunit/phpunit/src/TextUI/Command.php(162): PHPUnit\TextUI\Command->run(Array, true)
26-Jan-2020 15:58:04 #9 /data/phpBB/vendor/phpunit/phpunit/phpunit(61): PHPUnit\TextUI\Command::main()
26-Jan-2020 15:58:04 #10 {main}
26-Jan-2020 15:58:04 357) phpbb_tests_tree_nestedset_forum_move_test::test_change_parent_throws_item
26-Jan-2020 15:58:04 Error: Call to a member function getName() on null in /data/phpBB/phpbb/db/driver/doctrine.php:71
26-Jan-2020 15:58:04 Stack trace:
26-Jan-2020 15:58:04 #0 /data/phpBB/phpbb/db/tools/tools.php(167): phpbb\db\driver\doctrine->get_sql_layer()
26-Jan-2020 15:58:04 #1 /data/phpBB/phpbb/db/tools/factory.php(38): phpbb\db\tools\tools->__construct(Object(phpbb\db\driver\sqlite3), true)
26-Jan-2020 15:58:04 #2 /data/tests/test_framework/phpbb_database_test_case.php(82): phpbb\db\tools\factory->get(Object(phpbb\db\driver\sqlite3), true)
26-Jan-2020 15:58:04 #3 /data/phpBB/vendor/phpunit/phpunit/src/Framework/TestSuite.php(703): phpbb_database_test_case::setUpBeforeClass()
26-Jan-2020 15:58:04 #4 /data/phpBB/vendor/phpunit/phpunit/src/Framework/TestSuite.php(746): PHPUnit\Framework\TestSuite->run(Object(PHPUnit\Framework\TestResult))
26-Jan-2020 15:58:04 #5 /data/phpBB/vendor/phpunit/phpunit/src/Framework/TestSuite.php(746): PHPUnit\Framework\TestSuite->run(Object(PHPUnit\Framework\TestResult))
26-Jan-2020 15:58:04 #6 /data/phpBB/vendor/phpunit/phpunit/src/TextUI/TestRunner.php(652): PHPUnit\Framework\TestSuite->run(Object(PHPUnit\Framework\TestResult))
26-Jan-2020 15:58:04 #7 /data/phpBB/vendor/phpunit/phpunit/src/TextUI/Command.php(206): PHPUnit\TextUI\TestRunner->doRun(Object(PHPUnit\Framework\TestSuite), Array, true)
26-Jan-2020 15:58:04 #8 /data/phpBB/vendor/phpunit/phpunit/src/TextUI/Command.php(162): PHPUnit\TextUI\Command->run(Array, true)
26-Jan-2020 15:58:04 #9 /data/phpBB/vendor/phpunit/phpunit/phpunit(61): PHPUnit\TextUI\Command::main()
26-Jan-2020 15:58:04 #10 {main}
26-Jan-2020 15:58:04 358) phpbb_tests_tree_nestedset_forum_move_test::test_change_parent_throws_parent
26-Jan-2020 15:58:04 Error: Call to a member function getName() on null in /data/phpBB/phpbb/db/driver/doctrine.php:71
26-Jan-2020 15:58:04 Stack trace:
26-Jan-2020 15:58:04 #0 /data/phpBB/phpbb/db/tools/tools.php(167): phpbb\db\driver\doctrine->get_sql_layer()
26-Jan-2020 15:58:04 #1 /data/phpBB/phpbb/db/tools/factory.php(38): phpbb\db\tools\tools->__construct(Object(phpbb\db\driver\sqlite3), true)
26-Jan-2020 15:58:04 #2 /data/tests/test_framework/phpbb_database_test_case.php(82): phpbb\db\tools\factory->get(Object(phpbb\db\driver\sqlite3), true)
26-Jan-2020 15:58:04 #3 /data/phpBB/vendor/phpunit/phpunit/src/Framework/TestSuite.php(703): phpbb_database_test_case::setUpBeforeClass()
26-Jan-2020 15:58:04 #4 /data/phpBB/vendor/phpunit/phpunit/src/Framework/TestSuite.php(746): PHPUnit\Framework\TestSuite->run(Object(PHPUnit\Framework\TestResult))
26-Jan-2020 15:58:04 #5 /data/phpBB/vendor/phpunit/phpunit/src/Framework/TestSuite.php(746): PHPUnit\Framework\TestSuite->run(Object(PHPUnit\Framework\TestResult))
26-Jan-2020 15:58:04 #6 /data/phpBB/vendor/phpunit/phpunit/src/TextUI/TestRunner.php(652): PHPUnit\Framework\TestSuite->run(Object(PHPUnit\Framework\TestResult))
26-Jan-2020 15:58:04 #7 /data/phpBB/vendor/phpunit/phpunit/src/TextUI/Command.php(206): PHPUnit\TextUI\TestRunner->doRun(Object(PHPUnit\Framework\TestSuite), Array, true)
26-Jan-2020 15:58:04 #8 /data/phpBB/vendor/phpunit/phpunit/src/TextUI/Command.php(162): PHPUnit\TextUI\Command->run(Array, true)
26-Jan-2020 15:58:04 #9 /data/phpBB/vendor/phpunit/phpunit/phpunit(61): PHPUnit\TextUI\Command::main()
26-Jan-2020 15:58:04 #10 {main}
26-Jan-2020 15:58:04 359) phpbb_tests_tree_nestedset_forum_regenerate_test::test_regenerate_left_right_ids
26-Jan-2020 15:58:04 Error: Call to a member function getName() on null in /data/phpBB/phpbb/db/driver/doctrine.php:71
26-Jan-2020 15:58:04 Stack trace:
26-Jan-2020 15:58:04 #0 /data/phpBB/phpbb/db/tools/tools.php(167): phpbb\db\driver\doctrine->get_sql_layer()
26-Jan-2020 15:58:04 #1 /data/phpBB/phpbb/db/tools/factory.php(38): phpbb\db\tools\tools->__construct(Object(phpbb\db\driver\sqlite3), true)
26-Jan-2020 15:58:04 #2 /data/tests/test_framework/phpbb_database_test_case.php(82): phpbb\db\tools\factory->get(Object(phpbb\db\driver\sqlite3), true)
26-Jan-2020 15:58:04 #3 /data/phpBB/vendor/phpunit/phpunit/src/Framework/TestSuite.php(703): phpbb_database_test_case::setUpBeforeClass()
26-Jan-2020 15:58:04 #4 /data/phpBB/vendor/phpunit/phpunit/src/Framework/TestSuite.php(746): PHPUnit\Framework\TestSuite->run(Object(PHPUnit\Framework\TestResult))
26-Jan-2020 15:58:04 #5 /data/phpBB/vendor/phpunit/phpunit/src/Framework/TestSuite.php(746): PHPUnit\Framework\TestSuite->run(Object(PHPUnit\Framework\TestResult))
26-Jan-2020 15:58:04 #6 /data/phpBB/vendor/phpunit/phpunit/src/TextUI/TestRunner.php(652): PHPUnit\Framework\TestSuite->run(Object(PHPUnit\Framework\TestResult))
26-Jan-2020 15:58:04 #7 /data/phpBB/vendor/phpunit/phpunit/src/TextUI/Command.php(206): PHPUnit\TextUI\TestRunner->doRun(Object(PHPUnit\Framework\TestSuite), Array, true)
26-Jan-2020 15:58:04 #8 /data/phpBB/vendor/phpunit/phpunit/src/TextUI/Command.php(162): PHPUnit\TextUI\Command->run(Array, true)
26-Jan-2020 15:58:04 #9 /data/phpBB/vendor/phpunit/phpunit/phpunit(61): PHPUnit\TextUI\Command::main()
26-Jan-2020 15:58:04 #10 {main}
26-Jan-2020 15:58:04 360) pphpbb_tests_tree_nestedset_forum_test::test_forum_constructor
26-Jan-2020 15:58:04 Error: Call to a member function getName() on null in /data/phpBB/phpbb/db/driver/doctrine.php:71
26-Jan-2020 15:58:04 Stack trace:
26-Jan-2020 15:58:04 #0 /data/phpBB/phpbb/db/tools/tools.php(167): phpbb\db\driver\doctrine->get_sql_layer()
26-Jan-2020 15:58:04 #1 /data/phpBB/phpbb/db/tools/factory.php(38): phpbb\db\tools\tools->__construct(Object(phpbb\db\driver\sqlite3), true)
26-Jan-2020 15:58:04 #2 /data/tests/test_framework/phpbb_database_test_case.php(82): phpbb\db\tools\factory->get(Object(phpbb\db\driver\sqlite3), true)
26-Jan-2020 15:58:04 #3 /data/phpBB/vendor/phpunit/phpunit/src/Framework/TestSuite.php(703): phpbb_database_test_case::setUpBeforeClass()
26-Jan-2020 15:58:04 #4 /data/phpBB/vendor/phpunit/phpunit/src/Framework/TestSuite.php(746): PHPUnit\Framework\TestSuite->run(Object(PHPUnit\Framework\TestResult))
26-Jan-2020 15:58:04 #5 /data/phpBB/vendor/phpunit/phpunit/src/Framework/TestSuite.php(746): PHPUnit\Framework\TestSuite->run(Object(PHPUnit\Framework\TestResult))
26-Jan-2020 15:58:04 #6 /data/phpBB/vendor/phpunit/phpunit/src/TextUI/TestRunner.php(652): PHPUnit\Framework\TestSuite->run(Object(PHPUnit\Framework\TestResult))
26-Jan-2020 15:58:04 #7 /data/phpBB/vendor/phpunit/phpunit/src/TextUI/Command.php(206): PHPUnit\TextUI\TestRunner->doRun(Object(PHPUnit\Framework\TestSuite), Array, true)
26-Jan-2020 15:58:04 #8 /data/phpBB/vendor/phpunit/phpunit/src/TextUI/Command.php(162): PHPUnit\TextUI\Command->run(Array, true)
26-Jan-2020 15:58:04 #9 /data/phpBB/vendor/phpunit/phpunit/phpunit(61): PHPUnit\TextUI\Command::main()
26-Jan-2020 15:58:04 #10 {main}
26-Jan-2020 15:58:04 361) pphpbb_tests_tree_nestedset_forum_test::test_get_sql_where
26-Jan-2020 15:58:04 Error: Call to a member function getName() on null in /data/phpBB/phpbb/db/driver/doctrine.php:71
26-Jan-2020 15:58:04 Stack trace:
26-Jan-2020 15:58:04 #0 /data/phpBB/phpbb/db/tools/tools.php(167): phpbb\db\driver\doctrine->get_sql_layer()
26-Jan-2020 15:58:04 #1 /data/phpBB/phpbb/db/tools/factory.php(38): phpbb\db\tools\tools->__construct(Object(phpbb\db\driver\sqlite3), true)
26-Jan-2020 15:58:04 #2 /data/tests/test_framework/phpbb_database_test_case.php(82): phpbb\db\tools\factory->get(Object(phpbb\db\driver\sqlite3), true)
26-Jan-2020 15:58:04 #3 /data/phpBB/vendor/phpunit/phpunit/src/Framework/TestSuite.php(703): phpbb_database_test_case::setUpBeforeClass()
26-Jan-2020 15:58:04 #4 /data/phpBB/vendor/phpunit/phpunit/src/Framework/TestSuite.php(746): PHPUnit\Framework\TestSuite->run(Object(PHPUnit\Framework\TestResult))
26-Jan-2020 15:58:04 #5 /data/phpBB/vendor/phpunit/phpunit/src/Framework/TestSuite.php(746): PHPUnit\Framework\TestSuite->run(Object(PHPUnit\Framework\TestResult))
26-Jan-2020 15:58:04 #6 /data/phpBB/vendor/phpunit/phpunit/src/TextUI/TestRunner.php(652): PHPUnit\Framework\TestSuite->run(Object(PHPUnit\Framework\TestResult))
26-Jan-2020 15:58:04 #7 /data/phpBB/vendor/phpunit/phpunit/src/TextUI/Command.php(206): PHPUnit\TextUI\TestRunner->doRun(Object(PHPUnit\Framework\TestSuite), Array, true)
26-Jan-2020 15:58:04 #8 /data/phpBB/vendor/phpunit/phpunit/src/TextUI/Command.php(162): PHPUnit\TextUI\Command->run(Array, true)
26-Jan-2020 15:58:04 #9 /data/phpBB/vendor/phpunit/phpunit/phpunit(61): PHPUnit\TextUI\Command::main()
26-Jan-2020 15:58:04 #10 {main}
26-Jan-2020 15:58:04 362) phpbb_user_loader_test::test_load_get
26-Jan-2020 15:58:04 Error: Call to a member function getName() on null in /data/phpBB/phpbb/db/driver/doctrine.php:71
26-Jan-2020 15:58:04 Stack trace:
26-Jan-2020 15:58:04 #0 /data/phpBB/phpbb/db/tools/tools.php(167): phpbb\db\driver\doctrine->get_sql_layer()
26-Jan-2020 15:58:04 #1 /data/phpBB/phpbb/db/tools/factory.php(38): phpbb\db\tools\tools->__construct(Object(phpbb\db\driver\sqlite3), true)
26-Jan-2020 15:58:04 #2 /data/tests/test_framework/phpbb_database_test_case.php(82): phpbb\db\tools\factory->get(Object(phpbb\db\driver\sqlite3), true)
26-Jan-2020 15:58:04 #3 /data/phpBB/vendor/phpunit/phpunit/src/Framework/TestSuite.php(703): phpbb_database_test_case::setUpBeforeClass()
26-Jan-2020 15:58:04 #4 /data/phpBB/vendor/phpunit/phpunit/src/Framework/TestSuite.php(746): PHPUnit\Framework\TestSuite->run(Object(PHPUnit\Framework\TestResult))
26-Jan-2020 15:58:04 #5 /data/phpBB/vendor/phpunit/phpunit/src/Framework/TestSuite.php(746): PHPUnit\Framework\TestSuite->run(Object(PHPUnit\Framework\TestResult))
26-Jan-2020 15:58:04 #6 /data/phpBB/vendor/phpunit/phpunit/src/TextUI/TestRunner.php(652): PHPUnit\Framework\TestSuite->run(Object(PHPUnit\Framework\TestResult))
26-Jan-2020 15:58:04 #7 /data/phpBB/vendor/phpunit/phpunit/src/TextUI/Command.php(206): PHPUnit\TextUI\TestRunner->doRun(Object(PHPUnit\Framework\TestSuite), Array, true)
26-Jan-2020 15:58:04 #8 /data/phpBB/vendor/phpunit/phpunit/src/TextUI/Command.php(162): PHPUnit\TextUI\Command->run(Array, true)
26-Jan-2020 15:58:04 #9 /data/phpBB/vendor/phpunit/phpunit/phpunit(61): PHPUnit\TextUI\Command::main()
26-Jan-2020 15:58:04 #10 {main}
26-Jan-2020 15:58:04 363) phpbb_user_loader_test::test_load_get_unloaded
26-Jan-2020 15:58:04 Error: Call to a member function getName() on null in /data/phpBB/phpbb/db/driver/doctrine.php:71
26-Jan-2020 15:58:04 Stack trace:
26-Jan-2020 15:58:04 #0 /data/phpBB/phpbb/db/tools/tools.php(167): phpbb\db\driver\doctrine->get_sql_layer()
26-Jan-2020 15:58:04 #1 /data/phpBB/phpbb/db/tools/factory.php(38): phpbb\db\tools\tools->__construct(Object(phpbb\db\driver\sqlite3), true)
26-Jan-2020 15:58:04 #2 /data/tests/test_framework/phpbb_database_test_case.php(82): phpbb\db\tools\factory->get(Object(phpbb\db\driver\sqlite3), true)
26-Jan-2020 15:58:04 #3 /data/phpBB/vendor/phpunit/phpunit/src/Framework/TestSuite.php(703): phpbb_database_test_case::setUpBeforeClass()
26-Jan-2020 15:58:04 #4 /data/phpBB/vendor/phpunit/phpunit/src/Framework/TestSuite.php(746): PHPUnit\Framework\TestSuite->run(Object(PHPUnit\Framework\TestResult))
26-Jan-2020 15:58:04 #5 /data/phpBB/vendor/phpunit/phpunit/src/Framework/TestSuite.php(746): PHPUnit\Framework\TestSuite->run(Object(PHPUnit\Framework\TestResult))
26-Jan-2020 15:58:04 #6 /data/phpBB/vendor/phpunit/phpunit/src/TextUI/TestRunner.php(652): PHPUnit\Framework\TestSuite->run(Object(PHPUnit\Framework\TestResult))
26-Jan-2020 15:58:04 #7 /data/phpBB/vendor/phpunit/phpunit/src/TextUI/Command.php(206): PHPUnit\TextUI\TestRunner->doRun(Object(PHPUnit\Framework\TestSuite), Array, true)
26-Jan-2020 15:58:04 #8 /data/phpBB/vendor/phpunit/phpunit/src/TextUI/Command.php(162): PHPUnit\TextUI\Command->run(Array, true)
26-Jan-2020 15:58:04 #9 /data/phpBB/vendor/phpunit/phpunit/phpunit(61): PHPUnit\TextUI\Command::main()
26-Jan-2020 15:58:04 #10 {main}
26-Jan-2020 15:58:04 364) phpbb_user_loader_test::test_load_user_by_username
26-Jan-2020 15:58:04 Error: Call to a member function getName() on null in /data/phpBB/phpbb/db/driver/doctrine.php:71
26-Jan-2020 15:58:04 Stack trace:
26-Jan-2020 15:58:04 #0 /data/phpBB/phpbb/db/tools/tools.php(167): phpbb\db\driver\doctrine->get_sql_layer()
26-Jan-2020 15:58:04 #1 /data/phpBB/phpbb/db/tools/factory.php(38): phpbb\db\tools\tools->__construct(Object(phpbb\db\driver\sqlite3), true)
26-Jan-2020 15:58:04 #2 /data/tests/test_framework/phpbb_database_test_case.php(82): phpbb\db\tools\factory->get(Object(phpbb\db\driver\sqlite3), true)
26-Jan-2020 15:58:04 #3 /data/phpBB/vendor/phpunit/phpunit/src/Framework/TestSuite.php(703): phpbb_database_test_case::setUpBeforeClass()
26-Jan-2020 15:58:04 #4 /data/phpBB/vendor/phpunit/phpunit/src/Framework/TestSuite.php(746): PHPUnit\Framework\TestSuite->run(Object(PHPUnit\Framework\TestResult))
26-Jan-2020 15:58:04 #5 /data/phpBB/vendor/phpunit/phpunit/src/Framework/TestSuite.php(746): PHPUnit\Framework\TestSuite->run(Object(PHPUnit\Framework\TestResult))
26-Jan-2020 15:58:04 #6 /data/phpBB/vendor/phpunit/phpunit/src/TextUI/TestRunner.php(652): PHPUnit\Framework\TestSuite->run(Object(PHPUnit\Framework\TestResult))
26-Jan-2020 15:58:04 #7 /data/phpBB/vendor/phpunit/phpunit/src/TextUI/Command.php(206): PHPUnit\TextUI\TestRunner->doRun(Object(PHPUnit\Framework\TestSuite), Array, true)
26-Jan-2020 15:58:04 #8 /data/phpBB/vendor/phpunit/phpunit/src/TextUI/Command.php(162): PHPUnit\TextUI\Command->run(Array, true)
26-Jan-2020 15:58:04 #9 /data/phpBB/vendor/phpunit/phpunit/phpunit(61): PHPUnit\TextUI\Command::main()
26-Jan-2020 15:58:04 #10 {main}
26-Jan-2020 15:58:04 ERRORS!
26-Jan-2020 15:58:04 Tests: 7286, Assertions: 123860, Errors: 364, Skipped: 239, Incomplete: 1.
26-Jan-2020 15:58:05 Error occurred while running Task 'Run tests(10)' of type com.atlassian.bamboo.plugins.bamboo-docker-plugin:task.docker.cli.
26-Jan-2020 15:58:05 com.atlassian.bamboo.task.TaskException: Failed to execute task
26-Jan-2020 15:58:05         at com.atlassian.bamboo.plugins.docker.service.RunService.execute(RunService.java:75)
26-Jan-2020 15:58:05         at com.atlassian.bamboo.plugins.docker.tasks.cli.DockerCliTask.execute(DockerCliTask.java:70)
26-Jan-2020 15:58:05         at com.atlassian.bamboo.task.TaskExecutorImpl.lambda$executeTasks$3(TaskExecutorImpl.java:285)
26-Jan-2020 15:58:05         at com.atlassian.bamboo.task.TaskExecutorImpl.executeTaskWithPrePostActions(TaskExecutorImpl.java:224)
26-Jan-2020 15:58:05         at com.atlassian.bamboo.task.TaskExecutorImpl.executeTasks(TaskExecutorImpl.java:285)
26-Jan-2020 15:58:05         at com.atlassian.bamboo.task.TaskExecutorImpl.execute(TaskExecutorImpl.java:112)
26-Jan-2020 15:58:05         at com.atlassian.bamboo.build.pipeline.tasks.ExecuteBuildTask.call(ExecuteBuildTask.java:71)
26-Jan-2020 15:58:05         at com.atlassian.bamboo.v2.build.agent.DefaultBuildAgent.executeBuildPhase(DefaultBuildAgent.java:203)
26-Jan-2020 15:58:05         at com.atlassian.bamboo.v2.build.agent.DefaultBuildAgent.build(DefaultBuildAgent.java:175)
26-Jan-2020 15:58:05         at com.atlassian.bamboo.v2.build.agent.BuildAgentControllerImpl.lambda$waitAndPerformBuild$0(BuildAgentControllerImpl.java:122)
26-Jan-2020 15:58:05         at com.atlassian.bamboo.variable.CustomVariableContextImpl.withVariableSubstitutor(CustomVariableContextImpl.java:185)
26-Jan-2020 15:58:05         at com.atlassian.bamboo.v2.build.agent.BuildAgentControllerImpl.waitAndPerformBuild(BuildAgentControllerImpl.java:117)
26-Jan-2020 15:58:05         at com.atlassian.bamboo.v2.build.agent.DefaultBuildAgent$1.run(DefaultBuildAgent.java:126)
26-Jan-2020 15:58:05         at com.atlassian.bamboo.utils.BambooRunnables$1.run(BambooRunnables.java:48)
26-Jan-2020 15:58:05         at com.atlassian.bamboo.security.ImpersonationHelper.runWith(ImpersonationHelper.java:26)
26-Jan-2020 15:58:05         at com.atlassian.bamboo.security.ImpersonationHelper.runWithSystemAuthority(ImpersonationHelper.java:17)
26-Jan-2020 15:58:05         at com.atlassian.bamboo.security.ImpersonationHelper$1.run(ImpersonationHelper.java:41)
26-Jan-2020 15:58:05         at java.lang.Thread.run(Thread.java:748)
26-Jan-2020 15:58:05 Caused by: com.atlassian.bamboo.docker.DockerException: Error running Docker run command
26-Jan-2020 15:58:05         at com.atlassian.bamboo.docker.DockerContainerServiceImpl.run(DockerContainerServiceImpl.java:118)
26-Jan-2020 15:58:05         at sun.reflect.GeneratedMethodAccessor1922.invoke(Unknown Source)
26-Jan-2020 15:58:05         at sun.reflect.DelegatingMethodAccessorImpl.invoke(DelegatingMethodAccessorImpl.java:43)
26-Jan-2020 15:58:05         at java.lang.reflect.Method.invoke(Method.java:498)
26-Jan-2020 15:58:05         at com.atlassian.plugin.util.ContextClassLoaderSettingInvocationHandler.invoke(ContextClassLoaderSettingInvocationHandler.java:26)
26-Jan-2020 15:58:05         at com.sun.proxy.$Proxy401.run(Unknown Source)
26-Jan-2020 15:58:05         at sun.reflect.GeneratedMethodAccessor1922.invoke(Unknown Source)
26-Jan-2020 15:58:05         at sun.reflect.DelegatingMethodAccessorImpl.invoke(DelegatingMethodAccessorImpl.java:43)
26-Jan-2020 15:58:05         at java.lang.reflect.Method.invoke(Method.java:498)
26-Jan-2020 15:58:05         at org.springframework.aop.support.AopUtils.invokeJoinpointUsingReflection(AopUtils.java:302)
26-Jan-2020 15:58:05         at org.eclipse.gemini.blueprint.service.importer.support.internal.aop.ServiceInvoker.doInvoke(ServiceInvoker.java:56)
26-Jan-2020 15:58:05         at org.eclipse.gemini.blueprint.service.importer.support.internal.aop.ServiceInvoker.invoke(ServiceInvoker.java:60)
26-Jan-2020 15:58:05         at org.springframework.aop.framework.ReflectiveMethodInvocation.proceed(ReflectiveMethodInvocation.java:179)
26-Jan-2020 15:58:05         at org.springframework.aop.support.DelegatingIntroductionInterceptor.doProceed(DelegatingIntroductionInterceptor.java:133)
26-Jan-2020 15:58:05         at org.springframework.aop.support.DelegatingIntroductionInterceptor.invoke(DelegatingIntroductionInterceptor.java:121)
26-Jan-2020 15:58:05         at org.springframework.aop.framework.ReflectiveMethodInvocation.proceed(ReflectiveMethodInvocation.java:179)
26-Jan-2020 15:58:05         at org.eclipse.gemini.blueprint.service.util.internal.aop.ServiceTCCLInterceptor.invokeUnprivileged(ServiceTCCLInterceptor.java:70)
26-Jan-2020 15:58:05         at org.eclipse.gemini.blueprint.service.util.internal.aop.ServiceTCCLInterceptor.invoke(ServiceTCCLInterceptor.java:53)
26-Jan-2020 15:58:05         at org.springframework.aop.framework.ReflectiveMethodInvocation.proceed(ReflectiveMethodInvocation.java:179)
26-Jan-2020 15:58:05         at org.eclipse.gemini.blueprint.service.importer.support.LocalBundleContextAdvice.invoke(LocalBundleContextAdvice.java:57)
26-Jan-2020 15:58:05         at org.springframework.aop.framework.ReflectiveMethodInvocation.proceed(ReflectiveMethodInvocation.java:179)
26-Jan-2020 15:58:05         at org.springframework.aop.support.DelegatingIntroductionInterceptor.doProceed(DelegatingIntroductionInterceptor.java:133)
26-Jan-2020 15:58:05         at org.springframework.aop.support.DelegatingIntroductionInterceptor.invoke(DelegatingIntroductionInterceptor.java:121)
26-Jan-2020 15:58:05         at org.springframework.aop.framework.ReflectiveMethodInvocation.proceed(ReflectiveMethodInvocation.java:179)
26-Jan-2020 15:58:05         at org.springframework.aop.framework.JdkDynamicAopProxy.invoke(JdkDynamicAopProxy.java:207)
26-Jan-2020 15:58:05         at com.sun.proxy.$Proxy646.run(Unknown Source)
26-Jan-2020 15:58:05         at com.atlassian.bamboo.plugins.docker.client.DockerCmd.run(DockerCmd.java:51)
26-Jan-2020 15:58:05         at com.atlassian.bamboo.plugins.docker.service.RunService.execute(RunService.java:64)
26-Jan-2020 15:58:05         ... 17 more
26-Jan-2020 15:58:05 Caused by: com.atlassian.utils.process.ProcessException: Error executing /usr/bin/docker run --volume /home/bamboo/xml-data/build-dir/PHPBB3-PR-JOB1:/data --workdir /data --rm -u=991 -t phpbb:php-7.1 /bin/bash -c "phpBB/vendor/bin/phpunit --log-junit build/logs/phpunit.xml"
26-Jan-2020 15:58:05         at com.atlassian.bamboo.docker.DockerContainerServiceImpl.execute(DockerContainerServiceImpl.java:252)
26-Jan-2020 15:58:05         at com.atlassian.bamboo.docker.DockerContainerServiceImpl.run(DockerContainerServiceImpl.java:106)
26-Jan-2020 15:58:05         ... 44 more
26-Jan-2020 15:58:05 Starting task 'Parsing test results produced by script' of type 'com.atlassian.bamboo.plugins.testresultparser:task.testresultparser.junit'
26-Jan-2020 15:58:05 Parsing test results under /home/bamboo/xml-data/build-dir/PHPBB3-PR-JOB1...
26-Jan-2020 15:58:05 Failing task since 364 failing test cases were found.
26-Jan-2020 15:58:05 Finished task 'Parsing test results produced by script' with result: Failed
26-Jan-2020 15:58:05
Substituting variable: ${bamboo.PRnumber} with 5841
26-Jan-2020 15:58:05
Substituting variable: ${bamboo.buildResultsUrl} with https://bamboo.phpbb.com/browse/PHPBB3-PR-JOB1-9838
26-Jan-2020 15:58:05
Substituting variable: ${bamboo.buildResultsUrl} with https://bamboo.phpbb.com/browse/PHPBB3-PR-JOB1-9838
26-Jan-2020 15:58:05 Starting task 'Set result build status' of type 'com.atlassian.bamboo.plugins.scripttask:task.builder.script'
26-Jan-2020 15:58:05
Beginning to execute external process for build 'phpBB3 - Pull Requests - Build and Test Job #9838 (PHPBB3-PR-JOB1-9838)'
... running command line:
/bin/sh /home/bamboo/temp/PHPBB3-PR-JOB1-9838-ScriptBuildTask-2762703524132945582.sh
... in: /home/bamboo/xml-data/build-dir/PHPBB3-PR-JOB1
... using extra environment variables:
bamboo_planRepository_1_branch=3.1.x
bamboo_planRepository_1_branchDisplayName=3.1.x
bamboo_repository_revision_number=dc8ff9da28b8ab4ad11c7ea94cca526f17c87fe5
bamboo_PRref=master
bamboo_resultsUrl=https://bamboo.phpbb.com/browse/PHPBB3-PR-JOB1-9838
bamboo_capability_system_builder_command_Git=/usr/bin/git
bamboo_repository_75956235_git_username=bantu
bamboo_build_working_directory=/home/bamboo/xml-data/build-dir/PHPBB3-PR-JOB1
bamboo_planRepository_1_name=phpBB Ascraeus
bamboo_buildKey=PHPBB3-PR-JOB1
bamboo_capability_phpbb_tests=true
bamboo_shortPlanName=Pull Requests
bamboo_capability_system_builder_command_fop=/usr/bin/fop
bamboo_capability_dbms_sqlite_2=true
bamboo_planRepository_name=phpBB Ascraeus
bamboo_PRnumber=5841
bamboo_buildNumber=9838
bamboo_repository_75956235_git_repositoryUrl=https://github.com/phpbb/phpbb.git
bamboo_capability_system_builder_phpunit_PHPUnit=/usr/bin/phpunit
bamboo_shortJobName=Build and Test Job
bamboo_buildResultsUrl=https://bamboo.phpbb.com/browse/PHPBB3-PR-JOB1-9838
bamboo_repository_75956235_branch_name=3.1.x
bamboo_planRepository_repositoryUrl=https://github.com/phpbb/phpbb.git
bamboo_agentId=131073
bamboo_planName=phpBB3 - Pull Requests
bamboo_build_commandline_com_atlassian_bamboo_plugins_scripttask_task_builder_script_7=/bin/sh /home/bamboo/temp/PHPBB3-PR-JOB1-9838-ScriptBuildTask-1963313367663009398.sh
bamboo_shortPlanKey=PR
bamboo_shortJobKey=JOB1
bamboo_capability_dbms_mysql_55=true
bamboo_capability_system_jdk_JDK_1_7_0_65=/usr/lib/jvm/java-7-openjdk-amd64
bamboo_planRepository_revision=dc8ff9da28b8ab4ad11c7ea94cca526f17c87fe5
bamboo_buildTimeStamp=2020-01-26T15:53:54.391Z
bamboo_repository_previous_revision_number=dc8ff9da28b8ab4ad11c7ea94cca526f17c87fe5
bamboo_capability_system_jdk_JDK_1_6_0_16=/usr/lib/jvm/java-6-sun-1.6.0.16
bamboo_capability_system_builder_mvn2_Maven_2=/usr/share/maven2
bamboo_planRepository_previousRevision=dc8ff9da28b8ab4ad11c7ea94cca526f17c87fe5
bamboo_build_commandline_com_atlassian_bamboo_plugins_scripttask_task_builder_script_4=/bin/sh /home/bamboo/temp/PHPBB3-PR-JOB1-9838-ScriptBuildTask-4059112737890200259.sh
bamboo_repository_git_branch=3.1.x
bamboo_buildResultKey=PHPBB3-PR-JOB1-9838
bamboo_repository_branch_name=3.1.x
bamboo_buildPlanName=phpBB3 - Pull Requests - Build and Test Job
bamboo_planRepository_1_revision=dc8ff9da28b8ab4ad11c7ea94cca526f17c87fe5
bamboo_repository_name=phpBB Ascraeus
bamboo_buildFailed=true
bamboo_build_commandline_com_atlassian_bamboo_plugins_bamboo_docker_plugin_task_docker_cli_10=/usr/bin/docker run --volume /home/bamboo/xml-data/build-dir/PHPBB3-PR-JOB1:/data --workdir /data --rm -u=991 -t phpbb:php-7.1 /bin/bash -c phpBB/vendor/bin/phpunit --log-junit build/logs/phpunit.xml
bamboo_capability_system_docker_executable=/usr/bin/docker
bamboo_build_commandline_com_atlassian_bamboo_plugins_bamboo_docker_plugin_task_docker_cli_11=/usr/bin/docker run --volume /home/bamboo/xml-data/build-dir/PHPBB3-PR-JOB1:/data --workdir /data/build --rm -u=991 phpbb:php-7.1 ../phpBB/vendor/bin/phing sniff
bamboo_build_commandline_com_atlassian_bamboo_plugins_bamboo_docker_plugin_task_docker_cli_12=/usr/bin/docker run --volume /home/bamboo/xml-data/build-dir/PHPBB3-PR-JOB1:/data --workdir /data/phpBB --rm -e HOME=/home/bamboo -u=991 phpbb:php-7.1 /bin/bash -c php ../composer.phar install --dev; cd ../build; ../phpBB/vendor/bin/phing clean prepare
bamboo_build_commandline_com_atlassian_bamboo_plugins_bamboo_docker_plugin_task_docker_cli_13=/usr/bin/docker build --force-rm=true --tag=phpbb:php-7.1 /home/bamboo/xml-data/build-dir/PHPBB3-PR-JOB1
bamboo_planRepository_branch=3.1.x
bamboo_agentWorkingDirectory=/home/bamboo/xml-data/build-dir
bamboo_jobFailed=true
bamboo_capability_system_git_executable=/usr/bin/git
bamboo_capability_system_builder_phpunit_PHPUnit_3_4=/usr/bin/phpunit
bamboo_repository_git_username=bantu
bamboo_planRepository_1_previousRevision=dc8ff9da28b8ab4ad11c7ea94cca526f17c87fe5
bamboo_repository_75956235_revision_number=dc8ff9da28b8ab4ad11c7ea94cca526f17c87fe5
bamboo_planRepository_branchDisplayName=3.1.x
bamboo_planRepository_1_type=gitv2
bamboo_planRepository_branchName=3.1.x
bamboo_repository_75956235_previous_revision_number=dc8ff9da28b8ab4ad11c7ea94cca526f17c87fe5
bamboo_capability_system_jdk_JDK=/usr/lib/jvm/java-6-sun
bamboo_plan_storageTag=PHPBB3-PR
bamboo_hg_cache_directory=/home/bamboo/xml-data/build-dir/_hg-repositories-cache
bamboo_planRepository_1_username=bantu
bamboo_planRepository_type=gitv2
bamboo_git_cache_directory=/home/bamboo/xml-data/build-dir/_git-repositories-cache
bamboo_ManualBuildTriggerReason_userName=Build Robot
bamboo_repository_git_repositoryUrl=https://github.com/phpbb/phpbb.git
bamboo_repository_75956235_git_branch=3.1.x
bamboo_capability_system_builder_ant_Ant=/usr/share/ant
bamboo_repository_75956235_name=phpBB Ascraeus
bamboo_tmp_directory=/home/bamboo/temp
bamboo_working_directory=/home/bamboo/xml-data/build-dir/PHPBB3-PR-JOB1
bamboo_planKey=PHPBB3-PR
bamboo_capability_local=true
bamboo_planRepository_1_repositoryUrl=https://github.com/phpbb/phpbb.git
bamboo_planRepository_username=bantu
bamboo_capability_system_jdk_JDK_1_6=/usr/lib/jvm/java-6-sun
bamboo_capability_system_jdk_JDK_1_7=/usr/lib/jvm/java-7-openjdk-amd64
bamboo_planRepository_1_branchName=3.1.x
26-Jan-2020 15:58:06 From https://github.com/phpbb/phpbb
26-Jan-2020 15:58:06 * branch            refs/pull/5841/head -> FETCH_HEAD
26-Jan-2020 15:58:06       <testsuite name="phpbb_attachment_delete_test" file="/data/tests/attachment/delete_test.php" tests="2" assertions="0" errors="2" failures="0" skipped="0" time="0.000000">
26-Jan-2020 15:58:06       <testsuite name="phpbb_attachment_resync_test" file="/data/tests/attachment/resync_test.php" tests="1" assertions="0" errors="1" failures="0" skipped="0" time="0.000000">
26-Jan-2020 15:58:06       <testsuite name="phpbb_attachment_upload_test" file="/data/tests/attachment/upload_test.php" tests="3" assertions="0" errors="3" failures="0" skipped="0" time="0.000000">
26-Jan-2020 15:58:06       <testsuite name="phpbb_auth_provider_apache_test" file="/data/tests/auth/provider_apache_test.php" tests="4" assertions="0" errors="4" failures="0" skipped="0" time="0.000000">
26-Jan-2020 15:58:06       <testsuite name="phpbb_auth_provider_db_test" file="/data/tests/auth/provider_db_test.php" tests="1" assertions="0" errors="1" failures="0" skipped="0" time="0.000000">
26-Jan-2020 15:58:06       <testsuite name="phpbb_cache_memory_test" file="/data/tests/cache/cache_memory_test.php" tests="1" assertions="0" errors="1" failures="0" skipped="0" time="0.000000">
26-Jan-2020 15:58:06       <testsuite name="phpbb_cache_dummy_driver_test" file="/data/tests/cache/dummy_driver_test.php" tests="4" assertions="0" errors="4" failures="0" skipped="0" time="0.000000">
26-Jan-2020 15:58:06       <testsuite name="phpbb_cache_file_driver_test" file="/data/tests/cache/file_driver_test.php" tests="4" assertions="0" errors="4" failures="0" skipped="0" time="0.000000">
26-Jan-2020 15:58:06       <testsuite name="phpbb_captcha_qa_test" file="/data/tests/captcha/qa_test.php" tests="3" assertions="0" errors="3" failures="0" skipped="0" time="0.000000">
26-Jan-2020 15:58:06       <testsuite name="phpbb_console_command_cron_run_test" file="/data/tests/console/cron/run_test.php" tests="8" assertions="0" errors="8" failures="0" skipped="0" time="0.000000">
26-Jan-2020 15:58:06       <testsuite name="phpbb_console_command_thumbnail_test" file="/data/tests/console/thumbnail_test.php" tests="1" assertions="0" errors="1" failures="0" skipped="0" time="0.000000">
26-Jan-2020 15:58:06       <testsuite name="phpbb_console_user_activate_test" file="/data/tests/console/user/activate_test.php" tests="1" assertions="0" errors="1" failures="0" skipped="0" time="0.000000">
26-Jan-2020 15:58:06       <testsuite name="phpbb_console_user_add_test" file="/data/tests/console/user/add_test.php" tests="3" assertions="0" errors="3" failures="0" skipped="0" time="0.000000">
26-Jan-2020 15:58:06       <testsuite name="phpbb_console_user_delete_test" file="/data/tests/console/user/delete_test.php" tests="3" assertions="0" errors="3" failures="0" skipped="0" time="0.000000">
26-Jan-2020 15:58:06       <testsuite name="phpbb_console_user_reclean_test" file="/data/tests/console/user/reclean_test.php" tests="1" assertions="0" errors="1" failures="0" skipped="0" time="0.000000">
26-Jan-2020 15:58:06       <testsuite name="phpbb_content_visibility_delete_post_test" file="/data/tests/content_visibility/delete_post_test.php" tests="1" assertions="0" errors="1" failures="0" skipped="0" time="0.000000">
26-Jan-2020 15:58:06       <testsuite name="phpbb_content_visibility_get_forums_visibility_sql_test" file="/data/tests/content_visibility/get_forums_visibility_sql_test.php" tests="1" assertions="0" errors="1" failures="0" skipped="0" time="0.000000">
26-Jan-2020 15:58:06       <testsuite name="phpbb_content_visibility_get_global_visibility_sql_test" file="/data/tests/content_visibility/get_global_visibility_sql_test.php" tests="1" assertions="0" errors="1" failures="0" skipped="0" time="0.000000">
26-Jan-2020 15:58:06       <testsuite name="phpbb_content_visibility_get_visibility_sql_test" file="/data/tests/content_visibility/get_visibility_sql_test.php" tests="1" assertions="0" errors="1" failures="0" skipped="0" time="0.000000">
26-Jan-2020 15:58:06       <testsuite name="phpbb_content_visibility_set_post_visibility_test" file="/data/tests/content_visibility/set_post_visibility_test.php" tests="2" assertions="0" errors="2" failures="0" skipped="0" time="0.000000">
26-Jan-2020 15:58:06       <testsuite name="phpbb_content_visibility_set_topic_visibility_test" file="/data/tests/content_visibility/set_topic_visibility_test.php" tests="1" assertions="0" errors="1" failures="0" skipped="0" time="0.000000">
26-Jan-2020 15:58:06       <testsuite name="phpbb_dbal_auto_increment_test" file="/data/tests/dbal/auto_increment_test.php" tests="1" assertions="0" errors="1" failures="0" skipped="0" time="0.000000">
26-Jan-2020 15:58:06       <testsuite name="phpbb_boolean_processor_test" file="/data/tests/dbal/boolean_processor_test.php" tests="8" assertions="0" errors="8" failures="0" skipped="0" time="0.000000">
26-Jan-2020 15:58:06       <testsuite name="phpbb_dbal_case_test" file="/data/tests/dbal/case_test.php" tests="3" assertions="0" errors="3" failures="0" skipped="0" time="0.000000">
26-Jan-2020 15:58:06       <testsuite name="phpbb_dbal_concatenate_test" file="/data/tests/dbal/concatenate_test.php" tests="2" assertions="0" errors="2" failures="0" skipped="0" time="0.000000">
26-Jan-2020 15:58:06       <testsuite name="phpbb_dbal_connect_test" file="/data/tests/dbal/connect_test.php" tests="1" assertions="0" errors="1" failures="0" skipped="0" time="0.000000">
26-Jan-2020 15:58:06       <testsuite name="phpbb_dbal_cross_join_test" file="/data/tests/dbal/cross_join_test.php" tests="1" assertions="0" errors="1" failures="0" skipped="0" time="0.000000">
26-Jan-2020 15:58:06       <testsuite name="phpbb_dbal_migrator_tool_config_text_test" file="/data/tests/dbal/migrator_tool_config_text_test.php" tests="6" assertions="0" errors="6" failures="0" skipped="0" time="0.000000">
26-Jan-2020 15:58:06       <testsuite name="phpbb_dbal_migrator_tool_module_test" file="/data/tests/dbal/migrator_tool_module_test.php" tests="5" assertions="0" errors="5" failures="0" skipped="0" time="0.000000">
26-Jan-2020 15:58:06       <testsuite name="phpbb_dbal_migrator_tool_permission_test" file="/data/tests/dbal/migrator_tool_permission_test.php" tests="5" assertions="0" errors="5" failures="0" skipped="0" time="0.000000">
26-Jan-2020 15:58:06       <testsuite name="phpbb_dbal_order_lower_test" file="/data/tests/dbal/order_lower_test.php" tests="1" assertions="0" errors="1" failures="0" skipped="0" time="0.000000">
26-Jan-2020 15:58:06       <testsuite name="phpbb_dbal_schema_test" file="/data/tests/dbal/schema_test.php" tests="1" assertions="0" errors="1" failures="0" skipped="0" time="0.000000">
26-Jan-2020 15:58:06       <testsuite name="phpbb_dbal_sql_affected_rows_test" file="/data/tests/dbal/sql_affected_rows_test.php" tests="4" assertions="0" errors="4" failures="0" skipped="0" time="0.000000">
26-Jan-2020 15:58:06       <testsuite name="phpbb_dbal_sql_insert_buffer_test" file="/data/tests/dbal/sql_insert_buffer_test.php" tests="6" assertions="0" errors="6" failures="0" skipped="0" time="0.000000">
26-Jan-2020 15:58:06       <testsuite name="phpbb_dbal_write_sequence_test" file="/data/tests/dbal/write_sequence_test.php" tests="1" assertions="0" errors="1" failures="0" skipped="0" time="0.000000">
26-Jan-2020 15:58:06       <testsuite name="phpbb_dbal_write_test" file="/data/tests/dbal/write_test.php" tests="4" assertions="0" errors="4" failures="0" skipped="0" time="0.000000">
26-Jan-2020 15:58:06       <testsuite name="phpbb_extension_metadata_manager_test" file="/data/tests/extension/metadata_manager_test.php" tests="7" assertions="0" errors="7" failures="0" skipped="0" time="0.000000">
26-Jan-2020 15:58:06       <testsuite name="phpbb_feed_attachments_base_test" file="/data/tests/feed/attachments_base_test.php" tests="1" assertions="0" errors="1" failures="0" skipped="0" time="0.000000">
26-Jan-2020 15:58:06       <testsuite name="phpbb_functions_language_select_test" file="/data/tests/functions/language_select_test.php" tests="1" assertions="0" errors="1" failures="0" skipped="0" time="0.000000">
26-Jan-2020 15:58:06       <testsuite name="phpbb_functions_obtain_online_test" file="/data/tests/functions/obtain_online_test.php" tests="3" assertions="0" errors="3" failures="0" skipped="0" time="0.000000">
26-Jan-2020 15:58:06       <testsuite name="phpbb_functions_style_select_test" file="/data/tests/functions/style_select_test.php" tests="1" assertions="0" errors="1" failures="0" skipped="0" time="0.000000">
26-Jan-2020 15:58:06       <testsuite name="phpbb_functions_user_delete_test" file="/data/tests/functions/user_delete_test.php" tests="1" assertions="0" errors="1" failures="0" skipped="0" time="0.000000">
26-Jan-2020 15:58:06       <testsuite name="phpbb_functions_validate_email_test" file="/data/tests/functions/validate_email_test.php" tests="2" assertions="0" errors="2" failures="0" skipped="0" time="0.000000">
26-Jan-2020 15:58:06       <testsuite name="phpbb_functions_validate_lang_iso_test" file="/data/tests/functions/validate_lang_iso_test.php" tests="1" assertions="0" errors="1" failures="0" skipped="0" time="0.000000">
26-Jan-2020 15:58:06       <testsuite name="phpbb_functions_validate_user_email_test" file="/data/tests/functions/validate_user_email_test.php" tests="2" assertions="0" errors="2" failures="0" skipped="0" time="0.000000">
26-Jan-2020 15:58:06       <testsuite name="phpbb_functions_validate_data_test" file="/data/tests/functions/validate_username_test.php" tests="1" assertions="0" errors="1" failures="0" skipped="0" time="0.000000">
26-Jan-2020 15:58:06       <testsuite name="phpbb_update_rows_avoiding_duplicates_notify_status_test" file="/data/tests/functions_database_helper/update_rows_avoiding_duplicates_notify_status_test.php" tests="1" assertions="0" errors="1" failures="0" skipped="0" time="0.000000">
26-Jan-2020 15:58:06       <testsuite name="phpbb_update_rows_avoiding_duplicates_test" file="/data/tests/functions_database_helper/update_rows_avoiding_duplicates_test.php" tests="1" assertions="0" errors="1" failures="0" skipped="0" time="0.000000">
26-Jan-2020 15:58:06       <testsuite name="phpbb_functions_privmsgs_get_max_setting_from_group_test" file="/data/tests/functions_privmsgs/get_max_setting_from_group_test.php" tests="2" assertions="0" errors="2" failures="0" skipped="0" time="0.000000">
26-Jan-2020 15:58:06       <testsuite name="phpbb_functions_user_delete_user_test" file="/data/tests/functions_user/delete_user_test.php" tests="4" assertions="0" errors="4" failures="0" skipped="0" time="0.000000">
26-Jan-2020 15:58:06       <testsuite name="phpbb_functions_user_group_user_attributes_test" file="/data/tests/functions_user/group_user_attributes_test.php" tests="1" assertions="0" errors="1" failures="0" skipped="0" time="0.000000">
26-Jan-2020 15:58:06       <testsuite name="phpbb_groupposition_legend_test" file="/data/tests/groupposition/legend_test.php" tests="7" assertions="0" errors="7" failures="0" skipped="0" time="0.000000">
26-Jan-2020 15:58:06       <testsuite name="phpbb_groupposition_teampage_test" file="/data/tests/groupposition/teampage_test.php" tests="8" assertions="0" errors="8" failures="0" skipped="0" time="0.000000">
26-Jan-2020 15:58:06       <testsuite name="phpbb_lock_db_test" file="/data/tests/lock/db_test.php" tests="4" assertions="0" errors="4" failures="0" skipped="0" time="0.000000">
26-Jan-2020 15:58:06       <testsuite name="phpbb_log_add_test" file="/data/tests/log/add_test.php" tests="2" assertions="0" errors="2" failures="0" skipped="0" time="0.000000">
26-Jan-2020 15:58:06       <testsuite name="phpbb_log_delete_test" file="/data/tests/log/delete_test.php" tests="1" assertions="0" errors="1" failures="0" skipped="0" time="0.000000">
26-Jan-2020 15:58:06       <testsuite name="phpbb_log_function_add_log_test" file="/data/tests/log/function_add_log_test.php" tests="1" assertions="0" errors="1" failures="0" skipped="0" time="0.000000">
26-Jan-2020 15:58:06       <testsuite name="phpbb_log_function_view_log_test" file="/data/tests/log/function_view_log_test.php" tests="1" assertions="0" errors="1" failures="0" skipped="0" time="0.000000">
26-Jan-2020 15:58:06       <testsuite name="phpbb_mcp_post_ip_test" file="/data/tests/mcp/post_ip_test.php" tests="2" assertions="0" errors="2" failures="0" skipped="0" time="0.000000">
26-Jan-2020 15:58:06       <testsuite name="phpbb_migrator_convert_timezones_test" file="/data/tests/migrator/convert_timezones_test.php" tests="1" assertions="0" errors="1" failures="0" skipped="0" time="0.000000">
26-Jan-2020 15:58:06       <testsuite name="get_callable_from_step_test" file="/data/tests/migrator/get_callable_from_step_test.php" tests="1" assertions="0" errors="1" failures="0" skipped="0" time="0.000000">
26-Jan-2020 15:58:06       <testsuite name="schema_generator_test" file="/data/tests/migrator/schema_generator_test.php" tests="8" assertions="0" errors="8" failures="0" skipped="0" time="0.005701">
26-Jan-2020 15:58:06         <testsuite name="schema_generator_test::test_column_add_after" tests="6" assertions="0" errors="6" failures="0" skipped="0" time="0.004292">
26-Jan-2020 15:58:06       <testsuite name="phpbb_notification_convert_test" file="/data/tests/notification/convert_test.php" tests="1" assertions="0" errors="1" failures="0" skipped="0" time="0.000000">
26-Jan-2020 15:58:06       <testsuite name="phpbb_notification_group_request_test" file="/data/tests/notification/group_request_test.php" tests="1" assertions="0" errors="1" failures="0" skipped="0" time="0.000000">
26-Jan-2020 15:58:06       <testsuite name="phpbb_notification_test" file="/data/tests/notification/notification_test.php" tests="4" assertions="0" errors="4" failures="0" skipped="0" time="0.000000">
26-Jan-2020 15:58:06       <testsuite name="phpbb_notification_submit_post_type_bookmark_test" file="/data/tests/notification/submit_post_type_bookmark_test.php" tests="1" assertions="0" errors="1" failures="0" skipped="0" time="0.000000">
26-Jan-2020 15:58:06       <testsuite name="phpbb_notification_submit_post_type_post_in_queue_test" file="/data/tests/notification/submit_post_type_post_in_queue_test.php" tests="1" assertions="0" errors="1" failures="0" skipped="0" time="0.000000">
26-Jan-2020 15:58:06       <testsuite name="phpbb_notification_submit_post_type_post_test" file="/data/tests/notification/submit_post_type_post_test.php" tests="1" assertions="0" errors="1" failures="0" skipped="0" time="0.000000">
26-Jan-2020 15:58:06       <testsuite name="phpbb_notification_submit_post_type_quote_test" file="/data/tests/notification/submit_post_type_quote_test.php" tests="1" assertions="0" errors="1" failures="0" skipped="0" time="0.000000">
26-Jan-2020 15:58:06       <testsuite name="phpbb_notification_submit_post_type_topic_test" file="/data/tests/notification/submit_post_type_topic_test.php" tests="1" assertions="0" errors="1" failures="0" skipped="0" time="0.000000">
26-Jan-2020 15:58:06       <testsuite name="phpbb_notification_user_list_trim_test" file="/data/tests/notification/user_list_trim_test.php" tests="1" assertions="0" errors="1" failures="0" skipped="0" time="0.000000">
26-Jan-2020 15:58:06       <testsuite name="phpbb_privmsgs_delete_user_pms_test" file="/data/tests/privmsgs/delete_user_pms_test.php" tests="1" assertions="0" errors="1" failures="0" skipped="0" time="0.000000">
26-Jan-2020 15:58:06       <testsuite name="phpbb_search_mysql_test" file="/data/tests/search/mysql_test.php" tests="1" assertions="0" errors="1" failures="0" skipped="0" time="0.000000">
26-Jan-2020 15:58:06       <testsuite name="phpbb_search_native_test" file="/data/tests/search/native_test.php" tests="1" assertions="0" errors="1" failures="0" skipped="0" time="0.000000">
26-Jan-2020 15:58:06       <testsuite name="phpbb_search_postgres_test" file="/data/tests/search/postgres_test.php" tests="1" assertions="0" errors="1" failures="0" skipped="0" time="0.000000">
26-Jan-2020 15:58:06       <testsuite name="phpbb_session_check_ban_test" file="/data/tests/session/check_ban_test.php" tests="1" assertions="0" errors="1" failures="0" skipped="0" time="0.000000">
26-Jan-2020 15:58:06       <testsuite name="phpbb_session_check_isvalid_test" file="/data/tests/session/check_isvalid_test.php" tests="2" assertions="0" errors="2" failures="0" skipped="0" time="0.000000">
26-Jan-2020 15:58:06       <testsuite name="phpbb_session_create_test" file="/data/tests/session/create_test.php" tests="1" assertions="0" errors="1" failures="0" skipped="0" time="0.000000">
26-Jan-2020 15:58:06       <testsuite name="phpbb_session_extract_hostname_test" file="/data/tests/session/extract_hostname_test.php" tests="1" assertions="0" errors="1" failures="0" skipped="0" time="0.000000">
26-Jan-2020 15:58:06       <testsuite name="phpbb_session_extract_page_test" file="/data/tests/session/extract_page_test.php" tests="1" assertions="0" errors="1" failures="0" skipped="0" time="0.000000">
26-Jan-2020 15:58:06       <testsuite name="phpbb_session_garbage_collection_test" file="/data/tests/session/garbage_collection_test.php" tests="2" assertions="0" errors="2" failures="0" skipped="0" time="0.000000">
26-Jan-2020 15:58:06       <testsuite name="phpbb_session_login_keys_test" file="/data/tests/session/session_key_test.php" tests="2" assertions="0" errors="2" failures="0" skipped="0" time="0.000000">
26-Jan-2020 15:58:06       <testsuite name="phpbb_session_unset_admin_test" file="/data/tests/session/unset_admin_test.php" tests="1" assertions="0" errors="1" failures="0" skipped="0" time="0.000000">
26-Jan-2020 15:58:06       <testsuite name="phpbb_session_validate_referrer_test" file="/data/tests/session/validate_referrer_test.php" tests="1" assertions="0" errors="1" failures="0" skipped="0" time="0.000000">
26-Jan-2020 15:58:06       <testsuite name="phpbb_textreparser_base_test" file="/data/tests/text_reparser/base_test.php" tests="2" assertions="0" errors="2" failures="0" skipped="0" time="0.000000">
26-Jan-2020 15:58:06       <testsuite name="phpbb_text_reparser_manager_test" file="/data/tests/text_reparser/manager_test.php" tests="4" assertions="0" errors="4" failures="0" skipped="0" time="0.000000">
26-Jan-2020 15:58:06       <testsuite name="phpbb_textreparser_contact_admin_info_test" file="/data/tests/text_reparser/plugins/contact_admin_info_test.php" tests="3" assertions="0" errors="3" failures="0" skipped="0" time="0.000000">
26-Jan-2020 15:58:06       <testsuite name="phpbb_textreparser_forum_description_test" file="/data/tests/text_reparser/plugins/forum_description_test.php" tests="3" assertions="0" errors="3" failures="0" skipped="0" time="0.000000">
26-Jan-2020 15:58:06       <testsuite name="phpbb_textreparser_forum_rules_test" file="/data/tests/text_reparser/plugins/forum_rules_test.php" tests="3" assertions="0" errors="3" failures="0" skipped="0" time="0.000000">
26-Jan-2020 15:58:06       <testsuite name="phpbb_textreparser_group_description_test" file="/data/tests/text_reparser/plugins/group_description_test.php" tests="3" assertions="0" errors="3" failures="0" skipped="0" time="0.000000">
26-Jan-2020 15:58:06       <testsuite name="phpbb_textreparser_pm_text_test" file="/data/tests/text_reparser/plugins/pm_text_test.php" tests="3" assertions="0" errors="3" failures="0" skipped="0" time="0.000000">
26-Jan-2020 15:58:06       <testsuite name="phpbb_textreparser_poll_option_test" file="/data/tests/text_reparser/plugins/poll_option_test.php" tests="3" assertions="0" errors="3" failures="0" skipped="0" time="0.000000">
26-Jan-2020 15:58:06       <testsuite name="phpbb_textreparser_poll_title_test" file="/data/tests/text_reparser/plugins/poll_title_test.php" tests="3" assertions="0" errors="3" failures="0" skipped="0" time="0.000000">
26-Jan-2020 15:58:06       <testsuite name="phpbb_textreparser_post_text_test" file="/data/tests/text_reparser/plugins/post_text_test.php" tests="3" assertions="0" errors="3" failures="0" skipped="0" time="0.000000">
26-Jan-2020 15:58:06       <testsuite name="phpbb_textreparser_user_signature_test" file="/data/tests/text_reparser/plugins/user_signature_test.php" tests="3" assertions="0" errors="3" failures="0" skipped="0" time="0.000000">
26-Jan-2020 15:58:06       <testsuite name="phpbb_tests_tree_nestedset_forum_get_data_test" file="/data/tests/tree/nestedset_forum_get_data_test.php" tests="5" assertions="0" errors="5" failures="0" skipped="0" time="0.000000">
26-Jan-2020 15:58:06       <testsuite name="phpbb_tests_tree_nestedset_forum_add_remove_test" file="/data/tests/tree/nestedset_forum_insert_delete_test.php" tests="3" assertions="0" errors="3" failures="0" skipped="0" time="0.000000">
26-Jan-2020 15:58:06       <testsuite name="phpbb_tests_tree_nestedset_forum_move_test" file="/data/tests/tree/nestedset_forum_move_test.php" tests="9" assertions="0" errors="9" failures="0" skipped="0" time="0.000000">
26-Jan-2020 15:58:06       <testsuite name="phpbb_tests_tree_nestedset_forum_regenerate_test" file="/data/tests/tree/nestedset_forum_regenerate_test.php" tests="1" assertions="0" errors="1" failures="0" skipped="0" time="0.000000">
26-Jan-2020 15:58:06       <testsuite name="pphpbb_tests_tree_nestedset_forum_test" file="/data/tests/tree/nestedset_forum_test.php" tests="2" assertions="0" errors="2" failures="0" skipped="0" time="0.000000">
26-Jan-2020 15:58:06       <testsuite name="phpbb_user_loader_test" file="/data/tests/user/user_loader_test.php" tests="3" assertions="0" errors="3" failures="0" skipped="0" time="0.000000">
26-Jan-2020 15:58:06   % Total    % Received % Xferd  Average Speed   Time    Time     Time  Current
26-Jan-2020 15:58:06                                  Dload  Upload   Total   Spent    Left  Speed
26-Jan-2020 15:58:06
26-Jan-2020 15:58:06   0     0    0     0    0     0      0      0 --:--:-- --:--:-- --:--:--     0
26-Jan-2020 15:58:06 100   267  100    93  100   174    199    374 --:--:-- --:--:-- --:--:--   374
26-Jan-2020 15:58:06 Finished task 'Set result build status' with result: Success
26-Jan-2020 15:58:06 Running post build plugin 'NCover Results Collector'
26-Jan-2020 15:58:06 Running post build plugin 'Artifact Copier'
26-Jan-2020 15:58:06 Running post build plugin 'npm Cache Cleanup'
26-Jan-2020 15:58:06 Running post build plugin 'Clover Results Collector'
26-Jan-2020 15:58:06 Running post build plugin 'Docker Container Cleanup'
26-Jan-2020 15:58:07 Successfully removed working directory at '/home/bamboo/xml-data/build-dir/PHPBB3-PR-JOB1'
26-Jan-2020 15:58:07 Finalising the build...
26-Jan-2020 15:58:07 Stopping timer.
26-Jan-2020 15:58:07 Build PHPBB3-PR-JOB1-9838 completed.
26-Jan-2020 15:58:07 Running on server: post build plugin 'NCover Results Collector'
26-Jan-2020 15:58:07 Running on server: post build plugin 'Build Hanging Detection Configuration'
26-Jan-2020 15:58:07 Running on server: post build plugin 'Clover Delta Calculator'
26-Jan-2020 15:58:07 Running on server: post build plugin 'Maven Dependencies Postprocessor'
26-Jan-2020 15:58:07 All post build plugins have finished
26-Jan-2020 15:58:07 Generating build results summary...
26-Jan-2020 15:58:14 Saving build results to disk...
26-Jan-2020 15:58:14 Logging substituted variables...
26-Jan-2020 15:58:15 Indexing build results...
26-Jan-2020 15:58:15 Finished building PHPBB3-PR-JOB1-9838.
26-Jan-2020 15:58:15
Substituting variable: ${bamboo.PRnumber} with 5841