Tests pending pull requests

Build: #9850 failed

Job: Build and Test Job failed

Stages & jobs

  1. Build and Test

Build log

The build generated 668 lines of output. Download or view full build log

02-Feb-2020 13:13:15 Build phpBB3 - Pull Requests - Build and Test Job #9850 (PHPBB3-PR-JOB1-9850) started building on agent Default Agent
02-Feb-2020 13:13:15
02-Feb-2020 13:13:15 Build working directory is /home/bamboo/xml-data/build-dir/PHPBB3-PR-JOB1
02-Feb-2020 13:13:15 Executing build phpBB3 - Pull Requests - Build and Test Job #9850 (PHPBB3-PR-JOB1-9850)
02-Feb-2020 13:13:15 Starting task 'Checkout develop branch' of type 'com.atlassian.bamboo.plugins.vcs:task.vcs.checkout'
02-Feb-2020 13:13:15 Build always requires a clean checkout
02-Feb-2020 13:13:15 Cleaning build directory '/home/bamboo/xml-data/build-dir/PHPBB3-PR-JOB1'
02-Feb-2020 13:13:15 Checking out into /home/bamboo/xml-data/build-dir/PHPBB3-PR-JOB1
02-Feb-2020 13:13:15 Updating source code to revision: dc8ff9da28b8ab4ad11c7ea94cca526f17c87fe5
02-Feb-2020 13:13:15 Fetching 'refs/heads/3.1.x' from 'https://github.com/phpbb/phpbb.git'.
02-Feb-2020 13:13:16 Checking out revision dc8ff9da28b8ab4ad11c7ea94cca526f17c87fe5.
02-Feb-2020 13:13:16 Creating local git repository in '/home/bamboo/xml-data/build-dir/PHPBB3-PR-JOB1/.git'.
02-Feb-2020 13:13:16 Cloning into '/home/bamboo/xml-data/build-dir/PHPBB3-PR-JOB1'...
02-Feb-2020 13:13:16 done.
02-Feb-2020 13:13:18 Branch 3.1.x set up to track remote branch 3.1.x from origin.
02-Feb-2020 13:13:18 Switched to a new branch '3.1.x'
02-Feb-2020 13:13:18 Updated source code to revision: dc8ff9da28b8ab4ad11c7ea94cca526f17c87fe5
02-Feb-2020 13:13:18 Finished task 'Checkout develop branch' with result: Success
02-Feb-2020 13:13:18 Running pre-build action: VCS Version Collector
02-Feb-2020 13:13:18
Substituting variable: ${bamboo.PRnumber} with 5841
02-Feb-2020 13:13:18
Substituting variable: ${bamboo.buildResultsUrl} with https://bamboo.phpbb.com/browse/PHPBB3-PR-JOB1-9850
02-Feb-2020 13:13:18 Starting task 'Set pending build status' of type 'com.atlassian.bamboo.plugins.scripttask:task.builder.script'
02-Feb-2020 13:13:18
Beginning to execute external process for build 'phpBB3 - Pull Requests - Build and Test Job #9850 (PHPBB3-PR-JOB1-9850)'
... running command line:
/bin/sh /home/bamboo/temp/PHPBB3-PR-JOB1-9850-ScriptBuildTask-4165158688919937942.sh
... in: /home/bamboo/xml-data/build-dir/PHPBB3-PR-JOB1
... using extra environment variables:
bamboo_planRepository_1_branch=3.1.x
bamboo_planRepository_1_branchDisplayName=3.1.x
bamboo_repository_revision_number=dc8ff9da28b8ab4ad11c7ea94cca526f17c87fe5
bamboo_PRref=master
bamboo_resultsUrl=https://bamboo.phpbb.com/browse/PHPBB3-PR-JOB1-9850
bamboo_capability_system_builder_command_Git=/usr/bin/git
bamboo_repository_75956235_git_username=bantu
bamboo_build_working_directory=/home/bamboo/xml-data/build-dir/PHPBB3-PR-JOB1
bamboo_planRepository_1_name=phpBB Ascraeus
bamboo_buildKey=PHPBB3-PR-JOB1
bamboo_capability_phpbb_tests=true
bamboo_shortPlanName=Pull Requests
bamboo_capability_system_builder_command_fop=/usr/bin/fop
bamboo_capability_dbms_sqlite_2=true
bamboo_planRepository_name=phpBB Ascraeus
bamboo_PRnumber=5841
bamboo_buildNumber=9850
bamboo_repository_75956235_git_repositoryUrl=https://github.com/phpbb/phpbb.git
bamboo_capability_system_builder_phpunit_PHPUnit=/usr/bin/phpunit
bamboo_shortJobName=Build and Test Job
bamboo_buildResultsUrl=https://bamboo.phpbb.com/browse/PHPBB3-PR-JOB1-9850
bamboo_repository_75956235_branch_name=3.1.x
bamboo_planRepository_repositoryUrl=https://github.com/phpbb/phpbb.git
bamboo_agentId=131073
bamboo_planName=phpBB3 - Pull Requests
bamboo_shortPlanKey=PR
bamboo_shortJobKey=JOB1
bamboo_capability_dbms_mysql_55=true
bamboo_capability_system_jdk_JDK_1_7_0_65=/usr/lib/jvm/java-7-openjdk-amd64
bamboo_planRepository_revision=dc8ff9da28b8ab4ad11c7ea94cca526f17c87fe5
bamboo_buildTimeStamp=2020-02-02T13:13:15.468Z
bamboo_repository_previous_revision_number=dc8ff9da28b8ab4ad11c7ea94cca526f17c87fe5
bamboo_capability_system_jdk_JDK_1_6_0_16=/usr/lib/jvm/java-6-sun-1.6.0.16
bamboo_capability_system_builder_mvn2_Maven_2=/usr/share/maven2
bamboo_planRepository_previousRevision=dc8ff9da28b8ab4ad11c7ea94cca526f17c87fe5
bamboo_repository_git_branch=3.1.x
bamboo_buildResultKey=PHPBB3-PR-JOB1-9850
bamboo_repository_branch_name=3.1.x
bamboo_buildPlanName=phpBB3 - Pull Requests - Build and Test Job
bamboo_planRepository_1_revision=dc8ff9da28b8ab4ad11c7ea94cca526f17c87fe5
bamboo_repository_name=phpBB Ascraeus
bamboo_buildFailed=false
bamboo_capability_system_docker_executable=/usr/bin/docker
bamboo_planRepository_branch=3.1.x
bamboo_agentWorkingDirectory=/home/bamboo/xml-data/build-dir
bamboo_capability_system_git_executable=/usr/bin/git
bamboo_capability_system_builder_phpunit_PHPUnit_3_4=/usr/bin/phpunit
bamboo_repository_git_username=bantu
bamboo_planRepository_1_previousRevision=dc8ff9da28b8ab4ad11c7ea94cca526f17c87fe5
bamboo_repository_75956235_revision_number=dc8ff9da28b8ab4ad11c7ea94cca526f17c87fe5
bamboo_planRepository_branchDisplayName=3.1.x
bamboo_planRepository_1_type=gitv2
bamboo_planRepository_branchName=3.1.x
bamboo_repository_75956235_previous_revision_number=dc8ff9da28b8ab4ad11c7ea94cca526f17c87fe5
bamboo_capability_system_jdk_JDK=/usr/lib/jvm/java-6-sun
bamboo_plan_storageTag=PHPBB3-PR
bamboo_hg_cache_directory=/home/bamboo/xml-data/build-dir/_hg-repositories-cache
bamboo_planRepository_1_username=bantu
bamboo_planRepository_type=gitv2
bamboo_git_cache_directory=/home/bamboo/xml-data/build-dir/_git-repositories-cache
bamboo_ManualBuildTriggerReason_userName=Build Robot
bamboo_repository_git_repositoryUrl=https://github.com/phpbb/phpbb.git
bamboo_repository_75956235_git_branch=3.1.x
bamboo_capability_system_builder_ant_Ant=/usr/share/ant
bamboo_repository_75956235_name=phpBB Ascraeus
bamboo_tmp_directory=/home/bamboo/temp
bamboo_working_directory=/home/bamboo/xml-data/build-dir/PHPBB3-PR-JOB1
bamboo_planKey=PHPBB3-PR
bamboo_capability_local=true
bamboo_planRepository_1_repositoryUrl=https://github.com/phpbb/phpbb.git
bamboo_planRepository_username=bantu
bamboo_capability_system_jdk_JDK_1_6=/usr/lib/jvm/java-6-sun
bamboo_capability_system_jdk_JDK_1_7=/usr/lib/jvm/java-7-openjdk-amd64
bamboo_planRepository_1_branchName=3.1.x
02-Feb-2020 13:13:22 From https://github.com/phpbb/phpbb
02-Feb-2020 13:13:22 * branch            refs/pull/5841/head -> FETCH_HEAD
02-Feb-2020 13:13:22   % Total    % Received % Xferd  Average Speed   Time    Time     Time  Current
02-Feb-2020 13:13:22                                  Dload  Upload   Total   Spent    Left  Speed
02-Feb-2020 13:13:22
02-Feb-2020 13:13:23   0     0    0     0    0     0      0      0 --:--:-- --:--:-- --:--:--     0
02-Feb-2020 13:13:23 100   275  100    93  100   182    155    304 --:--:-- --:--:-- --:--:--   303
02-Feb-2020 13:13:23 100   275  100    93  100   182    155    304 --:--:-- --:--:-- --:--:--   303
02-Feb-2020 13:13:23 Finished task 'Set pending build status' with result: Success
02-Feb-2020 13:13:23
Substituting variable: ${bamboo.PRnumber} with 5841
02-Feb-2020 13:13:23 Starting task 'Fetch PR' of type 'com.atlassian.bamboo.plugins.scripttask:task.builder.script'
02-Feb-2020 13:13:23
Beginning to execute external process for build 'phpBB3 - Pull Requests - Build and Test Job #9850 (PHPBB3-PR-JOB1-9850)'
... running command line:
/bin/sh /home/bamboo/temp/PHPBB3-PR-JOB1-9850-ScriptBuildTask-9014023522430531368.sh
... in: /home/bamboo/xml-data/build-dir/PHPBB3-PR-JOB1
... using extra environment variables:
bamboo_planRepository_1_branch=3.1.x
bamboo_planRepository_1_branchDisplayName=3.1.x
bamboo_repository_revision_number=dc8ff9da28b8ab4ad11c7ea94cca526f17c87fe5
bamboo_PRref=master
bamboo_resultsUrl=https://bamboo.phpbb.com/browse/PHPBB3-PR-JOB1-9850
bamboo_capability_system_builder_command_Git=/usr/bin/git
bamboo_repository_75956235_git_username=bantu
bamboo_build_working_directory=/home/bamboo/xml-data/build-dir/PHPBB3-PR-JOB1
bamboo_planRepository_1_name=phpBB Ascraeus
bamboo_buildKey=PHPBB3-PR-JOB1
bamboo_capability_phpbb_tests=true
bamboo_shortPlanName=Pull Requests
bamboo_capability_system_builder_command_fop=/usr/bin/fop
bamboo_capability_dbms_sqlite_2=true
bamboo_planRepository_name=phpBB Ascraeus
bamboo_PRnumber=5841
bamboo_buildNumber=9850
bamboo_repository_75956235_git_repositoryUrl=https://github.com/phpbb/phpbb.git
bamboo_capability_system_builder_phpunit_PHPUnit=/usr/bin/phpunit
bamboo_shortJobName=Build and Test Job
bamboo_buildResultsUrl=https://bamboo.phpbb.com/browse/PHPBB3-PR-JOB1-9850
bamboo_repository_75956235_branch_name=3.1.x
bamboo_planRepository_repositoryUrl=https://github.com/phpbb/phpbb.git
bamboo_agentId=131073
bamboo_planName=phpBB3 - Pull Requests
bamboo_build_commandline_com_atlassian_bamboo_plugins_scripttask_task_builder_script_7=/bin/sh /home/bamboo/temp/PHPBB3-PR-JOB1-9850-ScriptBuildTask-4165158688919937942.sh
bamboo_shortPlanKey=PR
bamboo_shortJobKey=JOB1
bamboo_capability_dbms_mysql_55=true
bamboo_capability_system_jdk_JDK_1_7_0_65=/usr/lib/jvm/java-7-openjdk-amd64
bamboo_planRepository_revision=dc8ff9da28b8ab4ad11c7ea94cca526f17c87fe5
bamboo_buildTimeStamp=2020-02-02T13:13:15.468Z
bamboo_repository_previous_revision_number=dc8ff9da28b8ab4ad11c7ea94cca526f17c87fe5
bamboo_capability_system_jdk_JDK_1_6_0_16=/usr/lib/jvm/java-6-sun-1.6.0.16
bamboo_capability_system_builder_mvn2_Maven_2=/usr/share/maven2
bamboo_planRepository_previousRevision=dc8ff9da28b8ab4ad11c7ea94cca526f17c87fe5
bamboo_repository_git_branch=3.1.x
bamboo_buildResultKey=PHPBB3-PR-JOB1-9850
bamboo_repository_branch_name=3.1.x
bamboo_buildPlanName=phpBB3 - Pull Requests - Build and Test Job
bamboo_planRepository_1_revision=dc8ff9da28b8ab4ad11c7ea94cca526f17c87fe5
bamboo_repository_name=phpBB Ascraeus
bamboo_buildFailed=false
bamboo_capability_system_docker_executable=/usr/bin/docker
bamboo_planRepository_branch=3.1.x
bamboo_agentWorkingDirectory=/home/bamboo/xml-data/build-dir
bamboo_capability_system_git_executable=/usr/bin/git
bamboo_capability_system_builder_phpunit_PHPUnit_3_4=/usr/bin/phpunit
bamboo_repository_git_username=bantu
bamboo_planRepository_1_previousRevision=dc8ff9da28b8ab4ad11c7ea94cca526f17c87fe5
bamboo_repository_75956235_revision_number=dc8ff9da28b8ab4ad11c7ea94cca526f17c87fe5
bamboo_planRepository_branchDisplayName=3.1.x
bamboo_planRepository_1_type=gitv2
bamboo_planRepository_branchName=3.1.x
bamboo_repository_75956235_previous_revision_number=dc8ff9da28b8ab4ad11c7ea94cca526f17c87fe5
bamboo_capability_system_jdk_JDK=/usr/lib/jvm/java-6-sun
bamboo_plan_storageTag=PHPBB3-PR
bamboo_hg_cache_directory=/home/bamboo/xml-data/build-dir/_hg-repositories-cache
bamboo_planRepository_1_username=bantu
bamboo_planRepository_type=gitv2
bamboo_git_cache_directory=/home/bamboo/xml-data/build-dir/_git-repositories-cache
bamboo_ManualBuildTriggerReason_userName=Build Robot
bamboo_repository_git_repositoryUrl=https://github.com/phpbb/phpbb.git
bamboo_repository_75956235_git_branch=3.1.x
bamboo_capability_system_builder_ant_Ant=/usr/share/ant
bamboo_repository_75956235_name=phpBB Ascraeus
bamboo_tmp_directory=/home/bamboo/temp
bamboo_working_directory=/home/bamboo/xml-data/build-dir/PHPBB3-PR-JOB1
bamboo_planKey=PHPBB3-PR
bamboo_capability_local=true
bamboo_planRepository_1_repositoryUrl=https://github.com/phpbb/phpbb.git
bamboo_planRepository_username=bantu
bamboo_capability_system_jdk_JDK_1_6=/usr/lib/jvm/java-6-sun
bamboo_capability_system_jdk_JDK_1_7=/usr/lib/jvm/java-7-openjdk-amd64
bamboo_planRepository_1_branchName=3.1.x
02-Feb-2020 13:13:26 From https://github.com/phpbb/phpbb
02-Feb-2020 13:13:26 * branch            refs/pull/5841/merge -> FETCH_HEAD
02-Feb-2020 13:13:27 Note: checking out 'FETCH_HEAD'.
02-Feb-2020 13:13:27
02-Feb-2020 13:13:27 You are in 'detached HEAD' state. You can look around, make experimental
02-Feb-2020 13:13:27 changes and commit them, and you can discard any commits you make in this
02-Feb-2020 13:13:27 state without impacting any branches by performing another checkout.
02-Feb-2020 13:13:27
02-Feb-2020 13:13:27 If you want to create a new branch to retain commits you create, you may
02-Feb-2020 13:13:27 do so (now or later) by using -b with the checkout command again. Example:
02-Feb-2020 13:13:27
02-Feb-2020 13:13:27   git checkout -b new_branch_name
02-Feb-2020 13:13:27
02-Feb-2020 13:13:27 HEAD is now at 433e26c... Merge 4fbc3a8dd8bfba08cdbdd2698eac2aa433f199e3 into 2d5289ed7e126eeec22a9b1af977bfcd87371ec5
02-Feb-2020 13:13:27 Finished task 'Fetch PR' with result: Success
02-Feb-2020 13:13:27 Skipping execution of task 'Prepare directory' as it is disabled
02-Feb-2020 13:13:27
Substituting variable: ${bamboo.working.directory} with /home/bamboo/xml-data/build-dir/PHPBB3-PR-JOB1
02-Feb-2020 13:13:27 Starting task 'Build image' of type 'com.atlassian.bamboo.plugins.bamboo-docker-plugin:task.docker.cli'
02-Feb-2020 13:13:27
Beginning to execute external process for build 'phpBB3 - Pull Requests - Build and Test Job #9850 (PHPBB3-PR-JOB1-9850)'
... running command line:
/usr/bin/docker build --force-rm=true --tag=phpbb:php-7.1 /home/bamboo/xml-data/build-dir/PHPBB3-PR-JOB1
... in: /home/bamboo/xml-data/build-dir/PHPBB3-PR-JOB1
... using extra environment variables:
bamboo_planRepository_1_branch=3.1.x
bamboo_planRepository_1_branchDisplayName=3.1.x
bamboo_repository_revision_number=dc8ff9da28b8ab4ad11c7ea94cca526f17c87fe5
bamboo_PRref=master
bamboo_resultsUrl=https://bamboo.phpbb.com/browse/PHPBB3-PR-JOB1-9850
bamboo_capability_system_builder_command_Git=/usr/bin/git
bamboo_repository_75956235_git_username=bantu
bamboo_build_working_directory=/home/bamboo/xml-data/build-dir/PHPBB3-PR-JOB1
bamboo_planRepository_1_name=phpBB Ascraeus
bamboo_buildKey=PHPBB3-PR-JOB1
bamboo_capability_phpbb_tests=true
bamboo_shortPlanName=Pull Requests
bamboo_capability_system_builder_command_fop=/usr/bin/fop
bamboo_capability_dbms_sqlite_2=true
bamboo_planRepository_name=phpBB Ascraeus
bamboo_PRnumber=5841
bamboo_buildNumber=9850
bamboo_repository_75956235_git_repositoryUrl=https://github.com/phpbb/phpbb.git
bamboo_capability_system_builder_phpunit_PHPUnit=/usr/bin/phpunit
bamboo_shortJobName=Build and Test Job
bamboo_buildResultsUrl=https://bamboo.phpbb.com/browse/PHPBB3-PR-JOB1-9850
bamboo_repository_75956235_branch_name=3.1.x
bamboo_planRepository_repositoryUrl=https://github.com/phpbb/phpbb.git
bamboo_agentId=131073
bamboo_planName=phpBB3 - Pull Requests
bamboo_build_commandline_com_atlassian_bamboo_plugins_scripttask_task_builder_script_7=/bin/sh /home/bamboo/temp/PHPBB3-PR-JOB1-9850-ScriptBuildTask-4165158688919937942.sh
bamboo_shortPlanKey=PR
bamboo_shortJobKey=JOB1
bamboo_capability_dbms_mysql_55=true
bamboo_capability_system_jdk_JDK_1_7_0_65=/usr/lib/jvm/java-7-openjdk-amd64
bamboo_planRepository_revision=dc8ff9da28b8ab4ad11c7ea94cca526f17c87fe5
bamboo_buildTimeStamp=2020-02-02T13:13:15.468Z
bamboo_repository_previous_revision_number=dc8ff9da28b8ab4ad11c7ea94cca526f17c87fe5
bamboo_capability_system_jdk_JDK_1_6_0_16=/usr/lib/jvm/java-6-sun-1.6.0.16
bamboo_capability_system_builder_mvn2_Maven_2=/usr/share/maven2
bamboo_planRepository_previousRevision=dc8ff9da28b8ab4ad11c7ea94cca526f17c87fe5
bamboo_build_commandline_com_atlassian_bamboo_plugins_scripttask_task_builder_script_4=/bin/sh /home/bamboo/temp/PHPBB3-PR-JOB1-9850-ScriptBuildTask-9014023522430531368.sh
bamboo_repository_git_branch=3.1.x
bamboo_buildResultKey=PHPBB3-PR-JOB1-9850
bamboo_repository_branch_name=3.1.x
bamboo_buildPlanName=phpBB3 - Pull Requests - Build and Test Job
bamboo_planRepository_1_revision=dc8ff9da28b8ab4ad11c7ea94cca526f17c87fe5
bamboo_repository_name=phpBB Ascraeus
bamboo_buildFailed=false
bamboo_capability_system_docker_executable=/usr/bin/docker
bamboo_planRepository_branch=3.1.x
bamboo_agentWorkingDirectory=/home/bamboo/xml-data/build-dir
bamboo_capability_system_git_executable=/usr/bin/git
bamboo_capability_system_builder_phpunit_PHPUnit_3_4=/usr/bin/phpunit
bamboo_repository_git_username=bantu
bamboo_planRepository_1_previousRevision=dc8ff9da28b8ab4ad11c7ea94cca526f17c87fe5
bamboo_repository_75956235_revision_number=dc8ff9da28b8ab4ad11c7ea94cca526f17c87fe5
bamboo_planRepository_branchDisplayName=3.1.x
bamboo_planRepository_1_type=gitv2
bamboo_planRepository_branchName=3.1.x
bamboo_repository_75956235_previous_revision_number=dc8ff9da28b8ab4ad11c7ea94cca526f17c87fe5
bamboo_capability_system_jdk_JDK=/usr/lib/jvm/java-6-sun
bamboo_plan_storageTag=PHPBB3-PR
bamboo_hg_cache_directory=/home/bamboo/xml-data/build-dir/_hg-repositories-cache
bamboo_planRepository_1_username=bantu
bamboo_planRepository_type=gitv2
bamboo_git_cache_directory=/home/bamboo/xml-data/build-dir/_git-repositories-cache
bamboo_ManualBuildTriggerReason_userName=Build Robot
bamboo_repository_git_repositoryUrl=https://github.com/phpbb/phpbb.git
bamboo_repository_75956235_git_branch=3.1.x
bamboo_capability_system_builder_ant_Ant=/usr/share/ant
bamboo_repository_75956235_name=phpBB Ascraeus
bamboo_tmp_directory=/home/bamboo/temp
bamboo_working_directory=/home/bamboo/xml-data/build-dir/PHPBB3-PR-JOB1
bamboo_planKey=PHPBB3-PR
bamboo_capability_local=true
bamboo_planRepository_1_repositoryUrl=https://github.com/phpbb/phpbb.git
bamboo_planRepository_username=bantu
bamboo_capability_system_jdk_JDK_1_6=/usr/lib/jvm/java-6-sun
bamboo_capability_system_jdk_JDK_1_7=/usr/lib/jvm/java-7-openjdk-amd64
bamboo_planRepository_1_branchName=3.1.x
02-Feb-2020 13:13:27 Sending build context to Docker daemon  48.19MB
02-Feb-2020 13:13:27
02-Feb-2020 13:13:28 Step 1/5 : FROM php:7.1
02-Feb-2020 13:13:28 ---> 060b5298208c
02-Feb-2020 13:13:28 Step 2/5 : RUN apt-get update && apt-get install -y         git         zlib1g-dev         bzip2         zip         && docker-php-ext-install -j$(nproc) zip
02-Feb-2020 13:13:28 ---> Using cache
02-Feb-2020 13:13:28 ---> 7d5d8abc6bfc
02-Feb-2020 13:13:28 Step 3/5 : RUN pecl install xdebug-2.6.1
02-Feb-2020 13:13:28 ---> Using cache
02-Feb-2020 13:13:28 ---> c3b44b07eeef
02-Feb-2020 13:13:28 Step 4/5 : RUN docker-php-ext-enable xdebug
02-Feb-2020 13:13:28 ---> Using cache
02-Feb-2020 13:13:28 ---> e709f5cec0aa
02-Feb-2020 13:13:28 Step 5/5 : RUN echo "memory_limit = 1536M" >> /usr/local/etc/php/conf.d/memory.ini
02-Feb-2020 13:13:28 ---> Using cache
02-Feb-2020 13:13:28 ---> d3b680d74677
02-Feb-2020 13:13:28 Successfully built d3b680d74677
02-Feb-2020 13:13:28 Successfully tagged phpbb:php-7.1
02-Feb-2020 13:13:28 Built Docker image 'phpbb:php-7.1'
02-Feb-2020 13:13:28 Finished task 'Build image' with result: Success
02-Feb-2020 13:13:28
Substituting variable: ${bamboo.working.directory} with /home/bamboo/xml-data/build-dir/PHPBB3-PR-JOB1
02-Feb-2020 13:13:28 Starting task 'Prepare directory' of type 'com.atlassian.bamboo.plugins.bamboo-docker-plugin:task.docker.cli'
02-Feb-2020 13:13:28 Running image name (phpbb:php-7.1)
02-Feb-2020 13:13:28
Beginning to execute external process for build 'phpBB3 - Pull Requests - Build and Test Job #9850 (PHPBB3-PR-JOB1-9850)'
... running command line:
/usr/bin/docker run --volume /home/bamboo/xml-data/build-dir/PHPBB3-PR-JOB1:/data --workdir /data/phpBB --rm -e HOME=/home/bamboo -u=991 phpbb:php-7.1 /bin/bash -c php ../composer.phar install --dev; cd ../build; ../phpBB/vendor/bin/phing clean prepare
... in: /home/bamboo/xml-data/build-dir/PHPBB3-PR-JOB1
... using extra environment variables:
bamboo_planRepository_1_branch=3.1.x
bamboo_planRepository_1_branchDisplayName=3.1.x
bamboo_repository_revision_number=dc8ff9da28b8ab4ad11c7ea94cca526f17c87fe5
bamboo_PRref=master
bamboo_resultsUrl=https://bamboo.phpbb.com/browse/PHPBB3-PR-JOB1-9850
bamboo_capability_system_builder_command_Git=/usr/bin/git
bamboo_repository_75956235_git_username=bantu
bamboo_build_working_directory=/home/bamboo/xml-data/build-dir/PHPBB3-PR-JOB1
bamboo_planRepository_1_name=phpBB Ascraeus
bamboo_buildKey=PHPBB3-PR-JOB1
bamboo_capability_phpbb_tests=true
bamboo_shortPlanName=Pull Requests
bamboo_capability_system_builder_command_fop=/usr/bin/fop
bamboo_capability_dbms_sqlite_2=true
bamboo_planRepository_name=phpBB Ascraeus
bamboo_PRnumber=5841
bamboo_buildNumber=9850
bamboo_repository_75956235_git_repositoryUrl=https://github.com/phpbb/phpbb.git
bamboo_capability_system_builder_phpunit_PHPUnit=/usr/bin/phpunit
bamboo_shortJobName=Build and Test Job
bamboo_buildResultsUrl=https://bamboo.phpbb.com/browse/PHPBB3-PR-JOB1-9850
bamboo_repository_75956235_branch_name=3.1.x
bamboo_planRepository_repositoryUrl=https://github.com/phpbb/phpbb.git
bamboo_agentId=131073
bamboo_planName=phpBB3 - Pull Requests
bamboo_build_commandline_com_atlassian_bamboo_plugins_scripttask_task_builder_script_7=/bin/sh /home/bamboo/temp/PHPBB3-PR-JOB1-9850-ScriptBuildTask-4165158688919937942.sh
bamboo_shortPlanKey=PR
bamboo_shortJobKey=JOB1
bamboo_capability_dbms_mysql_55=true
bamboo_capability_system_jdk_JDK_1_7_0_65=/usr/lib/jvm/java-7-openjdk-amd64
bamboo_planRepository_revision=dc8ff9da28b8ab4ad11c7ea94cca526f17c87fe5
bamboo_buildTimeStamp=2020-02-02T13:13:15.468Z
bamboo_repository_previous_revision_number=dc8ff9da28b8ab4ad11c7ea94cca526f17c87fe5
bamboo_capability_system_jdk_JDK_1_6_0_16=/usr/lib/jvm/java-6-sun-1.6.0.16
bamboo_capability_system_builder_mvn2_Maven_2=/usr/share/maven2
bamboo_planRepository_previousRevision=dc8ff9da28b8ab4ad11c7ea94cca526f17c87fe5
bamboo_build_commandline_com_atlassian_bamboo_plugins_scripttask_task_builder_script_4=/bin/sh /home/bamboo/temp/PHPBB3-PR-JOB1-9850-ScriptBuildTask-9014023522430531368.sh
bamboo_repository_git_branch=3.1.x
bamboo_buildResultKey=PHPBB3-PR-JOB1-9850
bamboo_repository_branch_name=3.1.x
bamboo_buildPlanName=phpBB3 - Pull Requests - Build and Test Job
bamboo_planRepository_1_revision=dc8ff9da28b8ab4ad11c7ea94cca526f17c87fe5
bamboo_repository_name=phpBB Ascraeus
bamboo_buildFailed=false
bamboo_capability_system_docker_executable=/usr/bin/docker
bamboo_build_commandline_com_atlassian_bamboo_plugins_bamboo_docker_plugin_task_docker_cli_13=/usr/bin/docker build --force-rm=true --tag=phpbb:php-7.1 /home/bamboo/xml-data/build-dir/PHPBB3-PR-JOB1
bamboo_planRepository_branch=3.1.x
bamboo_agentWorkingDirectory=/home/bamboo/xml-data/build-dir
bamboo_capability_system_git_executable=/usr/bin/git
bamboo_capability_system_builder_phpunit_PHPUnit_3_4=/usr/bin/phpunit
bamboo_repository_git_username=bantu
bamboo_planRepository_1_previousRevision=dc8ff9da28b8ab4ad11c7ea94cca526f17c87fe5
bamboo_repository_75956235_revision_number=dc8ff9da28b8ab4ad11c7ea94cca526f17c87fe5
bamboo_planRepository_branchDisplayName=3.1.x
bamboo_planRepository_1_type=gitv2
bamboo_planRepository_branchName=3.1.x
bamboo_repository_75956235_previous_revision_number=dc8ff9da28b8ab4ad11c7ea94cca526f17c87fe5
bamboo_capability_system_jdk_JDK=/usr/lib/jvm/java-6-sun
bamboo_plan_storageTag=PHPBB3-PR
bamboo_hg_cache_directory=/home/bamboo/xml-data/build-dir/_hg-repositories-cache
bamboo_planRepository_1_username=bantu
bamboo_planRepository_type=gitv2
bamboo_git_cache_directory=/home/bamboo/xml-data/build-dir/_git-repositories-cache
bamboo_ManualBuildTriggerReason_userName=Build Robot
bamboo_repository_git_repositoryUrl=https://github.com/phpbb/phpbb.git
bamboo_repository_75956235_git_branch=3.1.x
bamboo_capability_system_builder_ant_Ant=/usr/share/ant
bamboo_repository_75956235_name=phpBB Ascraeus
bamboo_tmp_directory=/home/bamboo/temp
bamboo_working_directory=/home/bamboo/xml-data/build-dir/PHPBB3-PR-JOB1
bamboo_planKey=PHPBB3-PR
bamboo_capability_local=true
bamboo_planRepository_1_repositoryUrl=https://github.com/phpbb/phpbb.git
bamboo_planRepository_username=bantu
bamboo_capability_system_jdk_JDK_1_6=/usr/lib/jvm/java-6-sun
bamboo_capability_system_jdk_JDK_1_7=/usr/lib/jvm/java-7-openjdk-amd64
bamboo_planRepository_1_branchName=3.1.x
02-Feb-2020 13:13:29 Cannot create cache directory /home/bamboo/.composer/cache/repo/https---repo.packagist.org/, or directory is not writable. Proceeding without cache
02-Feb-2020 13:13:29 Cannot create cache directory /home/bamboo/.composer/cache/files/, or directory is not writable. Proceeding without cache
02-Feb-2020 13:13:29 You are using the deprecated option "dev". Dev packages are installed by default now.
02-Feb-2020 13:13:29 Loading composer repositories with package information
02-Feb-2020 13:13:29 Installing dependencies (including require-dev) from lock file
02-Feb-2020 13:13:29 Package operations: 89 installs, 0 updates, 0 removals
02-Feb-2020 13:13:30   - Installing composer/installers (v1.7.0): Downloading (connecting...)Downloading (0%)           Downloading (5%)Downloading (10%)Downloading (15%)Downloading (20%)Downloading (50%)Downloading (55%)Downloading (60%)Downloading (100%)
02-Feb-2020 13:13:31   - Installing ocramius/package-versions (1.4.2): Downloading (connecting...)Downloading (0%)           Downloading (30%)Downloading (45%)Downloading (80%)Downloading (100%)
02-Feb-2020 13:13:31   - Installing bantu/ini-get-wrapper (v1.0.1): Downloading (connecting...)Downloading (100%)         
02-Feb-2020 13:13:32   - Installing symfony/process (v3.4.36): Downloading (connecting...)Downloading (0%)           Downloading (5%)Downloading (35%)Downloading (40%)Downloading (45%)Downloading (50%)Downloading (55%)Downloading (60%)Downloading (90%)Downloading (95%)Downloading (100%)
02-Feb-2020 13:13:33   - Installing symfony/finder (v3.4.36): Downloading (connecting...)Downloading (100%)         
02-Feb-2020 13:13:33   - Installing symfony/polyfill-ctype (v1.13.1): Downloading (connecting...)Downloading (0%)           Downloading (85%)Downloading (100%)
02-Feb-2020 13:13:34   - Installing symfony/filesystem (v3.4.36): Downloading (connecting...)Downloading (100%)         
02-Feb-2020 13:13:35   - Installing symfony/polyfill-mbstring (v1.13.1): Downloading (connecting...)Downloading (0%)           Downloading (30%)Downloading (60%)Downloading (90%)Downloading (100%)
02-Feb-2020 13:13:35   - Installing psr/log (1.1.2): Downloading (connecting...)Downloading (0%)           Downloading (25%)Downloading (100%)
02-Feb-2020 13:13:36   - Installing symfony/debug (v3.4.36): Downloading (connecting...)Downloading (0%)           Downloading (5%)Downloading (15%)Downloading (20%)Downloading (40%)Downloading (45%)Downloading (50%)Downloading (60%)Downloading (65%)Downloading (80%)Downloading (85%)Downloading (100%)
02-Feb-2020 13:13:37   - Installing symfony/console (v3.4.36): Downloading (connecting...)Downloading (100%)         
02-Feb-2020 13:13:37   - Installing seld/phar-utils (1.0.1): Downloading (connecting...)Downloading (0%)           Downloading (30%)Downloading (60%)Downloading (100%)
02-Feb-2020 13:13:38   - Installing seld/jsonlint (1.7.2): Downloading (connecting...)Downloading (0%)           Downloading (15%)Downloading (50%)Downloading (100%)
02-Feb-2020 13:13:39   - Installing justinrainbow/json-schema (5.2.9): Downloading (connecting...)Downloading (0%)           Downloading (15%)Downloading (35%)Downloading (40%)Downloading (55%)Downloading (70%)Downloading (75%)Downloading (90%)Downloading (95%)Downloading (100%)
02-Feb-2020 13:13:39   - Installing composer/xdebug-handler (1.4.0): Downloading (connecting...)Downloading (0%)           Downloading (40%)Downloading (45%)Downloading (85%)Downloading (100%)
02-Feb-2020 13:13:40   - Installing composer/spdx-licenses (1.5.2): Downloading (connecting...)Downloading (100%)         
02-Feb-2020 13:13:40   - Installing composer/semver (1.5.0): Downloading (connecting...)Downloading (0%)           Downloading (35%)Downloading (70%)Downloading (100%)
02-Feb-2020 13:13:41   - Installing composer/ca-bundle (1.2.5): Downloading (connecting...)Downloading (0%)           Downloading (5%)Downloading (10%)Downloading (15%)Downloading (20%)Downloading (25%)Downloading (30%)Downloading (35%)Downloading (40%)Downloading (45%)Downloading (50%)Downloading (55%)Downloading (60%)Downloading (65%)Downloading (70%)Downloading (75%)Downloading (80%)Downloading (85%)Downloading (90%)Downloading (95%)Downloading (100%)
02-Feb-2020 13:13:42   - Installing composer/composer (1.9.1): Downloading (connecting...)Downloading (100%)         
02-Feb-2020 13:13:42   - Installing doctrine/event-manager (1.1.0): Downloading (connecting...)Downloading (0%)           Downloading (90%)Downloading (100%)
02-Feb-2020 13:13:43   - Installing doctrine/cache (1.10.0): Downloading (connecting...)Downloading (100%)         
02-Feb-2020 13:13:44   - Installing doctrine/dbal (v2.9.3): Downloading (connecting...)Downloading (0%)           Downloading (5%)Downloading (10%)Downloading (15%)Downloading (20%)Downloading (25%)Downloading (30%)Downloading (35%)Downloading (40%)Downloading (45%)Downloading (50%)Downloading (55%)Downloading (60%)Downloading (65%)Downloading (70%)Downloading (75%)Downloading (80%)Downloading (85%)Downloading (100%)
02-Feb-2020 13:13:45   - Installing google/recaptcha (1.2.3): Downloading (connecting...)Downloading (0%)           Downloading (15%)Downloading (30%)Downloading (35%)Downloading (40%)Downloading (45%)Downloading (55%)Downloading (60%)Downloading (70%)Downloading (75%)Downloading (90%)Downloading (100%)
02-Feb-2020 13:13:45   - Installing guzzlehttp/promises (v1.3.1): Downloading (connecting...)Downloading (0%)           Downloading (30%)Downloading (40%)Downloading (70%)Downloading (100%)
02-Feb-2020 13:13:46   - Installing ralouphie/getallheaders (3.0.3): Downloading (connecting...)Downloading (0%)           Downloading (80%)Downloading (100%)
02-Feb-2020 13:13:46   - Installing psr/http-message (1.0.1): Downloading (connecting...)Downloading (0%)           Downloading (65%)Downloading (100%)
02-Feb-2020 13:13:47   - Installing guzzlehttp/psr7 (1.6.1): Downloading (connecting...)Downloading (0%)           Downloading (5%)Downloading (10%)Downloading (50%)Downloading (55%)Downloading (60%)Downloading (65%)Downloading (100%)
02-Feb-2020 13:13:48   - Installing lusitanian/oauth (v0.8.11): Downloading (connecting...)Downloading (0%)           Downloading (5%)Downloading (10%)Downloading (15%)Downloading (20%)Downloading (25%)Downloading (30%)Downloading (40%)Downloading (45%)Downloading (55%)Downloading (60%)Downloading (70%)Downloading (75%)Downloading (85%)Downloading (90%)Downloading (100%)
02-Feb-2020 13:13:48   - Installing marc1706/fast-image-size (v1.1.6): Downloading (connecting...)Downloading (100%)         
02-Feb-2020 13:13:49   - Installing patchwork/utf8 (v1.3.2): Downloading (connecting...)Downloading (100%)         
02-Feb-2020 13:13:50   - Installing psr/container (1.0.0): Downloading (connecting...)Downloading (0%)           Downloading (75%)Downloading (100%)
02-Feb-2020 13:13:50   - Installing s9e/regexp-builder (1.4.4): Downloading (connecting...)Downloading (100%)         
02-Feb-2020 13:13:51   - Installing s9e/text-formatter (2.3.1): Downloading (connecting...)Downloading (100%)         
02-Feb-2020 13:13:52   - Installing symfony/config (v3.4.36): Downloading (connecting...)Downloading (0%)           Downloading (5%)Downloading (10%)Downloading (15%)Downloading (20%)Downloading (25%)Downloading (30%)Downloading (35%)Downloading (40%)Downloading (45%)Downloading (50%)Downloading (55%)Downloading (60%)Downloading (65%)Downloading (70%)Downloading (75%)Downloading (80%)Downloading (85%)Downloading (90%)Downloading (95%)Downloading (100%)
02-Feb-2020 13:13:53   - Installing symfony/polyfill-util (v1.13.1): Downloading (connecting...)Downloading (0%)           Downloading (100%)
02-Feb-2020 13:13:53   - Installing symfony/polyfill-php56 (v1.13.1): Downloading (connecting...)Downloading (0%)           Downloading (100%)
02-Feb-2020 13:13:54   - Installing paragonie/random_compat (v9.99.99): Downloading (connecting...)Downloading (0%)           Downloading (45%)Downloading (90%)Downloading (100%)
02-Feb-2020 13:13:54   - Installing symfony/polyfill-php70 (v1.13.1): Downloading (connecting...)Downloading (0%)           Downloading (85%)Downloading (100%)
02-Feb-2020 13:13:55   - Installing symfony/http-foundation (v3.4.36): Downloading (connecting...)Downloading (100%)         
02-Feb-2020 13:13:56   - Installing symfony/event-dispatcher (v3.4.36): Downloading (connecting...)Downloading (100%)         
02-Feb-2020 13:13:56   - Installing symfony/http-kernel (v3.4.36): Downloading (connecting...)Downloading (100%)         
02-Feb-2020 13:13:57   - Installing symfony/dependency-injection (v3.4.36): Downloading (connecting...)Downloading (100%)         
02-Feb-2020 13:13:58   - Installing zendframework/zend-eventmanager (3.2.1): Downloading (connecting...)Downloading (0%)           Downloading (15%)Downloading (20%)Downloading (35%)Downloading (60%)Downloading (75%)Downloading (80%)Downloading (95%)Downloading (100%)
02-Feb-2020 13:13:59   - Installing zendframework/zend-code (3.4.1): Downloading (connecting...)Downloading (0%)           Downloading (5%)Downloading (10%)Downloading (15%)Downloading (20%)Downloading (25%)Downloading (30%)Downloading (35%)Downloading (40%)Downloading (45%)Downloading (50%)Downloading (55%)Downloading (60%)Downloading (65%)Downloading (70%)Downloading (75%)Downloading (80%)Downloading (85%)Downloading (90%)Downloading (95%)Downloading (100%)
02-Feb-2020 13:13:59   - Installing ocramius/proxy-manager (2.1.1): Downloading (connecting...)Downloading (100%)         
02-Feb-2020 13:14:00   - Installing symfony/proxy-manager-bridge (v3.4.36): Downloading (connecting...)Downloading (100%)         
02-Feb-2020 13:14:01   - Installing symfony/routing (v3.4.36): Downloading (connecting...)Downloading (0%)           Downloading (5%)Downloading (10%)Downloading (15%)Downloading (20%)Downloading (25%)Downloading (30%)Downloading (35%)Downloading (40%)Downloading (45%)Downloading (50%)Downloading (55%)Downloading (60%)Downloading (65%)Downloading (70%)Downloading (75%)Downloading (80%)Downloading (85%)Downloading (90%)Downloading (95%)Downloading (100%)
02-Feb-2020 13:14:02   - Installing twig/twig (v2.12.2): Downloading (connecting...)Downloading (100%)         
02-Feb-2020 13:14:03   - Installing symfony/twig-bridge (v3.4.36): Downloading (connecting...)Downloading (0%)           Downloading (5%)Downloading (10%)Downloading (15%)Downloading (20%)Downloading (25%)Downloading (30%)Downloading (35%)Downloading (40%)Downloading (45%)Downloading (50%)Downloading (55%)Downloading (60%)Downloading (65%)Downloading (70%)Downloading (75%)Downloading (80%)Downloading (85%)Downloading (90%)Downloading (95%)Downloading (100%)
02-Feb-2020 13:14:03   - Installing symfony/dom-crawler (v3.4.36): Downloading (connecting...)Downloading (0%)           Downloading (15%)Downloading (35%)Downloading (40%)Downloading (65%)Downloading (70%)Downloading (90%)Downloading (95%)Downloading (100%)
02-Feb-2020 13:14:04   - Installing symfony/css-selector (v3.4.36): Downloading (connecting...)Downloading (100%)         
02-Feb-2020 13:14:05   - Installing symfony/browser-kit (v3.4.36): Downloading (connecting...)Downloading (0%)           Downloading (5%)Downloading (30%)Downloading (35%)Downloading (100%)
02-Feb-2020 13:14:05   - Installing guzzlehttp/guzzle (6.5.2): Downloading (connecting...)Downloading (0%)           Downloading (5%)Downloading (10%)Downloading (15%)Downloading (20%)Downloading (25%)Downloading (35%)Downloading (40%)Downloading (55%)Downloading (60%)Downloading (65%)Downloading (70%)Downloading (75%)Downloading (90%)Downloading (95%)Downloading (100%)
02-Feb-2020 13:14:06   - Installing fabpot/goutte (v3.2.3): Downloading (connecting...)Downloading (0%)           Downloading (40%)Downloading (100%)
02-Feb-2020 13:14:07   - Installing facebook/webdriver (1.7.1): Downloading (connecting...)Downloading (0%)           Downloading (100%)
02-Feb-2020 13:14:08   - Installing symfony/yaml (v3.4.36): Downloading (connecting...)Downloading (100%)         
02-Feb-2020 13:14:08   - Installing laravel/homestead (v7.20.0): Downloading (connecting...)Downloading (100%)         
02-Feb-2020 13:14:09   - Installing phing/phing (2.16.1): Downloading (connecting...)Downloading (100%)         
02-Feb-2020 13:14:10   - Installing sebastian/version (2.0.1): Downloading (connecting...)Downloading (0%)           Downloading (100%)
02-Feb-2020 13:14:11   - Installing sebastian/resource-operations (2.0.1): Downloading (connecting...)Downloading (0%)           Downloading (25%)Downloading (35%)Downloading (55%)Downloading (80%)Downloading (100%)
02-Feb-2020 13:14:11   - Installing sebastian/recursion-context (3.0.0): Downloading (connecting...)Downloading (0%)           Downloading (35%)Downloading (70%)Downloading (100%)
02-Feb-2020 13:14:12   - Installing sebastian/object-reflector (1.1.1): Downloading (connecting...)Downloading (0%)           Downloading (65%)Downloading (100%)
02-Feb-2020 13:14:12   - Installing sebastian/object-enumerator (3.0.3): Downloading (connecting...)Downloading (0%)           Downloading (100%)
02-Feb-2020 13:14:13   - Installing sebastian/global-state (2.0.0): Downloading (connecting...)Downloading (0%)           Downloading (20%)Downloading (75%)Downloading (95%)Downloading (100%)
02-Feb-2020 13:14:13   - Installing sebastian/exporter (3.1.2): Downloading (connecting...)Downloading (0%)           Downloading (10%)Downloading (20%)Downloading (30%)Downloading (40%)Downloading (50%)Downloading (100%)
02-Feb-2020 13:14:14   - Installing sebastian/environment (4.2.3): Downloading (connecting...)Downloading (0%)           Downloading (45%)Downloading (80%)Downloading (100%)
02-Feb-2020 13:14:14   - Installing sebastian/diff (3.0.2): Downloading (connecting...)Downloading (0%)           Downloading (20%)Downloading (40%)Downloading (45%)Downloading (60%)Downloading (65%)Downloading (80%)Downloading (85%)Downloading (100%)
02-Feb-2020 13:14:15   - Installing sebastian/comparator (3.0.2): Downloading (connecting...)Downloading (0%)           Downloading (30%)Downloading (55%)Downloading (80%)Downloading (100%)
02-Feb-2020 13:14:16   - Installing phpunit/php-timer (2.1.2): Downloading (connecting...)Downloading (0%)           Downloading (35%)Downloading (70%)Downloading (95%)Downloading (100%)
02-Feb-2020 13:14:16   - Installing phpunit/php-text-template (1.2.1): Downloading (connecting...)Downloading (0%)           Downloading (35%)Downloading (85%)Downloading (100%)
02-Feb-2020 13:14:17   - Installing phpunit/php-file-iterator (2.0.2): Downloading (connecting...)Downloading (0%)           Downloading (35%)Downloading (70%)Downloading (95%)Downloading (100%)
02-Feb-2020 13:14:17   - Installing theseer/tokenizer (1.1.3): Downloading (connecting...)Downloading (0%)           Downloading (15%)Downloading (30%)Downloading (100%)
02-Feb-2020 13:14:18   - Installing sebastian/code-unit-reverse-lookup (1.0.1): Downloading (connecting...)Downloading (0%)           Downloading (55%)Downloading (100%)
02-Feb-2020 13:14:19   - Installing phpunit/php-token-stream (3.1.1): Downloading (connecting...)Downloading (100%)         
02-Feb-2020 13:14:19   - Installing phpunit/php-code-coverage (6.1.4): Downloading (connecting...)Downloading (0%)           Downloading (5%)Downloading (10%)Downloading (15%)Downloading (20%)Downloading (25%)Downloading (30%)Downloading (35%)Downloading (40%)Downloading (45%)Downloading (50%)Downloading (55%)Downloading (60%)Downloading (65%)Downloading (70%)Downloading (75%)Downloading (80%)Downloading (85%)Downloading (90%)Downloading (95%)Downloading (100%)
02-Feb-2020 13:14:20   - Installing phpdocumentor/reflection-docblock (2.0.5): Downloading (connecting...)Downloading (100%)         
02-Feb-2020 13:14:21   - Installing doctrine/instantiator (1.3.0): Downloading (connecting...)Downloading (0%)           Downloading (45%)Downloading (95%)Downloading (100%)
02-Feb-2020 13:14:21   - Installing phpspec/prophecy (1.10.1): Downloading (connecting...)Downloading (0%)           Downloading (10%)Downloading (15%)Downloading (20%)Downloading (25%)Downloading (30%)Downloading (35%)Downloading (40%)Downloading (45%)Downloading (50%)Downloading (60%)Downloading (70%)Downloading (75%)Downloading (80%)Downloading (85%)Downloading (90%)Downloading (95%)Downloading (100%)
02-Feb-2020 13:14:22   - Installing phar-io/version (2.0.1): Downloading (connecting...)Downloading (0%)           Downloading (5%)Downloading (10%)Downloading (70%)Downloading (75%)Downloading (80%)Downloading (85%)Downloading (100%)
02-Feb-2020 13:14:22   - Installing phar-io/manifest (1.0.3): Downloading (connecting...)Downloading (0%)           Downloading (10%)Downloading (15%)Downloading (25%)Downloading (35%)Downloading (40%)Downloading (50%)Downloading (55%)Downloading (65%)Downloading (75%)Downloading (80%)Downloading (90%)Downloading (100%)
02-Feb-2020 13:14:23   - Installing myclabs/deep-copy (1.9.4): Downloading (connecting...)Downloading (0%)           Downloading (5%)Downloading (10%)Downloading (35%)Downloading (40%)Downloading (45%)Downloading (50%)Downloading (55%)Downloading (60%)Downloading (65%)Downloading (70%)Downloading (100%)
02-Feb-2020 13:14:24   - Installing phpunit/phpunit (7.5.18): Downloading (connecting...)Downloading (100%)         
02-Feb-2020 13:14:25   - Installing phpunit/dbunit (4.0.0): Downloading (connecting...)Downloading (100%)         
02-Feb-2020 13:14:26   - Installing pimple/pimple (v3.2.3): Downloading (connecting...)Downloading (0%)           Downloading (5%)Downloading (10%)Downloading (45%)Downloading (85%)Downloading (90%)Downloading (95%)Downloading (100%)
02-Feb-2020 13:14:26   - Installing nikic/php-parser (v3.1.5): Downloading (connecting...)Downloading (100%)         
02-Feb-2020 13:14:27   - Installing michelf/php-markdown (1.9.0): Downloading (connecting...)Downloading (0%)           Downloading (5%)Downloading (10%)Downloading (15%)Downloading (25%)Downloading (30%)Downloading (35%)Downloading (40%)Downloading (45%)Downloading (50%)Downloading (55%)Downloading (60%)Downloading (65%)Downloading (70%)Downloading (80%)Downloading (85%)Downloading (90%)Downloading (95%)Downloading (100%)
02-Feb-2020 13:14:28   - Installing blackfire/php-sdk (v1.21.0): Downloading (connecting...)Downloading (100%)         
02-Feb-2020 13:14:29   - Installing sami/sami (v4.1.2): Downloading (connecting...)Downloading (100%)         
02-Feb-2020 13:14:30   - Installing squizlabs/php_codesniffer (3.5.3): Downloading (connecting...)Downloading (0%)           Downloading (5%)Downloading (10%)Downloading (15%)Downloading (20%)Downloading (25%)Downloading (30%)Downloading (35%)Downloading (40%)Downloading (45%)Downloading (50%)Downloading (55%)Downloading (60%)Downloading (65%)Downloading (70%)Downloading (75%)Downloading (80%)Downloading (85%)Downloading (90%)Downloading (95%)Downloading (100%)
02-Feb-2020 13:14:31 symfony/console suggests installing symfony/lock
02-Feb-2020 13:14:31 doctrine/cache suggests installing alcaeus/mongo-php-adapter (Required to use legacy MongoDB driver)
02-Feb-2020 13:14:31 guzzlehttp/psr7 suggests installing zendframework/zend-httphandlerrunner (Emit PSR-7 responses)
02-Feb-2020 13:14:31 lusitanian/oauth suggests installing predis/predis (Allows using the Redis storage backend.)
02-Feb-2020 13:14:31 patchwork/utf8 suggests installing ext-intl (Use Intl for best performance)
02-Feb-2020 13:14:31 patchwork/utf8 suggests installing ext-wfio (Use WFIO for UTF-8 filesystem access on Windows)
02-Feb-2020 13:14:31 s9e/text-formatter suggests installing ext-intl (Allows international URLs to be accepted by the URL filter)
02-Feb-2020 13:14:31 s9e/text-formatter suggests installing ext-xsl (Enables the XSLT renderer)
02-Feb-2020 13:14:31 paragonie/random_compat suggests installing ext-libsodium (Provides a modern crypto API that can be used to generate random bytes.)
02-Feb-2020 13:14:31 symfony/http-kernel suggests installing symfony/var-dumper
02-Feb-2020 13:14:31 symfony/dependency-injection suggests installing symfony/expression-language (For using expressions in service container configuration)
02-Feb-2020 13:14:31 zendframework/zend-eventmanager suggests installing container-interop/container-interop (^1.1.0, to use the lazy listeners feature)
02-Feb-2020 13:14:31 zendframework/zend-eventmanager suggests installing zendframework/zend-stdlib (^2.7.3 || ^3.0, to use the FilterChain feature)
02-Feb-2020 13:14:31 zendframework/zend-code suggests installing doctrine/annotations (Doctrine\Common\Annotations >=1.0 for annotation features)
02-Feb-2020 13:14:31 zendframework/zend-code suggests installing zendframework/zend-stdlib (Zend\Stdlib component)
02-Feb-2020 13:14:31 ocramius/proxy-manager suggests installing ocramius/generated-hydrator (To have very fast object to array to object conversion for ghost objects)
02-Feb-2020 13:14:31 ocramius/proxy-manager suggests installing zendframework/zend-json (To have the JsonRpc adapter (Remote Object feature))
02-Feb-2020 13:14:31 ocramius/proxy-manager suggests installing zendframework/zend-soap (To have the Soap adapter (Remote Object feature))
02-Feb-2020 13:14:31 ocramius/proxy-manager suggests installing zendframework/zend-xmlrpc (To have the XmlRpc adapter (Remote Object feature))
02-Feb-2020 13:14:31 symfony/routing suggests installing doctrine/annotations (For using the annotation loader)
02-Feb-2020 13:14:31 symfony/routing suggests installing symfony/expression-language (For using expression matching)
02-Feb-2020 13:14:31 symfony/twig-bridge suggests installing symfony/asset (For using the AssetExtension)
02-Feb-2020 13:14:31 symfony/twig-bridge suggests installing symfony/expression-language (For using the ExpressionExtension)
02-Feb-2020 13:14:31 symfony/twig-bridge suggests installing symfony/form (For using the FormExtension)
02-Feb-2020 13:14:31 symfony/twig-bridge suggests installing symfony/security (For using the SecurityExtension)
02-Feb-2020 13:14:31 symfony/twig-bridge suggests installing symfony/stopwatch (For using the StopwatchExtension)
02-Feb-2020 13:14:31 symfony/twig-bridge suggests installing symfony/templating (For using the TwigEngine)
02-Feb-2020 13:14:31 symfony/twig-bridge suggests installing symfony/translation (For using the TranslationExtension)
02-Feb-2020 13:14:31 symfony/twig-bridge suggests installing symfony/var-dumper (For using the DumpExtension)
02-Feb-2020 13:14:31 symfony/twig-bridge suggests installing symfony/web-link (For using the WebLinkExtension)
02-Feb-2020 13:14:31 guzzlehttp/guzzle suggests installing ext-intl (Required for Internationalized Domain Name (IDN) support)
02-Feb-2020 13:14:31 facebook/webdriver suggests installing ext-SimpleXML (For Firefox profile creation)
02-Feb-2020 13:14:31 phing/phing suggests installing pdepend/pdepend (PHP version of JDepend)
02-Feb-2020 13:14:31 phing/phing suggests installing pear/archive_tar (Tar file management class)
02-Feb-2020 13:14:31 phing/phing suggests installing pear/versioncontrol_git (A library that provides OO interface to handle Git repository)
02-Feb-2020 13:14:31 phing/phing suggests installing pear/versioncontrol_svn (A simple OO-style interface for Subversion, the free/open-source version control system)
02-Feb-2020 13:14:31 phing/phing suggests installing phpdocumentor/phpdocumentor (Documentation Generator for PHP)
02-Feb-2020 13:14:31 phing/phing suggests installing phploc/phploc (A tool for quickly measuring the size of a PHP project)
02-Feb-2020 13:14:31 phing/phing suggests installing phpmd/phpmd (PHP version of PMD tool)
02-Feb-2020 13:14:31 phing/phing suggests installing sebastian/phpcpd (Copy/Paste Detector (CPD) for PHP code)
02-Feb-2020 13:14:31 phing/phing suggests installing siad007/versioncontrol_hg (A library for interfacing with Mercurial repositories.)
02-Feb-2020 13:14:31 phing/phing suggests installing tedivm/jshrink (Javascript Minifier built in PHP)
02-Feb-2020 13:14:31 sebastian/global-state suggests installing ext-uopz (*)
02-Feb-2020 13:14:31 phpdocumentor/reflection-docblock suggests installing dflydev/markdown (~1.0)
02-Feb-2020 13:14:31 phpdocumentor/reflection-docblock suggests installing erusev/parsedown (~1.0)
02-Feb-2020 13:14:31 phpunit/phpunit suggests installing ext-soap (*)
02-Feb-2020 13:14:31 phpunit/phpunit suggests installing phpunit/php-invoker (^2.0)
02-Feb-2020 13:14:31 blackfire/php-sdk suggests installing ext-blackfire (The C version of the Blackfire probe)
02-Feb-2020 13:14:31 Package zendframework/zend-eventmanager is abandoned, you should avoid using it. Use laminas/laminas-eventmanager instead.
02-Feb-2020 13:14:31 Package zendframework/zend-code is abandoned, you should avoid using it. Use laminas/laminas-code instead.
02-Feb-2020 13:14:31 Package phpunit/dbunit is abandoned, you should avoid using it. No replacement was suggested.
02-Feb-2020 13:14:31 Package sami/sami is abandoned, you should avoid using it. No replacement was suggested.
02-Feb-2020 13:14:31 Generating autoload files
02-Feb-2020 13:14:31 ocramius/package-versions:  Generating version class...
02-Feb-2020 13:14:31 ocramius/package-versions: ...done generating version class
02-Feb-2020 13:14:31 Buildfile: /data/build/build.xml
02-Feb-2020 13:14:31
02-Feb-2020 13:14:31 phpBB > clean:
02-Feb-2020 13:14:31
02-Feb-2020 13:14:31    [delete] Directory /data/build/logs does not exist or is not a directory.
02-Feb-2020 13:14:31    [delete] Directory /data/build/api does not exist or is not a directory.
02-Feb-2020 13:14:31    [delete] Directory /data/build/codebrowser does not exist or is not a directory.
02-Feb-2020 13:14:31    [delete] Directory /data/build/coverage does not exist or is not a directory.
02-Feb-2020 13:14:31    [delete] Directory /data/build/cpd does not exist or is not a directory.
02-Feb-2020 13:14:31    [delete] Directory /data/build/dependencies does not exist or is not a directory.
02-Feb-2020 13:14:31    [delete] Directory /data/build/new_version does not exist or is not a directory.
02-Feb-2020 13:14:31    [delete] Directory /data/build/old_versions does not exist or is not a directory.
02-Feb-2020 13:14:31    [delete] Directory /data/build/save does not exist or is not a directory.
02-Feb-2020 13:14:31
02-Feb-2020 13:14:31 phpBB > prepare:
02-Feb-2020 13:14:31
02-Feb-2020 13:14:31     [mkdir] Created dir: /data/build/logs
02-Feb-2020 13:14:31     [mkdir] Created dir: /data/build/api
02-Feb-2020 13:14:31     [mkdir] Created dir: /data/build/codebrowser
02-Feb-2020 13:14:31     [mkdir] Created dir: /data/build/coverage
02-Feb-2020 13:14:31     [mkdir] Created dir: /data/build/cpd
02-Feb-2020 13:14:31     [mkdir] Created dir: /data/build/dependencies
02-Feb-2020 13:14:31     [mkdir] Created dir: /data/build/new_version
02-Feb-2020 13:14:31     [mkdir] Created dir: /data/build/new_version/files
02-Feb-2020 13:14:31     [mkdir] Created dir: /data/build/new_version/patches
02-Feb-2020 13:14:31     [mkdir] Created dir: /data/build/new_version/release_files
02-Feb-2020 13:14:31     [mkdir] Created dir: /data/build/new_version/update
02-Feb-2020 13:14:31     [mkdir] Created dir: /data/build/old_versions
02-Feb-2020 13:14:31     [mkdir] Created dir: /data/build/save
02-Feb-2020 13:14:31
02-Feb-2020 13:14:31 BUILD FINISHED
02-Feb-2020 13:14:31
02-Feb-2020 13:14:31 Total time: 0.0916 seconds
02-Feb-2020 13:14:31
02-Feb-2020 13:14:32 Finished task 'Prepare directory' with result: Success
02-Feb-2020 13:14:32 Skipping execution of task 'Run sniffs' as it is disabled
02-Feb-2020 13:14:32
Substituting variable: ${bamboo.working.directory} with /home/bamboo/xml-data/build-dir/PHPBB3-PR-JOB1
02-Feb-2020 13:14:32 Starting task 'Run sniffs' of type 'com.atlassian.bamboo.plugins.bamboo-docker-plugin:task.docker.cli'
02-Feb-2020 13:14:32 Running image name (phpbb:php-7.1)
02-Feb-2020 13:14:32
Beginning to execute external process for build 'phpBB3 - Pull Requests - Build and Test Job #9850 (PHPBB3-PR-JOB1-9850)'
... running command line:
/usr/bin/docker run --volume /home/bamboo/xml-data/build-dir/PHPBB3-PR-JOB1:/data --workdir /data/build --rm -u=991 phpbb:php-7.1 ../phpBB/vendor/bin/phing sniff
... in: /home/bamboo/xml-data/build-dir/PHPBB3-PR-JOB1
... using extra environment variables:
bamboo_planRepository_1_branch=3.1.x
bamboo_planRepository_1_branchDisplayName=3.1.x
bamboo_repository_revision_number=dc8ff9da28b8ab4ad11c7ea94cca526f17c87fe5
bamboo_PRref=master
bamboo_resultsUrl=https://bamboo.phpbb.com/browse/PHPBB3-PR-JOB1-9850
bamboo_capability_system_builder_command_Git=/usr/bin/git
bamboo_repository_75956235_git_username=bantu
bamboo_build_working_directory=/home/bamboo/xml-data/build-dir/PHPBB3-PR-JOB1
bamboo_planRepository_1_name=phpBB Ascraeus
bamboo_buildKey=PHPBB3-PR-JOB1
bamboo_capability_phpbb_tests=true
bamboo_shortPlanName=Pull Requests
bamboo_capability_system_builder_command_fop=/usr/bin/fop
bamboo_capability_dbms_sqlite_2=true
bamboo_planRepository_name=phpBB Ascraeus
bamboo_PRnumber=5841
bamboo_buildNumber=9850
bamboo_repository_75956235_git_repositoryUrl=https://github.com/phpbb/phpbb.git
bamboo_capability_system_builder_phpunit_PHPUnit=/usr/bin/phpunit
bamboo_shortJobName=Build and Test Job
bamboo_buildResultsUrl=https://bamboo.phpbb.com/browse/PHPBB3-PR-JOB1-9850
bamboo_repository_75956235_branch_name=3.1.x
bamboo_planRepository_repositoryUrl=https://github.com/phpbb/phpbb.git
bamboo_agentId=131073
bamboo_planName=phpBB3 - Pull Requests
bamboo_build_commandline_com_atlassian_bamboo_plugins_scripttask_task_builder_script_7=/bin/sh /home/bamboo/temp/PHPBB3-PR-JOB1-9850-ScriptBuildTask-4165158688919937942.sh
bamboo_shortPlanKey=PR
bamboo_shortJobKey=JOB1
bamboo_capability_dbms_mysql_55=true
bamboo_capability_system_jdk_JDK_1_7_0_65=/usr/lib/jvm/java-7-openjdk-amd64
bamboo_planRepository_revision=dc8ff9da28b8ab4ad11c7ea94cca526f17c87fe5
bamboo_buildTimeStamp=2020-02-02T13:13:15.468Z
bamboo_repository_previous_revision_number=dc8ff9da28b8ab4ad11c7ea94cca526f17c87fe5
bamboo_capability_system_jdk_JDK_1_6_0_16=/usr/lib/jvm/java-6-sun-1.6.0.16
bamboo_capability_system_builder_mvn2_Maven_2=/usr/share/maven2
bamboo_planRepository_previousRevision=dc8ff9da28b8ab4ad11c7ea94cca526f17c87fe5
bamboo_build_commandline_com_atlassian_bamboo_plugins_scripttask_task_builder_script_4=/bin/sh /home/bamboo/temp/PHPBB3-PR-JOB1-9850-ScriptBuildTask-9014023522430531368.sh
bamboo_repository_git_branch=3.1.x
bamboo_buildResultKey=PHPBB3-PR-JOB1-9850
bamboo_repository_branch_name=3.1.x
bamboo_buildPlanName=phpBB3 - Pull Requests - Build and Test Job
bamboo_planRepository_1_revision=dc8ff9da28b8ab4ad11c7ea94cca526f17c87fe5
bamboo_repository_name=phpBB Ascraeus
bamboo_buildFailed=false
bamboo_capability_system_docker_executable=/usr/bin/docker
bamboo_build_commandline_com_atlassian_bamboo_plugins_bamboo_docker_plugin_task_docker_cli_12=/usr/bin/docker run --volume /home/bamboo/xml-data/build-dir/PHPBB3-PR-JOB1:/data --workdir /data/phpBB --rm -e HOME=/home/bamboo -u=991 phpbb:php-7.1 /bin/bash -c php ../composer.phar install --dev; cd ../build; ../phpBB/vendor/bin/phing clean prepare
bamboo_build_commandline_com_atlassian_bamboo_plugins_bamboo_docker_plugin_task_docker_cli_13=/usr/bin/docker build --force-rm=true --tag=phpbb:php-7.1 /home/bamboo/xml-data/build-dir/PHPBB3-PR-JOB1
bamboo_planRepository_branch=3.1.x
bamboo_agentWorkingDirectory=/home/bamboo/xml-data/build-dir
bamboo_capability_system_git_executable=/usr/bin/git
bamboo_capability_system_builder_phpunit_PHPUnit_3_4=/usr/bin/phpunit
bamboo_repository_git_username=bantu
bamboo_planRepository_1_previousRevision=dc8ff9da28b8ab4ad11c7ea94cca526f17c87fe5
bamboo_repository_75956235_revision_number=dc8ff9da28b8ab4ad11c7ea94cca526f17c87fe5
bamboo_planRepository_branchDisplayName=3.1.x
bamboo_planRepository_1_type=gitv2
bamboo_planRepository_branchName=3.1.x
bamboo_repository_75956235_previous_revision_number=dc8ff9da28b8ab4ad11c7ea94cca526f17c87fe5
bamboo_capability_system_jdk_JDK=/usr/lib/jvm/java-6-sun
bamboo_plan_storageTag=PHPBB3-PR
bamboo_hg_cache_directory=/home/bamboo/xml-data/build-dir/_hg-repositories-cache
bamboo_planRepository_1_username=bantu
bamboo_planRepository_type=gitv2
bamboo_git_cache_directory=/home/bamboo/xml-data/build-dir/_git-repositories-cache
bamboo_ManualBuildTriggerReason_userName=Build Robot
bamboo_repository_git_repositoryUrl=https://github.com/phpbb/phpbb.git
bamboo_repository_75956235_git_branch=3.1.x
bamboo_capability_system_builder_ant_Ant=/usr/share/ant
bamboo_repository_75956235_name=phpBB Ascraeus
bamboo_tmp_directory=/home/bamboo/temp
bamboo_working_directory=/home/bamboo/xml-data/build-dir/PHPBB3-PR-JOB1
bamboo_planKey=PHPBB3-PR
bamboo_capability_local=true
bamboo_planRepository_1_repositoryUrl=https://github.com/phpbb/phpbb.git
bamboo_planRepository_username=bantu
bamboo_capability_system_jdk_JDK_1_6=/usr/lib/jvm/java-6-sun
bamboo_capability_system_jdk_JDK_1_7=/usr/lib/jvm/java-7-openjdk-amd64
bamboo_planRepository_1_branchName=3.1.x
02-Feb-2020 13:14:33 Buildfile: /data/build/build.xml
02-Feb-2020 13:14:33
02-Feb-2020 13:14:33 phpBB > sniff:
02-Feb-2020 13:14:33
02-Feb-2020 13:14:39 ............................................................  60 / 797 (8%)
02-Feb-2020 13:14:40 ............................................................ 120 / 797 (15%)
02-Feb-2020 13:14:40 ............................................................ 180 / 797 (23%)
02-Feb-2020 13:14:41 ............................................................ 240 / 797 (30%)
02-Feb-2020 13:14:42 ............................................................ 300 / 797 (38%)
02-Feb-2020 13:14:46 ............................................................ 360 / 797 (45%)
02-Feb-2020 13:14:50 ............................................................ 420 / 797 (53%)
02-Feb-2020 13:14:54 ............................................................ 480 / 797 (60%)
02-Feb-2020 13:14:58 ............................................................ 540 / 797 (68%)
02-Feb-2020 13:15:01 ............................................................ 600 / 797 (75%)
02-Feb-2020 13:15:05 ............................................................ 660 / 797 (83%)
02-Feb-2020 13:15:09 ............................................................ 720 / 797 (90%)
02-Feb-2020 13:15:11 ............................................................ 780 / 797 (98%)
02-Feb-2020 13:15:11 .................                                            797 / 797 (100%)
02-Feb-2020 13:15:11
02-Feb-2020 13:15:11
02-Feb-2020 13:15:11 Time: 37.97 secs; Memory: 50.01MB
02-Feb-2020 13:15:11
02-Feb-2020 13:15:11       [php] Calling PHP function: preg_replace()
02-Feb-2020 13:15:16 ............................................................  60 / 207 (29%)
02-Feb-2020 13:15:28 ............................................................ 120 / 207 (58%)
02-Feb-2020 13:15:37 ............................................................ 180 / 207 (87%)
02-Feb-2020 13:15:42 ...........................                                  207 / 207 (100%)
02-Feb-2020 13:15:42
02-Feb-2020 13:15:42
02-Feb-2020 13:15:42 Time: 30.81 secs; Memory: 38.01MB
02-Feb-2020 13:15:42
02-Feb-2020 13:15:42
02-Feb-2020 13:15:42
02-Feb-2020 13:15:42 Time: 31ms; Memory: 4MB
02-Feb-2020 13:15:42
02-Feb-2020 13:15:42
02-Feb-2020 13:15:42 BUILD FINISHED
02-Feb-2020 13:15:42
02-Feb-2020 13:15:42 Total time: 1 minute  9.02 seconds
02-Feb-2020 13:15:42
02-Feb-2020 13:15:42 Finished task 'Run sniffs' with result: Success
02-Feb-2020 13:15:42 Skipping execution of task 'Run tests' as it is disabled
02-Feb-2020 13:15:42
Substituting variable: ${bamboo.working.directory} with /home/bamboo/xml-data/build-dir/PHPBB3-PR-JOB1
02-Feb-2020 13:15:42 Starting task 'Run tests' of type 'com.atlassian.bamboo.plugins.bamboo-docker-plugin:task.docker.cli'
02-Feb-2020 13:15:42 Running image name (phpbb:php-7.1)
02-Feb-2020 13:15:42
Beginning to execute external process for build 'phpBB3 - Pull Requests - Build and Test Job #9850 (PHPBB3-PR-JOB1-9850)'
... running command line:
/usr/bin/docker run --volume /home/bamboo/xml-data/build-dir/PHPBB3-PR-JOB1:/data --workdir /data --rm -u=991 -t phpbb:php-7.1 /bin/bash -c phpBB/vendor/bin/phpunit --log-junit build/logs/phpunit.xml
... in: /home/bamboo/xml-data/build-dir/PHPBB3-PR-JOB1
... using extra environment variables:
bamboo_planRepository_1_branch=3.1.x
bamboo_planRepository_1_branchDisplayName=3.1.x
bamboo_repository_revision_number=dc8ff9da28b8ab4ad11c7ea94cca526f17c87fe5
bamboo_PRref=master
bamboo_resultsUrl=https://bamboo.phpbb.com/browse/PHPBB3-PR-JOB1-9850
bamboo_capability_system_builder_command_Git=/usr/bin/git
bamboo_repository_75956235_git_username=bantu
bamboo_build_working_directory=/home/bamboo/xml-data/build-dir/PHPBB3-PR-JOB1
bamboo_planRepository_1_name=phpBB Ascraeus
bamboo_buildKey=PHPBB3-PR-JOB1
bamboo_capability_phpbb_tests=true
bamboo_shortPlanName=Pull Requests
bamboo_capability_system_builder_command_fop=/usr/bin/fop
bamboo_capability_dbms_sqlite_2=true
bamboo_planRepository_name=phpBB Ascraeus
bamboo_PRnumber=5841
bamboo_buildNumber=9850
bamboo_repository_75956235_git_repositoryUrl=https://github.com/phpbb/phpbb.git
bamboo_capability_system_builder_phpunit_PHPUnit=/usr/bin/phpunit
bamboo_shortJobName=Build and Test Job
bamboo_buildResultsUrl=https://bamboo.phpbb.com/browse/PHPBB3-PR-JOB1-9850
bamboo_repository_75956235_branch_name=3.1.x
bamboo_planRepository_repositoryUrl=https://github.com/phpbb/phpbb.git
bamboo_agentId=131073
bamboo_planName=phpBB3 - Pull Requests
bamboo_build_commandline_com_atlassian_bamboo_plugins_scripttask_task_builder_script_7=/bin/sh /home/bamboo/temp/PHPBB3-PR-JOB1-9850-ScriptBuildTask-4165158688919937942.sh
bamboo_shortPlanKey=PR
bamboo_shortJobKey=JOB1
bamboo_capability_dbms_mysql_55=true
bamboo_capability_system_jdk_JDK_1_7_0_65=/usr/lib/jvm/java-7-openjdk-amd64
bamboo_planRepository_revision=dc8ff9da28b8ab4ad11c7ea94cca526f17c87fe5
bamboo_buildTimeStamp=2020-02-02T13:13:15.468Z
bamboo_repository_previous_revision_number=dc8ff9da28b8ab4ad11c7ea94cca526f17c87fe5
bamboo_capability_system_jdk_JDK_1_6_0_16=/usr/lib/jvm/java-6-sun-1.6.0.16
bamboo_capability_system_builder_mvn2_Maven_2=/usr/share/maven2
bamboo_planRepository_previousRevision=dc8ff9da28b8ab4ad11c7ea94cca526f17c87fe5
bamboo_build_commandline_com_atlassian_bamboo_plugins_scripttask_task_builder_script_4=/bin/sh /home/bamboo/temp/PHPBB3-PR-JOB1-9850-ScriptBuildTask-9014023522430531368.sh
bamboo_repository_git_branch=3.1.x
bamboo_buildResultKey=PHPBB3-PR-JOB1-9850
bamboo_repository_branch_name=3.1.x
bamboo_buildPlanName=phpBB3 - Pull Requests - Build and Test Job
bamboo_planRepository_1_revision=dc8ff9da28b8ab4ad11c7ea94cca526f17c87fe5
bamboo_repository_name=phpBB Ascraeus
bamboo_buildFailed=false
bamboo_capability_system_docker_executable=/usr/bin/docker
bamboo_build_commandline_com_atlassian_bamboo_plugins_bamboo_docker_plugin_task_docker_cli_11=/usr/bin/docker run --volume /home/bamboo/xml-data/build-dir/PHPBB3-PR-JOB1:/data --workdir /data/build --rm -u=991 phpbb:php-7.1 ../phpBB/vendor/bin/phing sniff
bamboo_build_commandline_com_atlassian_bamboo_plugins_bamboo_docker_plugin_task_docker_cli_12=/usr/bin/docker run --volume /home/bamboo/xml-data/build-dir/PHPBB3-PR-JOB1:/data --workdir /data/phpBB --rm -e HOME=/home/bamboo -u=991 phpbb:php-7.1 /bin/bash -c php ../composer.phar install --dev; cd ../build; ../phpBB/vendor/bin/phing clean prepare
bamboo_build_commandline_com_atlassian_bamboo_plugins_bamboo_docker_plugin_task_docker_cli_13=/usr/bin/docker build --force-rm=true --tag=phpbb:php-7.1 /home/bamboo/xml-data/build-dir/PHPBB3-PR-JOB1
bamboo_planRepository_branch=3.1.x
bamboo_agentWorkingDirectory=/home/bamboo/xml-data/build-dir
bamboo_capability_system_git_executable=/usr/bin/git
bamboo_capability_system_builder_phpunit_PHPUnit_3_4=/usr/bin/phpunit
bamboo_repository_git_username=bantu
bamboo_planRepository_1_previousRevision=dc8ff9da28b8ab4ad11c7ea94cca526f17c87fe5
bamboo_repository_75956235_revision_number=dc8ff9da28b8ab4ad11c7ea94cca526f17c87fe5
bamboo_planRepository_branchDisplayName=3.1.x
bamboo_planRepository_1_type=gitv2
bamboo_planRepository_branchName=3.1.x
bamboo_repository_75956235_previous_revision_number=dc8ff9da28b8ab4ad11c7ea94cca526f17c87fe5
bamboo_capability_system_jdk_JDK=/usr/lib/jvm/java-6-sun
bamboo_plan_storageTag=PHPBB3-PR
bamboo_hg_cache_directory=/home/bamboo/xml-data/build-dir/_hg-repositories-cache
bamboo_planRepository_1_username=bantu
bamboo_planRepository_type=gitv2
bamboo_git_cache_directory=/home/bamboo/xml-data/build-dir/_git-repositories-cache
bamboo_ManualBuildTriggerReason_userName=Build Robot
bamboo_repository_git_repositoryUrl=https://github.com/phpbb/phpbb.git
bamboo_repository_75956235_git_branch=3.1.x
bamboo_capability_system_builder_ant_Ant=/usr/share/ant
bamboo_repository_75956235_name=phpBB Ascraeus
bamboo_tmp_directory=/home/bamboo/temp
bamboo_working_directory=/home/bamboo/xml-data/build-dir/PHPBB3-PR-JOB1
bamboo_planKey=PHPBB3-PR
bamboo_capability_local=true
bamboo_planRepository_1_repositoryUrl=https://github.com/phpbb/phpbb.git
bamboo_planRepository_username=bantu
bamboo_capability_system_jdk_JDK_1_6=/usr/lib/jvm/java-6-sun
bamboo_capability_system_jdk_JDK_1_7=/usr/lib/jvm/java-7-openjdk-amd64
bamboo_planRepository_1_branchName=3.1.x
02-Feb-2020 13:15:44 PHPUnit 7.5.18 by Sebastian Bergmann and contributors.
02-Feb-2020 13:15:44
02-Feb-2020 13:15:49 .............................................................   61 / 7287 (  0%)
02-Feb-2020 13:15:50 .............................................................  122 / 7287 (  1%)
02-Feb-2020 13:15:51 .............I.....SSSS...........FSSSSSSSS.........S...S....  183 / 7287 (  2%)
02-Feb-2020 13:15:52 .............................................................  244 / 7287 (  3%)
02-Feb-2020 13:15:57 .....S.......................................................  305 / 7287 (  4%)
02-Feb-2020 13:15:58 .............................................................  366 / 7287 (  5%)
02-Feb-2020 13:15:58 .............................................................  427 / 7287 (  5%)
02-Feb-2020 13:15:58 .............................................................  488 / 7287 (  6%)
02-Feb-2020 13:15:59 .............................................................  549 / 7287 (  7%)
02-Feb-2020 13:15:59 .............................................................  610 / 7287 (  8%)
02-Feb-2020 13:15:59 .............................................................  671 / 7287 (  9%)
02-Feb-2020 13:15:59 .............................................................  732 / 7287 ( 10%)
02-Feb-2020 13:16:00 .............................................................  793 / 7287 ( 10%)
02-Feb-2020 13:16:00 .............................................................  854 / 7287 ( 11%)
02-Feb-2020 13:16:00 .............................................................  915 / 7287 ( 12%)
02-Feb-2020 13:16:01 .............................................................  976 / 7287 ( 13%)
02-Feb-2020 13:16:01 ............................................................. 1037 / 7287 ( 14%)
02-Feb-2020 13:16:04 ....................................................I........ 1098 / 7287 ( 15%)
02-Feb-2020 13:16:07 ............................................................. 1159 / 7287 ( 15%)
02-Feb-2020 13:16:10 ..........................................FF................. 1220 / 7287 ( 16%)
02-Feb-2020 13:16:13 ...........................................S.S.S............. 1281 / 7287 ( 17%)
02-Feb-2020 13:16:13 ............................................................. 1342 / 7287 ( 18%)
02-Feb-2020 13:16:13 ............................................................. 1403 / 7287 ( 19%)
02-Feb-2020 13:16:13 ............................................................. 1464 / 7287 ( 20%)
02-Feb-2020 13:16:13 ............................................................. 1525 / 7287 ( 20%)
02-Feb-2020 13:16:13 ............................................................. 1586 / 7287 ( 21%)
02-Feb-2020 13:16:13 ............................................................. 1647 / 7287 ( 22%)
02-Feb-2020 13:16:14 ............................................................. 1708 / 7287 ( 23%)
02-Feb-2020 13:16:14 ............................................................. 1769 / 7287 ( 24%)
02-Feb-2020 13:16:14 ............................................................. 1830 / 7287 ( 25%)
02-Feb-2020 13:16:14 ............................................................. 1891 / 7287 ( 25%)
02-Feb-2020 13:16:14 ............................................................. 1952 / 7287 ( 26%)
02-Feb-2020 13:16:14 ............................................................. 2013 / 7287 ( 27%)
02-Feb-2020 13:16:14 ............................................................. 2074 / 7287 ( 28%)
02-Feb-2020 13:16:14 ............................................................. 2135 / 7287 ( 29%)
02-Feb-2020 13:16:15 ............................................................. 2196 / 7287 ( 30%)
02-Feb-2020 13:16:16 ............................................................. 2257 / 7287 ( 30%)
02-Feb-2020 13:16:16 ............................................................. 2318 / 7287 ( 31%)
02-Feb-2020 13:16:16 ............................................................. 2379 / 7287 ( 32%)
02-Feb-2020 13:16:19 .......................I.II.................................. 2440 / 7287 ( 33%)
02-Feb-2020 13:16:19 ............................................................. 2501 / 7287 ( 34%)
02-Feb-2020 13:16:19 ............................................................. 2562 / 7287 ( 35%)
02-Feb-2020 13:16:20 ............................................................. 2623 / 7287 ( 35%)
02-Feb-2020 13:16:20 ............................................................. 2684 / 7287 ( 36%)
02-Feb-2020 13:16:22 ............................................................. 2745 / 7287 ( 37%)
02-Feb-2020 13:16:23 ............................................................. 2806 / 7287 ( 38%)
02-Feb-2020 13:16:23 ............................................................. 2867 / 7287 ( 39%)
02-Feb-2020 13:16:23 ............................................................. 2928 / 7287 ( 40%)
02-Feb-2020 13:16:30 ............................................................. 2989 / 7287 ( 41%)
02-Feb-2020 13:16:34 ..........................................F..........F....... 3050 / 7287 ( 41%)
02-Feb-2020 13:16:37 ...............................S..FFFFFF..................... 3111 / 7287 ( 42%)
02-Feb-2020 13:16:38 ............................................................. 3172 / 7287 ( 43%)
02-Feb-2020 13:16:44 ............................................................. 3233 / 7287 ( 44%)
02-Feb-2020 13:16:53 ............................................................. 3294 / 7287 ( 45%)
02-Feb-2020 13:16:59 ............................................................. 3355 / 7287 ( 46%)
02-Feb-2020 13:17:00 ............................................................. 3416 / 7287 ( 46%)
02-Feb-2020 13:17:00 ............................................................. 3477 / 7287 ( 47%)
02-Feb-2020 13:17:00 ............................................................. 3538 / 7287 ( 48%)
02-Feb-2020 13:17:00 ............................................................. 3599 / 7287 ( 49%)
02-Feb-2020 13:17:00 ............................................................. 3660 / 7287 ( 50%)
02-Feb-2020 13:17:00 ............................................................. 3721 / 7287 ( 51%)
02-Feb-2020 13:17:01 ............................................................. 3782 / 7287 ( 51%)
02-Feb-2020 13:17:01 ............................................................. 3843 / 7287 ( 52%)
02-Feb-2020 13:17:03 ............................................................. 3904 / 7287 ( 53%)
02-Feb-2020 13:17:03 ............................................................. 3965 / 7287 ( 54%)
02-Feb-2020 13:17:05 ............................................................. 4026 / 7287 ( 55%)
02-Feb-2020 13:17:05 ............................................................. 4087 / 7287 ( 56%)
02-Feb-2020 13:17:06 ............................................................. 4148 / 7287 ( 56%)
02-Feb-2020 13:17:08 ............................................................. 4209 / 7287 ( 57%)
02-Feb-2020 13:17:12 ............................................................. 4270 / 7287 ( 58%)
02-Feb-2020 13:17:17 ............................................................. 4331 / 7287 ( 59%)
02-Feb-2020 13:17:17 ............................................................. 4392 / 7287 ( 60%)
02-Feb-2020 13:17:18 ............................................................. 4453 / 7287 ( 61%)
02-Feb-2020 13:17:18 ............................................................. 4514 / 7287 ( 61%)
02-Feb-2020 13:17:18 ............................................................. 4575 / 7287 ( 62%)
02-Feb-2020 13:17:18 ............................................................. 4636 / 7287 ( 63%)
02-Feb-2020 13:17:18 ............................................................. 4697 / 7287 ( 64%)
02-Feb-2020 13:17:18 ............................................................. 4758 / 7287 ( 65%)
02-Feb-2020 13:17:18 ............................................................. 4819 / 7287 ( 66%)
02-Feb-2020 13:17:18 ............................................................. 4880 / 7287 ( 66%)
02-Feb-2020 13:17:19 ............................................................. 4941 / 7287 ( 67%)
02-Feb-2020 13:17:28 ............................................................. 5002 / 7287 ( 68%)
02-Feb-2020 13:17:34 .S........................................................... 5063 / 7287 ( 69%)
02-Feb-2020 13:17:40 ............................................................. 5124 / 7287 ( 70%)
02-Feb-2020 13:17:43 ............................................................. 5185 / 7287 ( 71%)
02-Feb-2020 13:17:43 ............................................................. 5246 / 7287 ( 71%)
02-Feb-2020 13:17:43 ............................................................. 5307 / 7287 ( 72%)
02-Feb-2020 13:17:43 ............................................................. 5368 / 7287 ( 73%)
02-Feb-2020 13:17:44 ..................SSSSSSSSSSSSSSSSSSSSSSSSSSSSSSSSSSSSSSSSSSS 5429 / 7287 ( 74%)
02-Feb-2020 13:17:44 SSSSSSSSSSSSSSSSSSSSSSSSSSSSSSSSSSSSSSSSSSSSSSSSSSSSSSSSSSSSS 5490 / 7287 ( 75%)
02-Feb-2020 13:17:44 SSSSSSSSSSSSSSSSSSSSSSSSSSSSSSSSSSSSSSSSSSSSSSSSSSSSSSSSSSSSS 5551 / 7287 ( 76%)
02-Feb-2020 13:17:44 SSSSSSSSSSSSSSSSSSSSSSSSSSSSSSSSSSSSSSSSSSSSSSSSSSSSSSSS..... 5612 / 7287 ( 77%)
02-Feb-2020 13:17:46 ............................................................. 5673 / 7287 ( 77%)
02-Feb-2020 13:17:49 ............................................................. 5734 / 7287 ( 78%)
02-Feb-2020 13:17:51 ............................................................. 5795 / 7287 ( 79%)
02-Feb-2020 13:17:53 ............................................................. 5856 / 7287 ( 80%)
02-Feb-2020 13:17:56 ............................................................. 5917 / 7287 ( 81%)
02-Feb-2020 13:17:58 ............................................................. 5978 / 7287 ( 82%)
02-Feb-2020 13:18:00 ............................................................. 6039 / 7287 ( 82%)
02-Feb-2020 13:18:02 ............................................................. 6100 / 7287 ( 83%)
02-Feb-2020 13:18:04 ............................................................. 6161 / 7287 ( 84%)
02-Feb-2020 13:18:07 ............................................................. 6222 / 7287 ( 85%)
02-Feb-2020 13:18:09 ............................................................. 6283 / 7287 ( 86%)
02-Feb-2020 13:18:11 ............................................................. 6344 / 7287 ( 87%)
02-Feb-2020 13:18:13 ............................................................. 6405 / 7287 ( 87%)
02-Feb-2020 13:18:16 ............................................................. 6466 / 7287 ( 88%)
02-Feb-2020 13:18:18 ............................................................. 6527 / 7287 ( 89%)
02-Feb-2020 13:18:20 ............................................................. 6588 / 7287 ( 90%)
02-Feb-2020 13:18:23 ............................................................. 6649 / 7287 ( 91%)
02-Feb-2020 13:18:25 ............................................................. 6710 / 7287 ( 92%)
02-Feb-2020 13:18:27 ............................................................. 6771 / 7287 ( 92%)
02-Feb-2020 13:18:29 ............................................................. 6832 / 7287 ( 93%)
02-Feb-2020 13:18:32 ............................................................. 6893 / 7287 ( 94%)
02-Feb-2020 13:18:34 ............................................................. 6954 / 7287 ( 95%)
02-Feb-2020 13:18:36 ............................................................. 7015 / 7287 ( 96%)
02-Feb-2020 13:18:38 ............................................................. 7076 / 7287 ( 97%)
02-Feb-2020 13:18:41 ............................................................. 7137 / 7287 ( 97%)
02-Feb-2020 13:18:43 ............................................................. 7198 / 7287 ( 98%)
02-Feb-2020 13:18:44 ..................................SS
02-Feb-2020 13:18:44
02-Feb-2020 13:18:44 Time: 3.02 minutes, Memory: 288.00 MB
02-Feb-2020 13:18:44
02-Feb-2020 13:18:44 There were 11 failures:
02-Feb-2020 13:18:44
02-Feb-2020 13:18:44 1) phpbb_cache_file_driver_test::test_cache_sql
02-Feb-2020 13:18:44 false does not match expected type "array".
02-Feb-2020 13:18:44
02-Feb-2020 13:18:44 /data/tests/cache/common_test_case.php:94
02-Feb-2020 13:18:44
02-Feb-2020 13:18:44 2) phpbb_dbal_select_test::test_query_limit with data set #0 (0, 0, array(array('barfoo'), array('foobar'), array('bertie')))
02-Feb-2020 13:18:44 Failed asserting that two arrays are equal.
02-Feb-2020 13:18:44 --- Expected
02-Feb-2020 13:18:44 +++ Actual
02-Feb-2020 13:18:44 @@ @@
02-Feb-2020 13:18:44 Array (
02-Feb-2020 13:18:44 -    0 => Array (...)
02-Feb-2020 13:18:44 -    1 => Array (...)
02-Feb-2020 13:18:44 -    2 => Array (...)
02-Feb-2020 13:18:44 )
02-Feb-2020 13:18:44
02-Feb-2020 13:18:44 /data/tests/dbal/select_test.php:193
02-Feb-2020 13:18:44
02-Feb-2020 13:18:44 3) phpbb_dbal_select_test::test_query_limit with data set #1 (0, 1, array(array('foobar'), array('bertie')))
02-Feb-2020 13:18:44 Failed asserting that two arrays are equal.
02-Feb-2020 13:18:44 --- Expected
02-Feb-2020 13:18:44 +++ Actual
02-Feb-2020 13:18:44 @@ @@
02-Feb-2020 13:18:44 Array (
02-Feb-2020 13:18:44 -    0 => Array (...)
02-Feb-2020 13:18:44 -    1 => Array (...)
02-Feb-2020 13:18:44 )
02-Feb-2020 13:18:44
02-Feb-2020 13:18:44 /data/tests/dbal/select_test.php:193
02-Feb-2020 13:18:44
02-Feb-2020 13:18:44 4) phpbb_groupposition_teampage_test::test_move with data set #5 (2, -1, true, array(array(1, 1, 0, ''), array(2, 0, 0, 'category - 2 children'), array(3, 3, 2, ''), array(4, 2, 2, ''), array(5, 0, 0, 'category2 - 2 children'), array(6, 4, 5, ''), array(7, 5, 5, ''), array(8, 6, 0, '')))
02-Feb-2020 13:18:44 Failed asserting that false matches expected true.
02-Feb-2020 13:18:44
02-Feb-2020 13:18:44 /data/tests/groupposition/teampage_test.php:484
02-Feb-2020 13:18:44
02-Feb-2020 13:18:44 5) phpbb_groupposition_teampage_test::test_move_teampage with data set #7 (6, -1, true, array(array(1, 1, 0, ''), array(2, 0, 0, 'category - 2 children'), array(3, 2, 2, ''), array(4, 3, 2, ''), array(5, 0, 0, 'category2 - 2 children'), array(6, 5, 5, ''), array(7, 4, 5, ''), array(8, 6, 0, '')))
02-Feb-2020 13:18:44 Failed asserting that false matches expected true.
02-Feb-2020 13:18:44
02-Feb-2020 13:18:44 /data/tests/groupposition/teampage_test.php:649
02-Feb-2020 13:18:44
02-Feb-2020 13:18:44 6) phpbb_log_delete_test::test_log_delete with data set #0 (array(1, 2), array(16), array(), 'admin', false, 0, 0, 0, 0, 0, 0, 'l.log_id ASC', '')
02-Feb-2020 13:18:44 before
02-Feb-2020 13:18:44 Failed asserting that two arrays are identical.
02-Feb-2020 13:18:44 --- Expected
02-Feb-2020 13:18:44 +++ Actual
02-Feb-2020 13:18:44 @@ @@
02-Feb-2020 13:18:44 -Array &0 (
02-Feb-2020 13:18:44 -    0 => 1
02-Feb-2020 13:18:44 -    1 => 2
02-Feb-2020 13:18:44 -)
02-Feb-2020 13:18:44 +Array &0 ()
02-Feb-2020 13:18:44
02-Feb-2020 13:18:44 /data/tests/log/delete_test.php:141
02-Feb-2020 13:18:44
02-Feb-2020 13:18:44 7) phpbb_log_delete_test::test_log_delete with data set #1 (array(11), array(), array('guest'), 'mod', false, 0, 0, 0, 0, 0, 0, 'l.log_id ASC', 'guest')
02-Feb-2020 13:18:44 before
02-Feb-2020 13:18:44 Failed asserting that two arrays are identical.
02-Feb-2020 13:18:44 --- Expected
02-Feb-2020 13:18:44 +++ Actual
02-Feb-2020 13:18:44 @@ @@
02-Feb-2020 13:18:44 -Array &0 (
02-Feb-2020 13:18:44 -    0 => 11
02-Feb-2020 13:18:44 -)
02-Feb-2020 13:18:44 +Array &0 ()
02-Feb-2020 13:18:44
02-Feb-2020 13:18:44 /data/tests/log/delete_test.php:141
02-Feb-2020 13:18:44
02-Feb-2020 13:18:44 8) phpbb_log_delete_test::test_log_delete with data set #2 (array(4, 5, 7), array(), array(12, 1), 'mod', false, 0, 0, 12, 0, 1, 0, 'l.log_id ASC', '')
02-Feb-2020 13:18:44 before
02-Feb-2020 13:18:44 Failed asserting that two arrays are identical.
02-Feb-2020 13:18:44 --- Expected
02-Feb-2020 13:18:44 +++ Actual
02-Feb-2020 13:18:44 @@ @@
02-Feb-2020 13:18:44 -Array &0 (
02-Feb-2020 13:18:44 -    0 => 4
02-Feb-2020 13:18:44 -    1 => 5
02-Feb-2020 13:18:44 -    2 => 7
02-Feb-2020 13:18:44 -)
02-Feb-2020 13:18:44 +Array &0 ()
02-Feb-2020 13:18:44
02-Feb-2020 13:18:44 /data/tests/log/delete_test.php:141
02-Feb-2020 13:18:44
02-Feb-2020 13:18:44 9) phpbb_log_delete_test::test_log_delete with data set #3 (array(12, 13), array(), array(array(array(14, 13))), 'mod', false, 0, 0, array(13, 14), 0, 0, 0, 'l.log_id ASC', '')
02-Feb-2020 13:18:44 before
02-Feb-2020 13:18:44 Failed asserting that two arrays are identical.
02-Feb-2020 13:18:44 --- Expected
02-Feb-2020 13:18:44 +++ Actual
02-Feb-2020 13:18:44 @@ @@
02-Feb-2020 13:18:44 -Array &0 (
02-Feb-2020 13:18:44 -    0 => 12
02-Feb-2020 13:18:44 -    1 => 13
02-Feb-2020 13:18:44 -)
02-Feb-2020 13:18:44 +Array &0 ()
02-Feb-2020 13:18:44
02-Feb-2020 13:18:44 /data/tests/log/delete_test.php:141
02-Feb-2020 13:18:44
02-Feb-2020 13:18:44 10) phpbb_log_delete_test::test_log_delete with data set #4 (array(3, 14, 15), array(3), array(array('>', 1)), 'critical', false, 0, 0, 0, 0, 0, 0, 'l.log_id ASC', '')
02-Feb-2020 13:18:44 before
02-Feb-2020 13:18:44 Failed asserting that two arrays are identical.
02-Feb-2020 13:18:44 --- Expected
02-Feb-2020 13:18:44 +++ Actual
02-Feb-2020 13:18:44 @@ @@
02-Feb-2020 13:18:44 -Array &0 (
02-Feb-2020 13:18:44 -    0 => 3
02-Feb-2020 13:18:44 -    1 => 14
02-Feb-2020 13:18:44 -    2 => 15
02-Feb-2020 13:18:44 -)
02-Feb-2020 13:18:44 +Array &0 ()
02-Feb-2020 13:18:44
02-Feb-2020 13:18:44 /data/tests/log/delete_test.php:141
02-Feb-2020 13:18:44
02-Feb-2020 13:18:44 11) phpbb_log_delete_test::test_log_delete with data set #5 (array(3, 14, 15), array(), array(''), 'critical', false, 0, 0, 0, 0, 0, 0, 'l.log_id ASC', '')
02-Feb-2020 13:18:44 before
02-Feb-2020 13:18:44 Failed asserting that two arrays are identical.
02-Feb-2020 13:18:44 --- Expected
02-Feb-2020 13:18:44 +++ Actual
02-Feb-2020 13:18:44 @@ @@
02-Feb-2020 13:18:44 -Array &0 (
02-Feb-2020 13:18:44 -    0 => 3
02-Feb-2020 13:18:44 -    1 => 14
02-Feb-2020 13:18:44 -    2 => 15
02-Feb-2020 13:18:44 -)
02-Feb-2020 13:18:44 +Array &0 ()
02-Feb-2020 13:18:44
02-Feb-2020 13:18:44 /data/tests/log/delete_test.php:141
02-Feb-2020 13:18:44
02-Feb-2020 13:18:44 FAILURES!
02-Feb-2020 13:18:44 Tests: 7287, Assertions: 122964, Failures: 11, Skipped: 243, Incomplete: 5.
02-Feb-2020 13:18:45 Error occurred while running Task 'Run tests(10)' of type com.atlassian.bamboo.plugins.bamboo-docker-plugin:task.docker.cli.
02-Feb-2020 13:18:45 com.atlassian.bamboo.task.TaskException: Failed to execute task
02-Feb-2020 13:18:45         at com.atlassian.bamboo.plugins.docker.service.RunService.execute(RunService.java:75)
02-Feb-2020 13:18:45         at com.atlassian.bamboo.plugins.docker.tasks.cli.DockerCliTask.execute(DockerCliTask.java:70)
02-Feb-2020 13:18:45         at com.atlassian.bamboo.task.TaskExecutorImpl.lambda$executeTasks$3(TaskExecutorImpl.java:285)
02-Feb-2020 13:18:45         at com.atlassian.bamboo.task.TaskExecutorImpl.executeTaskWithPrePostActions(TaskExecutorImpl.java:224)
02-Feb-2020 13:18:45         at com.atlassian.bamboo.task.TaskExecutorImpl.executeTasks(TaskExecutorImpl.java:285)
02-Feb-2020 13:18:45         at com.atlassian.bamboo.task.TaskExecutorImpl.execute(TaskExecutorImpl.java:112)
02-Feb-2020 13:18:45         at com.atlassian.bamboo.build.pipeline.tasks.ExecuteBuildTask.call(ExecuteBuildTask.java:71)
02-Feb-2020 13:18:45         at com.atlassian.bamboo.v2.build.agent.DefaultBuildAgent.executeBuildPhase(DefaultBuildAgent.java:203)
02-Feb-2020 13:18:45         at com.atlassian.bamboo.v2.build.agent.DefaultBuildAgent.build(DefaultBuildAgent.java:175)
02-Feb-2020 13:18:45         at com.atlassian.bamboo.v2.build.agent.BuildAgentControllerImpl.lambda$waitAndPerformBuild$0(BuildAgentControllerImpl.java:122)
02-Feb-2020 13:18:45         at com.atlassian.bamboo.variable.CustomVariableContextImpl.withVariableSubstitutor(CustomVariableContextImpl.java:185)
02-Feb-2020 13:18:45         at com.atlassian.bamboo.v2.build.agent.BuildAgentControllerImpl.waitAndPerformBuild(BuildAgentControllerImpl.java:117)
02-Feb-2020 13:18:45         at com.atlassian.bamboo.v2.build.agent.DefaultBuildAgent$1.run(DefaultBuildAgent.java:126)
02-Feb-2020 13:18:45         at com.atlassian.bamboo.utils.BambooRunnables$1.run(BambooRunnables.java:48)
02-Feb-2020 13:18:45         at com.atlassian.bamboo.security.ImpersonationHelper.runWith(ImpersonationHelper.java:26)
02-Feb-2020 13:18:45         at com.atlassian.bamboo.security.ImpersonationHelper.runWithSystemAuthority(ImpersonationHelper.java:17)
02-Feb-2020 13:18:45         at com.atlassian.bamboo.security.ImpersonationHelper$1.run(ImpersonationHelper.java:41)
02-Feb-2020 13:18:45         at java.lang.Thread.run(Thread.java:748)
02-Feb-2020 13:18:45 Caused by: com.atlassian.bamboo.docker.DockerException: Error running Docker run command
02-Feb-2020 13:18:45         at com.atlassian.bamboo.docker.DockerContainerServiceImpl.run(DockerContainerServiceImpl.java:118)
02-Feb-2020 13:18:45         at sun.reflect.GeneratedMethodAccessor1922.invoke(Unknown Source)
02-Feb-2020 13:18:45         at sun.reflect.DelegatingMethodAccessorImpl.invoke(DelegatingMethodAccessorImpl.java:43)
02-Feb-2020 13:18:45         at java.lang.reflect.Method.invoke(Method.java:498)
02-Feb-2020 13:18:45         at com.atlassian.plugin.util.ContextClassLoaderSettingInvocationHandler.invoke(ContextClassLoaderSettingInvocationHandler.java:26)
02-Feb-2020 13:18:45         at com.sun.proxy.$Proxy401.run(Unknown Source)
02-Feb-2020 13:18:45         at sun.reflect.GeneratedMethodAccessor1922.invoke(Unknown Source)
02-Feb-2020 13:18:45         at sun.reflect.DelegatingMethodAccessorImpl.invoke(DelegatingMethodAccessorImpl.java:43)
02-Feb-2020 13:18:45         at java.lang.reflect.Method.invoke(Method.java:498)
02-Feb-2020 13:18:45         at org.springframework.aop.support.AopUtils.invokeJoinpointUsingReflection(AopUtils.java:302)
02-Feb-2020 13:18:45         at org.eclipse.gemini.blueprint.service.importer.support.internal.aop.ServiceInvoker.doInvoke(ServiceInvoker.java:56)
02-Feb-2020 13:18:45         at org.eclipse.gemini.blueprint.service.importer.support.internal.aop.ServiceInvoker.invoke(ServiceInvoker.java:60)
02-Feb-2020 13:18:45         at org.springframework.aop.framework.ReflectiveMethodInvocation.proceed(ReflectiveMethodInvocation.java:179)
02-Feb-2020 13:18:45         at org.springframework.aop.support.DelegatingIntroductionInterceptor.doProceed(DelegatingIntroductionInterceptor.java:133)
02-Feb-2020 13:18:45         at org.springframework.aop.support.DelegatingIntroductionInterceptor.invoke(DelegatingIntroductionInterceptor.java:121)
02-Feb-2020 13:18:45         at org.springframework.aop.framework.ReflectiveMethodInvocation.proceed(ReflectiveMethodInvocation.java:179)
02-Feb-2020 13:18:45         at org.eclipse.gemini.blueprint.service.util.internal.aop.ServiceTCCLInterceptor.invokeUnprivileged(ServiceTCCLInterceptor.java:70)
02-Feb-2020 13:18:45         at org.eclipse.gemini.blueprint.service.util.internal.aop.ServiceTCCLInterceptor.invoke(ServiceTCCLInterceptor.java:53)
02-Feb-2020 13:18:45         at org.springframework.aop.framework.ReflectiveMethodInvocation.proceed(ReflectiveMethodInvocation.java:179)
02-Feb-2020 13:18:45         at org.eclipse.gemini.blueprint.service.importer.support.LocalBundleContextAdvice.invoke(LocalBundleContextAdvice.java:57)
02-Feb-2020 13:18:45         at org.springframework.aop.framework.ReflectiveMethodInvocation.proceed(ReflectiveMethodInvocation.java:179)
02-Feb-2020 13:18:45         at org.springframework.aop.support.DelegatingIntroductionInterceptor.doProceed(DelegatingIntroductionInterceptor.java:133)
02-Feb-2020 13:18:45         at org.springframework.aop.support.DelegatingIntroductionInterceptor.invoke(DelegatingIntroductionInterceptor.java:121)
02-Feb-2020 13:18:45         at org.springframework.aop.framework.ReflectiveMethodInvocation.proceed(ReflectiveMethodInvocation.java:179)
02-Feb-2020 13:18:45         at org.springframework.aop.framework.JdkDynamicAopProxy.invoke(JdkDynamicAopProxy.java:207)
02-Feb-2020 13:18:45         at com.sun.proxy.$Proxy646.run(Unknown Source)
02-Feb-2020 13:18:45         at com.atlassian.bamboo.plugins.docker.client.DockerCmd.run(DockerCmd.java:51)
02-Feb-2020 13:18:45         at com.atlassian.bamboo.plugins.docker.service.RunService.execute(RunService.java:64)
02-Feb-2020 13:18:45         ... 17 more
02-Feb-2020 13:18:45 Caused by: com.atlassian.utils.process.ProcessException: Error executing /usr/bin/docker run --volume /home/bamboo/xml-data/build-dir/PHPBB3-PR-JOB1:/data --workdir /data --rm -u=991 -t phpbb:php-7.1 /bin/bash -c "phpBB/vendor/bin/phpunit --log-junit build/logs/phpunit.xml"
02-Feb-2020 13:18:45         at com.atlassian.bamboo.docker.DockerContainerServiceImpl.execute(DockerContainerServiceImpl.java:252)
02-Feb-2020 13:18:45         at com.atlassian.bamboo.docker.DockerContainerServiceImpl.run(DockerContainerServiceImpl.java:106)
02-Feb-2020 13:18:45         ... 44 more
02-Feb-2020 13:18:45 Starting task 'Parsing test results produced by script' of type 'com.atlassian.bamboo.plugins.testresultparser:task.testresultparser.junit'
02-Feb-2020 13:18:45 Parsing test results under /home/bamboo/xml-data/build-dir/PHPBB3-PR-JOB1...
02-Feb-2020 13:18:45 Failing task since 11 failing test cases were found.
02-Feb-2020 13:18:45 Finished task 'Parsing test results produced by script' with result: Failed
02-Feb-2020 13:18:45
Substituting variable: ${bamboo.PRnumber} with 5841
02-Feb-2020 13:18:45
Substituting variable: ${bamboo.buildResultsUrl} with https://bamboo.phpbb.com/browse/PHPBB3-PR-JOB1-9850
02-Feb-2020 13:18:45
Substituting variable: ${bamboo.buildResultsUrl} with https://bamboo.phpbb.com/browse/PHPBB3-PR-JOB1-9850
02-Feb-2020 13:18:45 Starting task 'Set result build status' of type 'com.atlassian.bamboo.plugins.scripttask:task.builder.script'
02-Feb-2020 13:18:45
Beginning to execute external process for build 'phpBB3 - Pull Requests - Build and Test Job #9850 (PHPBB3-PR-JOB1-9850)'
... running command line:
/bin/sh /home/bamboo/temp/PHPBB3-PR-JOB1-9850-ScriptBuildTask-6418350106389199496.sh
... in: /home/bamboo/xml-data/build-dir/PHPBB3-PR-JOB1
... using extra environment variables:
bamboo_planRepository_1_branch=3.1.x
bamboo_planRepository_1_branchDisplayName=3.1.x
bamboo_repository_revision_number=dc8ff9da28b8ab4ad11c7ea94cca526f17c87fe5
bamboo_PRref=master
bamboo_resultsUrl=https://bamboo.phpbb.com/browse/PHPBB3-PR-JOB1-9850
bamboo_capability_system_builder_command_Git=/usr/bin/git
bamboo_repository_75956235_git_username=bantu
bamboo_build_working_directory=/home/bamboo/xml-data/build-dir/PHPBB3-PR-JOB1
bamboo_planRepository_1_name=phpBB Ascraeus
bamboo_buildKey=PHPBB3-PR-JOB1
bamboo_capability_phpbb_tests=true
bamboo_shortPlanName=Pull Requests
bamboo_capability_system_builder_command_fop=/usr/bin/fop
bamboo_capability_dbms_sqlite_2=true
bamboo_planRepository_name=phpBB Ascraeus
bamboo_PRnumber=5841
bamboo_buildNumber=9850
bamboo_repository_75956235_git_repositoryUrl=https://github.com/phpbb/phpbb.git
bamboo_capability_system_builder_phpunit_PHPUnit=/usr/bin/phpunit
bamboo_shortJobName=Build and Test Job
bamboo_buildResultsUrl=https://bamboo.phpbb.com/browse/PHPBB3-PR-JOB1-9850
bamboo_repository_75956235_branch_name=3.1.x
bamboo_planRepository_repositoryUrl=https://github.com/phpbb/phpbb.git
bamboo_agentId=131073
bamboo_planName=phpBB3 - Pull Requests
bamboo_build_commandline_com_atlassian_bamboo_plugins_scripttask_task_builder_script_7=/bin/sh /home/bamboo/temp/PHPBB3-PR-JOB1-9850-ScriptBuildTask-4165158688919937942.sh
bamboo_shortPlanKey=PR
bamboo_shortJobKey=JOB1
bamboo_capability_dbms_mysql_55=true
bamboo_capability_system_jdk_JDK_1_7_0_65=/usr/lib/jvm/java-7-openjdk-amd64
bamboo_planRepository_revision=dc8ff9da28b8ab4ad11c7ea94cca526f17c87fe5
bamboo_buildTimeStamp=2020-02-02T13:13:15.468Z
bamboo_repository_previous_revision_number=dc8ff9da28b8ab4ad11c7ea94cca526f17c87fe5
bamboo_capability_system_jdk_JDK_1_6_0_16=/usr/lib/jvm/java-6-sun-1.6.0.16
bamboo_capability_system_builder_mvn2_Maven_2=/usr/share/maven2
bamboo_planRepository_previousRevision=dc8ff9da28b8ab4ad11c7ea94cca526f17c87fe5
bamboo_build_commandline_com_atlassian_bamboo_plugins_scripttask_task_builder_script_4=/bin/sh /home/bamboo/temp/PHPBB3-PR-JOB1-9850-ScriptBuildTask-9014023522430531368.sh
bamboo_repository_git_branch=3.1.x
bamboo_buildResultKey=PHPBB3-PR-JOB1-9850
bamboo_repository_branch_name=3.1.x
bamboo_buildPlanName=phpBB3 - Pull Requests - Build and Test Job
bamboo_planRepository_1_revision=dc8ff9da28b8ab4ad11c7ea94cca526f17c87fe5
bamboo_repository_name=phpBB Ascraeus
bamboo_buildFailed=true
bamboo_build_commandline_com_atlassian_bamboo_plugins_bamboo_docker_plugin_task_docker_cli_10=/usr/bin/docker run --volume /home/bamboo/xml-data/build-dir/PHPBB3-PR-JOB1:/data --workdir /data --rm -u=991 -t phpbb:php-7.1 /bin/bash -c phpBB/vendor/bin/phpunit --log-junit build/logs/phpunit.xml
bamboo_capability_system_docker_executable=/usr/bin/docker
bamboo_build_commandline_com_atlassian_bamboo_plugins_bamboo_docker_plugin_task_docker_cli_11=/usr/bin/docker run --volume /home/bamboo/xml-data/build-dir/PHPBB3-PR-JOB1:/data --workdir /data/build --rm -u=991 phpbb:php-7.1 ../phpBB/vendor/bin/phing sniff
bamboo_build_commandline_com_atlassian_bamboo_plugins_bamboo_docker_plugin_task_docker_cli_12=/usr/bin/docker run --volume /home/bamboo/xml-data/build-dir/PHPBB3-PR-JOB1:/data --workdir /data/phpBB --rm -e HOME=/home/bamboo -u=991 phpbb:php-7.1 /bin/bash -c php ../composer.phar install --dev; cd ../build; ../phpBB/vendor/bin/phing clean prepare
bamboo_build_commandline_com_atlassian_bamboo_plugins_bamboo_docker_plugin_task_docker_cli_13=/usr/bin/docker build --force-rm=true --tag=phpbb:php-7.1 /home/bamboo/xml-data/build-dir/PHPBB3-PR-JOB1
bamboo_planRepository_branch=3.1.x
bamboo_agentWorkingDirectory=/home/bamboo/xml-data/build-dir
bamboo_jobFailed=true
bamboo_capability_system_git_executable=/usr/bin/git
bamboo_capability_system_builder_phpunit_PHPUnit_3_4=/usr/bin/phpunit
bamboo_repository_git_username=bantu
bamboo_planRepository_1_previousRevision=dc8ff9da28b8ab4ad11c7ea94cca526f17c87fe5
bamboo_repository_75956235_revision_number=dc8ff9da28b8ab4ad11c7ea94cca526f17c87fe5
bamboo_planRepository_branchDisplayName=3.1.x
bamboo_planRepository_1_type=gitv2
bamboo_planRepository_branchName=3.1.x
bamboo_repository_75956235_previous_revision_number=dc8ff9da28b8ab4ad11c7ea94cca526f17c87fe5
bamboo_capability_system_jdk_JDK=/usr/lib/jvm/java-6-sun
bamboo_plan_storageTag=PHPBB3-PR
bamboo_hg_cache_directory=/home/bamboo/xml-data/build-dir/_hg-repositories-cache
bamboo_planRepository_1_username=bantu
bamboo_planRepository_type=gitv2
bamboo_git_cache_directory=/home/bamboo/xml-data/build-dir/_git-repositories-cache
bamboo_ManualBuildTriggerReason_userName=Build Robot
bamboo_repository_git_repositoryUrl=https://github.com/phpbb/phpbb.git
bamboo_repository_75956235_git_branch=3.1.x
bamboo_capability_system_builder_ant_Ant=/usr/share/ant
bamboo_repository_75956235_name=phpBB Ascraeus
bamboo_tmp_directory=/home/bamboo/temp
bamboo_working_directory=/home/bamboo/xml-data/build-dir/PHPBB3-PR-JOB1
bamboo_planKey=PHPBB3-PR
bamboo_capability_local=true
bamboo_planRepository_1_repositoryUrl=https://github.com/phpbb/phpbb.git
bamboo_planRepository_username=bantu
bamboo_capability_system_jdk_JDK_1_6=/usr/lib/jvm/java-6-sun
bamboo_capability_system_jdk_JDK_1_7=/usr/lib/jvm/java-7-openjdk-amd64
bamboo_planRepository_1_branchName=3.1.x
02-Feb-2020 13:18:46 From https://github.com/phpbb/phpbb
02-Feb-2020 13:18:46 * branch            refs/pull/5841/head -> FETCH_HEAD
02-Feb-2020 13:18:46       <testsuite name="phpbb_cache_file_driver_test" file="/data/tests/cache/file_driver_test.php" tests="4" assertions="12" errors="0" failures="1" skipped="0" time="0.090385">
02-Feb-2020 13:18:46       <testsuite name="phpbb_dbal_select_test" file="/data/tests/dbal/select_test.php" tests="72" assertions="72" errors="0" failures="2" skipped="0" time="2.351080">
02-Feb-2020 13:18:46         <testsuite name="phpbb_dbal_select_test::test_query_limit" tests="9" assertions="9" errors="0" failures="2" skipped="0" time="0.268903">
02-Feb-2020 13:18:46       <testsuite name="phpbb_groupposition_teampage_test" file="/data/tests/groupposition/teampage_test.php" tests="32" assertions="58" errors="0" failures="2" skipped="0" time="3.273268">
02-Feb-2020 13:18:46         <testsuite name="phpbb_groupposition_teampage_test::test_move" tests="9" assertions="17" errors="0" failures="1" skipped="0" time="0.796917">
02-Feb-2020 13:18:46         <testsuite name="phpbb_groupposition_teampage_test::test_move_teampage" tests="9" assertions="17" errors="0" failures="1" skipped="0" time="0.853805">
02-Feb-2020 13:18:46       <testsuite name="phpbb_log_delete_test" file="/data/tests/log/delete_test.php" tests="6" assertions="6" errors="0" failures="6" skipped="0" time="0.714613">
02-Feb-2020 13:18:46         <testsuite name="phpbb_log_delete_test::test_log_delete" tests="6" assertions="6" errors="0" failures="6" skipped="0" time="0.714613">
02-Feb-2020 13:18:46   % Total    % Received % Xferd  Average Speed   Time    Time     Time  Current
02-Feb-2020 13:18:46                                  Dload  Upload   Total   Spent    Left  Speed
02-Feb-2020 13:18:46
02-Feb-2020 13:18:47   0     0    0     0    0     0      0      0 --:--:-- --:--:-- --:--:--     0
02-Feb-2020 13:18:47   0     0    0     0    0     0      0      0 --:--:-- --:--:-- --:--:--     0
02-Feb-2020 13:18:47 100   267  100    93  100   174    308    576 --:--:-- --:--:-- --:--:--   576
02-Feb-2020 13:18:47 Finished task 'Set result build status' with result: Success
02-Feb-2020 13:18:47 Running post build plugin 'NCover Results Collector'
02-Feb-2020 13:18:47 Running post build plugin 'Artifact Copier'
02-Feb-2020 13:18:47 Running post build plugin 'npm Cache Cleanup'
02-Feb-2020 13:18:47 Running post build plugin 'Clover Results Collector'
02-Feb-2020 13:18:47 Running post build plugin 'Docker Container Cleanup'
02-Feb-2020 13:18:47 Successfully removed working directory at '/home/bamboo/xml-data/build-dir/PHPBB3-PR-JOB1'
02-Feb-2020 13:18:47 Finalising the build...
02-Feb-2020 13:18:47 Stopping timer.
02-Feb-2020 13:18:47 Build PHPBB3-PR-JOB1-9850 completed.
02-Feb-2020 13:18:47 Running on server: post build plugin 'NCover Results Collector'
02-Feb-2020 13:18:47 Running on server: post build plugin 'Build Hanging Detection Configuration'
02-Feb-2020 13:18:47 Running on server: post build plugin 'Clover Delta Calculator'
02-Feb-2020 13:18:47 Running on server: post build plugin 'Maven Dependencies Postprocessor'
02-Feb-2020 13:18:47 All post build plugins have finished
02-Feb-2020 13:18:47 Generating build results summary...
02-Feb-2020 13:18:55 Saving build results to disk...
02-Feb-2020 13:18:55 Logging substituted variables...
02-Feb-2020 13:18:55 Indexing build results...
02-Feb-2020 13:18:55 Finished building PHPBB3-PR-JOB1-9850.
02-Feb-2020 13:18:55
Substituting variable: ${bamboo.PRnumber} with 5841