Tests pending pull requests

Build: #9881 failed

Job: Build and Test Job failed

Stages & jobs

  1. Build and Test

Build log

The build generated 14,171 lines of output.The output is too long and has been truncated to the last 1,000 lines. Download or view full build log

04-Feb-2020 21:56:40 /data/phpBB/phpbb/db/driver/doctrine.php:154
04-Feb-2020 21:56:40 /data/phpBB/phpbb/db/tools/tools.php:233
04-Feb-2020 21:56:40 /data/phpBB/phpbb/db/tools/tools.php:253
04-Feb-2020 21:56:40 /data/tests/test_framework/phpbb_database_test_connection_manager.php:387
04-Feb-2020 21:56:40 /data/tests/test_framework/phpbb_database_test_connection_manager.php:181
04-Feb-2020 21:56:40 /data/tests/test_framework/phpbb_database_test_case.php:266
04-Feb-2020 21:56:40 /data/phpBB/vendor/phpunit/dbunit/src/TestCaseTrait.php:189
04-Feb-2020 21:56:40 /data/phpBB/vendor/phpunit/dbunit/src/TestCaseTrait.php:149
04-Feb-2020 21:56:40 /data/phpBB/vendor/phpunit/dbunit/src/TestCaseTrait.php:44
04-Feb-2020 21:56:40 /data/tests/test_framework/phpbb_database_test_case.php:119
04-Feb-2020 21:56:40 /data/tests/tree/nestedset_forum_base.php:53
04-Feb-2020 21:56:40
04-Feb-2020 21:56:40 871) phpbb_tests_tree_nestedset_forum_move_test::test_move with data set #2 ('Move first item down', 1, -1, true, array(array(4, 0, 1, 6), array(5, 4, 2, 5), array(6, 5, 3, 4), array(1, 0, 7, 12), array(2, 1, 8, 9), array(3, 1, 10, 11), array(7, 0, 13, 22), array(8, 7, 14, 15), array(9, 7, 16, 19), array(10, 9, 17, 18), array(11, 7, 20, 21)))
04-Feb-2020 21:56:40 Error: Call to a member function modifyLimitQuery() on null
04-Feb-2020 21:56:40
04-Feb-2020 21:56:40 /data/phpBB/phpbb/db/driver/doctrine.php:154
04-Feb-2020 21:56:40 /data/phpBB/phpbb/db/tools/tools.php:233
04-Feb-2020 21:56:40 /data/phpBB/phpbb/db/tools/tools.php:253
04-Feb-2020 21:56:40 /data/tests/test_framework/phpbb_database_test_connection_manager.php:387
04-Feb-2020 21:56:40 /data/tests/test_framework/phpbb_database_test_connection_manager.php:181
04-Feb-2020 21:56:40 /data/tests/test_framework/phpbb_database_test_case.php:266
04-Feb-2020 21:56:40 /data/phpBB/vendor/phpunit/dbunit/src/TestCaseTrait.php:189
04-Feb-2020 21:56:40 /data/phpBB/vendor/phpunit/dbunit/src/TestCaseTrait.php:149
04-Feb-2020 21:56:40 /data/phpBB/vendor/phpunit/dbunit/src/TestCaseTrait.php:44
04-Feb-2020 21:56:40 /data/tests/test_framework/phpbb_database_test_case.php:119
04-Feb-2020 21:56:40 /data/tests/tree/nestedset_forum_base.php:53
04-Feb-2020 21:56:40
04-Feb-2020 21:56:40 872) phpbb_tests_tree_nestedset_forum_move_test::test_move with data set #3 ('Move second item up', 4, 1, true, array(array(4, 0, 1, 6), array(5, 4, 2, 5), array(6, 5, 3, 4), array(1, 0, 7, 12), array(2, 1, 8, 9), array(3, 1, 10, 11), array(7, 0, 13, 22), array(8, 7, 14, 15), array(9, 7, 16, 19), array(10, 9, 17, 18), array(11, 7, 20, 21)))
04-Feb-2020 21:56:40 Error: Call to a member function modifyLimitQuery() on null
04-Feb-2020 21:56:40
04-Feb-2020 21:56:40 /data/phpBB/phpbb/db/driver/doctrine.php:154
04-Feb-2020 21:56:40 /data/phpBB/phpbb/db/tools/tools.php:233
04-Feb-2020 21:56:40 /data/phpBB/phpbb/db/tools/tools.php:253
04-Feb-2020 21:56:40 /data/tests/test_framework/phpbb_database_test_connection_manager.php:387
04-Feb-2020 21:56:40 /data/tests/test_framework/phpbb_database_test_connection_manager.php:181
04-Feb-2020 21:56:40 /data/tests/test_framework/phpbb_database_test_case.php:266
04-Feb-2020 21:56:40 /data/phpBB/vendor/phpunit/dbunit/src/TestCaseTrait.php:189
04-Feb-2020 21:56:40 /data/phpBB/vendor/phpunit/dbunit/src/TestCaseTrait.php:149
04-Feb-2020 21:56:40 /data/phpBB/vendor/phpunit/dbunit/src/TestCaseTrait.php:44
04-Feb-2020 21:56:40 /data/tests/test_framework/phpbb_database_test_case.php:119
04-Feb-2020 21:56:40 /data/tests/tree/nestedset_forum_base.php:53
04-Feb-2020 21:56:40
04-Feb-2020 21:56:40 873) phpbb_tests_tree_nestedset_forum_move_test::test_move with data set #4 ('Move last item up', 7, 1, true, array(array(1, 0, 1, 6), array(2, 1, 2, 3), array(3, 1, 4, 5), array(7, 0, 7, 16), array(8, 7, 8, 9), array(9, 7, 10, 13), array(10, 9, 11, 12), array(11, 7, 14, 15), array(4, 0, 17, 22), array(5, 4, 18, 21), array(6, 5, 19, 20)))
04-Feb-2020 21:56:40 Error: Call to a member function modifyLimitQuery() on null
04-Feb-2020 21:56:40
04-Feb-2020 21:56:40 /data/phpBB/phpbb/db/driver/doctrine.php:154
04-Feb-2020 21:56:40 /data/phpBB/phpbb/db/tools/tools.php:233
04-Feb-2020 21:56:40 /data/phpBB/phpbb/db/tools/tools.php:253
04-Feb-2020 21:56:40 /data/tests/test_framework/phpbb_database_test_connection_manager.php:387
04-Feb-2020 21:56:40 /data/tests/test_framework/phpbb_database_test_connection_manager.php:181
04-Feb-2020 21:56:40 /data/tests/test_framework/phpbb_database_test_case.php:266
04-Feb-2020 21:56:40 /data/phpBB/vendor/phpunit/dbunit/src/TestCaseTrait.php:189
04-Feb-2020 21:56:40 /data/phpBB/vendor/phpunit/dbunit/src/TestCaseTrait.php:149
04-Feb-2020 21:56:40 /data/phpBB/vendor/phpunit/dbunit/src/TestCaseTrait.php:44
04-Feb-2020 21:56:40 /data/tests/test_framework/phpbb_database_test_case.php:119
04-Feb-2020 21:56:40 /data/tests/tree/nestedset_forum_base.php:53
04-Feb-2020 21:56:40
04-Feb-2020 21:56:40 874) phpbb_tests_tree_nestedset_forum_move_test::test_move with data set #5 ('Move last item up by 2', 7, 2, true, array(array(7, 0, 1, 10), array(8, 7, 2, 3), array(9, 7, 4, 7), array(10, 9, 5, 6), array(11, 7, 8, 9), array(1, 0, 11, 16), array(2, 1, 12, 13), array(3, 1, 14, 15), array(4, 0, 17, 22), array(5, 4, 18, 21), array(6, 5, 19, 20)))
04-Feb-2020 21:56:40 Error: Call to a member function modifyLimitQuery() on null
04-Feb-2020 21:56:40
04-Feb-2020 21:56:40 /data/phpBB/phpbb/db/driver/doctrine.php:154
04-Feb-2020 21:56:40 /data/phpBB/phpbb/db/tools/tools.php:233
04-Feb-2020 21:56:40 /data/phpBB/phpbb/db/tools/tools.php:253
04-Feb-2020 21:56:40 /data/tests/test_framework/phpbb_database_test_connection_manager.php:387
04-Feb-2020 21:56:40 /data/tests/test_framework/phpbb_database_test_connection_manager.php:181
04-Feb-2020 21:56:40 /data/tests/test_framework/phpbb_database_test_case.php:266
04-Feb-2020 21:56:40 /data/phpBB/vendor/phpunit/dbunit/src/TestCaseTrait.php:189
04-Feb-2020 21:56:40 /data/phpBB/vendor/phpunit/dbunit/src/TestCaseTrait.php:149
04-Feb-2020 21:56:40 /data/phpBB/vendor/phpunit/dbunit/src/TestCaseTrait.php:44
04-Feb-2020 21:56:40 /data/tests/test_framework/phpbb_database_test_case.php:119
04-Feb-2020 21:56:40 /data/tests/tree/nestedset_forum_base.php:53
04-Feb-2020 21:56:40
04-Feb-2020 21:56:40 875) phpbb_tests_tree_nestedset_forum_move_test::test_move with data set #6 ('Move last item up by 100', 7, 100, true, array(array(7, 0, 1, 10), array(8, 7, 2, 3), array(9, 7, 4, 7), array(10, 9, 5, 6), array(11, 7, 8, 9), array(1, 0, 11, 16), array(2, 1, 12, 13), array(3, 1, 14, 15), array(4, 0, 17, 22), array(5, 4, 18, 21), array(6, 5, 19, 20)))
04-Feb-2020 21:56:40 Error: Call to a member function modifyLimitQuery() on null
04-Feb-2020 21:56:40
04-Feb-2020 21:56:40 /data/phpBB/phpbb/db/driver/doctrine.php:154
04-Feb-2020 21:56:40 /data/phpBB/phpbb/db/tools/tools.php:233
04-Feb-2020 21:56:40 /data/phpBB/phpbb/db/tools/tools.php:253
04-Feb-2020 21:56:40 /data/tests/test_framework/phpbb_database_test_connection_manager.php:387
04-Feb-2020 21:56:40 /data/tests/test_framework/phpbb_database_test_connection_manager.php:181
04-Feb-2020 21:56:40 /data/tests/test_framework/phpbb_database_test_case.php:266
04-Feb-2020 21:56:40 /data/phpBB/vendor/phpunit/dbunit/src/TestCaseTrait.php:189
04-Feb-2020 21:56:40 /data/phpBB/vendor/phpunit/dbunit/src/TestCaseTrait.php:149
04-Feb-2020 21:56:40 /data/phpBB/vendor/phpunit/dbunit/src/TestCaseTrait.php:44
04-Feb-2020 21:56:40 /data/tests/test_framework/phpbb_database_test_case.php:119
04-Feb-2020 21:56:40 /data/tests/tree/nestedset_forum_base.php:53
04-Feb-2020 21:56:40
04-Feb-2020 21:56:40 876) phpbb_tests_tree_nestedset_forum_move_test::test_move_down with data set #0 ('Move last item down', 7, false, array(array(1, 0, 1, 6), array(2, 1, 2, 3), array(3, 1, 4, 5), array(4, 0, 7, 12), array(5, 4, 8, 11), array(6, 5, 9, 10), array(7, 0, 13, 22), array(8, 7, 14, 15), array(9, 7, 16, 19), array(10, 9, 17, 18), array(11, 7, 20, 21)))
04-Feb-2020 21:56:40 Error: Call to a member function modifyLimitQuery() on null
04-Feb-2020 21:56:40
04-Feb-2020 21:56:40 /data/phpBB/phpbb/db/driver/doctrine.php:154
04-Feb-2020 21:56:40 /data/phpBB/phpbb/db/tools/tools.php:233
04-Feb-2020 21:56:40 /data/phpBB/phpbb/db/tools/tools.php:253
04-Feb-2020 21:56:40 /data/tests/test_framework/phpbb_database_test_connection_manager.php:387
04-Feb-2020 21:56:40 /data/tests/test_framework/phpbb_database_test_connection_manager.php:181
04-Feb-2020 21:56:40 /data/tests/test_framework/phpbb_database_test_case.php:266
04-Feb-2020 21:56:40 /data/phpBB/vendor/phpunit/dbunit/src/TestCaseTrait.php:189
04-Feb-2020 21:56:40 /data/phpBB/vendor/phpunit/dbunit/src/TestCaseTrait.php:149
04-Feb-2020 21:56:40 /data/phpBB/vendor/phpunit/dbunit/src/TestCaseTrait.php:44
04-Feb-2020 21:56:40 /data/tests/test_framework/phpbb_database_test_case.php:119
04-Feb-2020 21:56:40 /data/tests/tree/nestedset_forum_base.php:53
04-Feb-2020 21:56:40
04-Feb-2020 21:56:40 877) phpbb_tests_tree_nestedset_forum_move_test::test_move_down with data set #1 ('Move first item down', 1, true, array(array(4, 0, 1, 6), array(5, 4, 2, 5), array(6, 5, 3, 4), array(1, 0, 7, 12), array(2, 1, 8, 9), array(3, 1, 10, 11), array(7, 0, 13, 22), array(8, 7, 14, 15), array(9, 7, 16, 19), array(10, 9, 17, 18), array(11, 7, 20, 21)))
04-Feb-2020 21:56:40 Error: Call to a member function modifyLimitQuery() on null
04-Feb-2020 21:56:40
04-Feb-2020 21:56:40 /data/phpBB/phpbb/db/driver/doctrine.php:154
04-Feb-2020 21:56:40 /data/phpBB/phpbb/db/tools/tools.php:233
04-Feb-2020 21:56:40 /data/phpBB/phpbb/db/tools/tools.php:253
04-Feb-2020 21:56:40 /data/tests/test_framework/phpbb_database_test_connection_manager.php:387
04-Feb-2020 21:56:40 /data/tests/test_framework/phpbb_database_test_connection_manager.php:181
04-Feb-2020 21:56:40 /data/tests/test_framework/phpbb_database_test_case.php:266
04-Feb-2020 21:56:40 /data/phpBB/vendor/phpunit/dbunit/src/TestCaseTrait.php:189
04-Feb-2020 21:56:40 /data/phpBB/vendor/phpunit/dbunit/src/TestCaseTrait.php:149
04-Feb-2020 21:56:40 /data/phpBB/vendor/phpunit/dbunit/src/TestCaseTrait.php:44
04-Feb-2020 21:56:40 /data/tests/test_framework/phpbb_database_test_case.php:119
04-Feb-2020 21:56:40 /data/tests/tree/nestedset_forum_base.php:53
04-Feb-2020 21:56:40
04-Feb-2020 21:56:40 878) phpbb_tests_tree_nestedset_forum_move_test::test_move_up with data set #0 ('Move first item up', 1, false, array(array(1, 0, 1, 6), array(2, 1, 2, 3), array(3, 1, 4, 5), array(4, 0, 7, 12), array(5, 4, 8, 11), array(6, 5, 9, 10), array(7, 0, 13, 22), array(8, 7, 14, 15), array(9, 7, 16, 19), array(10, 9, 17, 18), array(11, 7, 20, 21)))
04-Feb-2020 21:56:40 Error: Call to a member function modifyLimitQuery() on null
04-Feb-2020 21:56:40
04-Feb-2020 21:56:40 /data/phpBB/phpbb/db/driver/doctrine.php:154
04-Feb-2020 21:56:40 /data/phpBB/phpbb/db/tools/tools.php:233
04-Feb-2020 21:56:40 /data/phpBB/phpbb/db/tools/tools.php:253
04-Feb-2020 21:56:40 /data/tests/test_framework/phpbb_database_test_connection_manager.php:387
04-Feb-2020 21:56:40 /data/tests/test_framework/phpbb_database_test_connection_manager.php:181
04-Feb-2020 21:56:40 /data/tests/test_framework/phpbb_database_test_case.php:266
04-Feb-2020 21:56:40 /data/phpBB/vendor/phpunit/dbunit/src/TestCaseTrait.php:189
04-Feb-2020 21:56:40 /data/phpBB/vendor/phpunit/dbunit/src/TestCaseTrait.php:149
04-Feb-2020 21:56:40 /data/phpBB/vendor/phpunit/dbunit/src/TestCaseTrait.php:44
04-Feb-2020 21:56:40 /data/tests/test_framework/phpbb_database_test_case.php:119
04-Feb-2020 21:56:40 /data/tests/tree/nestedset_forum_base.php:53
04-Feb-2020 21:56:40
04-Feb-2020 21:56:40 879) phpbb_tests_tree_nestedset_forum_move_test::test_move_up with data set #1 ('Move second item up', 4, true, array(array(4, 0, 1, 6), array(5, 4, 2, 5), array(6, 5, 3, 4), array(1, 0, 7, 12), array(2, 1, 8, 9), array(3, 1, 10, 11), array(7, 0, 13, 22), array(8, 7, 14, 15), array(9, 7, 16, 19), array(10, 9, 17, 18), array(11, 7, 20, 21)))
04-Feb-2020 21:56:40 Error: Call to a member function modifyLimitQuery() on null
04-Feb-2020 21:56:40
04-Feb-2020 21:56:40 /data/phpBB/phpbb/db/driver/doctrine.php:154
04-Feb-2020 21:56:40 /data/phpBB/phpbb/db/tools/tools.php:233
04-Feb-2020 21:56:40 /data/phpBB/phpbb/db/tools/tools.php:253
04-Feb-2020 21:56:40 /data/tests/test_framework/phpbb_database_test_connection_manager.php:387
04-Feb-2020 21:56:40 /data/tests/test_framework/phpbb_database_test_connection_manager.php:181
04-Feb-2020 21:56:40 /data/tests/test_framework/phpbb_database_test_case.php:266
04-Feb-2020 21:56:40 /data/phpBB/vendor/phpunit/dbunit/src/TestCaseTrait.php:189
04-Feb-2020 21:56:40 /data/phpBB/vendor/phpunit/dbunit/src/TestCaseTrait.php:149
04-Feb-2020 21:56:40 /data/phpBB/vendor/phpunit/dbunit/src/TestCaseTrait.php:44
04-Feb-2020 21:56:40 /data/tests/test_framework/phpbb_database_test_case.php:119
04-Feb-2020 21:56:40 /data/tests/tree/nestedset_forum_base.php:53
04-Feb-2020 21:56:40
04-Feb-2020 21:56:40 880) phpbb_tests_tree_nestedset_forum_move_test::test_move_children with data set #0 ('Item has no children', 2, 1, false, array(array(1, 0, 1, 6, 'a:0:{}'), array(2, 1, 2, 3, 'a:0:{}'), array(3, 1, 4, 5, 'a:0:{}'), array(4, 0, 7, 12, 'a:0:{}'), array(5, 4, 8, 11, 'a:0:{}'), array(6, 5, 9, 10, 'a:0:{}'), array(7, 0, 13, 22, 'a:0:{}'), array(8, 7, 14, 15, 'a:0:{}'), array(9, 7, 16, 19, 'a:0:{}'), array(10, 9, 17, 18, 'a:0:{}'), array(11, 7, 20, 21, 'a:0:{}')))
04-Feb-2020 21:56:40 Error: Call to a member function modifyLimitQuery() on null
04-Feb-2020 21:56:40
04-Feb-2020 21:56:40 /data/phpBB/phpbb/db/driver/doctrine.php:154
04-Feb-2020 21:56:40 /data/phpBB/phpbb/db/tools/tools.php:233
04-Feb-2020 21:56:40 /data/phpBB/phpbb/db/tools/tools.php:253
04-Feb-2020 21:56:40 /data/tests/test_framework/phpbb_database_test_connection_manager.php:387
04-Feb-2020 21:56:40 /data/tests/test_framework/phpbb_database_test_connection_manager.php:181
04-Feb-2020 21:56:40 /data/tests/test_framework/phpbb_database_test_case.php:266
04-Feb-2020 21:56:40 /data/phpBB/vendor/phpunit/dbunit/src/TestCaseTrait.php:189
04-Feb-2020 21:56:40 /data/phpBB/vendor/phpunit/dbunit/src/TestCaseTrait.php:149
04-Feb-2020 21:56:40 /data/phpBB/vendor/phpunit/dbunit/src/TestCaseTrait.php:44
04-Feb-2020 21:56:40 /data/tests/test_framework/phpbb_database_test_case.php:119
04-Feb-2020 21:56:40 /data/tests/tree/nestedset_forum_base.php:53
04-Feb-2020 21:56:40
04-Feb-2020 21:56:40 881) phpbb_tests_tree_nestedset_forum_move_test::test_move_children with data set #1 ('Move to same parent', 4, 4, false, array(array(1, 0, 1, 6, 'a:0:{}'), array(2, 1, 2, 3, 'a:0:{}'), array(3, 1, 4, 5, 'a:0:{}'), array(4, 0, 7, 12, 'a:0:{}'), array(5, 4, 8, 11, 'a:0:{}'), array(6, 5, 9, 10, 'a:0:{}'), array(7, 0, 13, 22, 'a:0:{}'), array(8, 7, 14, 15, 'a:0:{}'), array(9, 7, 16, 19, 'a:0:{}'), array(10, 9, 17, 18, 'a:0:{}'), array(11, 7, 20, 21, 'a:0:{}')))
04-Feb-2020 21:56:40 Error: Call to a member function modifyLimitQuery() on null
04-Feb-2020 21:56:40
04-Feb-2020 21:56:40 /data/phpBB/phpbb/db/driver/doctrine.php:154
04-Feb-2020 21:56:40 /data/phpBB/phpbb/db/tools/tools.php:233
04-Feb-2020 21:56:40 /data/phpBB/phpbb/db/tools/tools.php:253
04-Feb-2020 21:56:40 /data/tests/test_framework/phpbb_database_test_connection_manager.php:387
04-Feb-2020 21:56:40 /data/tests/test_framework/phpbb_database_test_connection_manager.php:181
04-Feb-2020 21:56:40 /data/tests/test_framework/phpbb_database_test_case.php:266
04-Feb-2020 21:56:40 /data/phpBB/vendor/phpunit/dbunit/src/TestCaseTrait.php:189
04-Feb-2020 21:56:40 /data/phpBB/vendor/phpunit/dbunit/src/TestCaseTrait.php:149
04-Feb-2020 21:56:40 /data/phpBB/vendor/phpunit/dbunit/src/TestCaseTrait.php:44
04-Feb-2020 21:56:40 /data/tests/test_framework/phpbb_database_test_case.php:119
04-Feb-2020 21:56:40 /data/tests/tree/nestedset_forum_base.php:53
04-Feb-2020 21:56:40
04-Feb-2020 21:56:40 882) phpbb_tests_tree_nestedset_forum_move_test::test_move_children with data set #2 ('Move single child up', 5, 1, true, array(array(1, 0, 1, 8, 'a:0:{}'), array(2, 1, 2, 3, 'a:0:{}'), array(3, 1, 4, 5, 'a:0:{}'), array(6, 1, 6, 7, ''), array(4, 0, 9, 12, 'a:0:{}'), array(5, 4, 10, 11, 'a:0:{}'), array(7, 0, 13, 22, 'a:0:{}'), array(8, 7, 14, 15, 'a:0:{}'), array(9, 7, 16, 19, 'a:0:{}'), array(10, 9, 17, 18, 'a:0:{}'), array(11, 7, 20, 21, 'a:0:{}')))
04-Feb-2020 21:56:40 Error: Call to a member function modifyLimitQuery() on null
04-Feb-2020 21:56:40
04-Feb-2020 21:56:40 /data/phpBB/phpbb/db/driver/doctrine.php:154
04-Feb-2020 21:56:40 /data/phpBB/phpbb/db/tools/tools.php:233
04-Feb-2020 21:56:40 /data/phpBB/phpbb/db/tools/tools.php:253
04-Feb-2020 21:56:40 /data/tests/test_framework/phpbb_database_test_connection_manager.php:387
04-Feb-2020 21:56:40 /data/tests/test_framework/phpbb_database_test_connection_manager.php:181
04-Feb-2020 21:56:40 /data/tests/test_framework/phpbb_database_test_case.php:266
04-Feb-2020 21:56:40 /data/phpBB/vendor/phpunit/dbunit/src/TestCaseTrait.php:189
04-Feb-2020 21:56:40 /data/phpBB/vendor/phpunit/dbunit/src/TestCaseTrait.php:149
04-Feb-2020 21:56:40 /data/phpBB/vendor/phpunit/dbunit/src/TestCaseTrait.php:44
04-Feb-2020 21:56:40 /data/tests/test_framework/phpbb_database_test_case.php:119
04-Feb-2020 21:56:40 /data/tests/tree/nestedset_forum_base.php:53
04-Feb-2020 21:56:40
04-Feb-2020 21:56:40 883) phpbb_tests_tree_nestedset_forum_move_test::test_move_children with data set #3 ('Move nested children up', 4, 1, true, array(array(1, 0, 1, 10, 'a:0:{}'), array(2, 1, 2, 3, 'a:0:{}'), array(3, 1, 4, 5, 'a:0:{}'), array(5, 1, 6, 9, ''), array(6, 5, 7, 8, ''), array(4, 0, 11, 12, 'a:0:{}'), array(7, 0, 13, 22, 'a:0:{}'), array(8, 7, 14, 15, 'a:0:{}'), array(9, 7, 16, 19, 'a:0:{}'), array(10, 9, 17, 18, 'a:0:{}'), array(11, 7, 20, 21, 'a:0:{}')))
04-Feb-2020 21:56:40 Error: Call to a member function modifyLimitQuery() on null
04-Feb-2020 21:56:40
04-Feb-2020 21:56:40 /data/phpBB/phpbb/db/driver/doctrine.php:154
04-Feb-2020 21:56:40 /data/phpBB/phpbb/db/tools/tools.php:233
04-Feb-2020 21:56:40 /data/phpBB/phpbb/db/tools/tools.php:253
04-Feb-2020 21:56:40 /data/tests/test_framework/phpbb_database_test_connection_manager.php:387
04-Feb-2020 21:56:40 /data/tests/test_framework/phpbb_database_test_connection_manager.php:181
04-Feb-2020 21:56:40 /data/tests/test_framework/phpbb_database_test_case.php:266
04-Feb-2020 21:56:40 /data/phpBB/vendor/phpunit/dbunit/src/TestCaseTrait.php:189
04-Feb-2020 21:56:40 /data/phpBB/vendor/phpunit/dbunit/src/TestCaseTrait.php:149
04-Feb-2020 21:56:40 /data/phpBB/vendor/phpunit/dbunit/src/TestCaseTrait.php:44
04-Feb-2020 21:56:40 /data/tests/test_framework/phpbb_database_test_case.php:119
04-Feb-2020 21:56:40 /data/tests/tree/nestedset_forum_base.php:53
04-Feb-2020 21:56:40
04-Feb-2020 21:56:40 884) phpbb_tests_tree_nestedset_forum_move_test::test_move_children with data set #4 ('Move single child down', 5, 7, true, array(array(1, 0, 1, 6, 'a:0:{}'), array(2, 1, 2, 3, 'a:0:{}'), array(3, 1, 4, 5, 'a:0:{}'), array(4, 0, 7, 10, 'a:0:{}'), array(5, 4, 8, 9, 'a:0:{}'), array(7, 0, 11, 22, 'a:0:{}'), array(8, 7, 12, 13, 'a:0:{}'), array(9, 7, 14, 17, 'a:0:{}'), array(10, 9, 15, 16, 'a:0:{}'), array(11, 7, 18, 19, 'a:0:{}'), array(6, 7, 20, 21, '')))
04-Feb-2020 21:56:40 Error: Call to a member function modifyLimitQuery() on null
04-Feb-2020 21:56:40
04-Feb-2020 21:56:40 /data/phpBB/phpbb/db/driver/doctrine.php:154
04-Feb-2020 21:56:40 /data/phpBB/phpbb/db/tools/tools.php:233
04-Feb-2020 21:56:40 /data/phpBB/phpbb/db/tools/tools.php:253
04-Feb-2020 21:56:40 /data/tests/test_framework/phpbb_database_test_connection_manager.php:387
04-Feb-2020 21:56:40 /data/tests/test_framework/phpbb_database_test_connection_manager.php:181
04-Feb-2020 21:56:40 /data/tests/test_framework/phpbb_database_test_case.php:266
04-Feb-2020 21:56:40 /data/phpBB/vendor/phpunit/dbunit/src/TestCaseTrait.php:189
04-Feb-2020 21:56:40 /data/phpBB/vendor/phpunit/dbunit/src/TestCaseTrait.php:149
04-Feb-2020 21:56:40 /data/phpBB/vendor/phpunit/dbunit/src/TestCaseTrait.php:44
04-Feb-2020 21:56:40 /data/tests/test_framework/phpbb_database_test_case.php:119
04-Feb-2020 21:56:40 /data/tests/tree/nestedset_forum_base.php:53
04-Feb-2020 21:56:40
04-Feb-2020 21:56:40 885) phpbb_tests_tree_nestedset_forum_move_test::test_move_children with data set #5 ('Move nested children down', 4, 7, true, array(array(1, 0, 1, 6, 'a:0:{}'), array(2, 1, 2, 3, 'a:0:{}'), array(3, 1, 4, 5, 'a:0:{}'), array(4, 0, 7, 8, 'a:0:{}'), array(7, 0, 9, 22, 'a:0:{}'), array(8, 7, 10, 11, 'a:0:{}'), array(9, 7, 12, 15, 'a:0:{}'), array(10, 9, 13, 14, 'a:0:{}'), array(11, 7, 16, 17, 'a:0:{}'), array(5, 7, 18, 21, ''), array(6, 5, 19, 20, '')))
04-Feb-2020 21:56:40 Error: Call to a member function modifyLimitQuery() on null
04-Feb-2020 21:56:40
04-Feb-2020 21:56:40 /data/phpBB/phpbb/db/driver/doctrine.php:154
04-Feb-2020 21:56:40 /data/phpBB/phpbb/db/tools/tools.php:233
04-Feb-2020 21:56:40 /data/phpBB/phpbb/db/tools/tools.php:253
04-Feb-2020 21:56:40 /data/tests/test_framework/phpbb_database_test_connection_manager.php:387
04-Feb-2020 21:56:40 /data/tests/test_framework/phpbb_database_test_connection_manager.php:181
04-Feb-2020 21:56:40 /data/tests/test_framework/phpbb_database_test_case.php:266
04-Feb-2020 21:56:40 /data/phpBB/vendor/phpunit/dbunit/src/TestCaseTrait.php:189
04-Feb-2020 21:56:40 /data/phpBB/vendor/phpunit/dbunit/src/TestCaseTrait.php:149
04-Feb-2020 21:56:40 /data/phpBB/vendor/phpunit/dbunit/src/TestCaseTrait.php:44
04-Feb-2020 21:56:40 /data/tests/test_framework/phpbb_database_test_case.php:119
04-Feb-2020 21:56:40 /data/tests/tree/nestedset_forum_base.php:53
04-Feb-2020 21:56:40
04-Feb-2020 21:56:40 886) phpbb_tests_tree_nestedset_forum_move_test::test_move_children with data set #6 ('Move single child to parent 0', 5, 0, true, array(array(1, 0, 1, 6, 'a:0:{}'), array(2, 1, 2, 3, 'a:0:{}'), array(3, 1, 4, 5, 'a:0:{}'), array(4, 0, 7, 10, 'a:0:{}'), array(5, 4, 8, 9, 'a:0:{}'), array(7, 0, 11, 20, 'a:0:{}'), array(8, 7, 12, 13, 'a:0:{}'), array(9, 7, 14, 17, 'a:0:{}'), array(10, 9, 15, 16, 'a:0:{}'), array(11, 7, 18, 19, 'a:0:{}'), array(6, 0, 21, 22, '')))
04-Feb-2020 21:56:40 Error: Call to a member function modifyLimitQuery() on null
04-Feb-2020 21:56:40
04-Feb-2020 21:56:40 /data/phpBB/phpbb/db/driver/doctrine.php:154
04-Feb-2020 21:56:40 /data/phpBB/phpbb/db/tools/tools.php:233
04-Feb-2020 21:56:40 /data/phpBB/phpbb/db/tools/tools.php:253
04-Feb-2020 21:56:40 /data/tests/test_framework/phpbb_database_test_connection_manager.php:387
04-Feb-2020 21:56:40 /data/tests/test_framework/phpbb_database_test_connection_manager.php:181
04-Feb-2020 21:56:40 /data/tests/test_framework/phpbb_database_test_case.php:266
04-Feb-2020 21:56:40 /data/phpBB/vendor/phpunit/dbunit/src/TestCaseTrait.php:189
04-Feb-2020 21:56:40 /data/phpBB/vendor/phpunit/dbunit/src/TestCaseTrait.php:149
04-Feb-2020 21:56:40 /data/phpBB/vendor/phpunit/dbunit/src/TestCaseTrait.php:44
04-Feb-2020 21:56:40 /data/tests/test_framework/phpbb_database_test_case.php:119
04-Feb-2020 21:56:40 /data/tests/tree/nestedset_forum_base.php:53
04-Feb-2020 21:56:40
04-Feb-2020 21:56:40 887) phpbb_tests_tree_nestedset_forum_move_test::test_move_children with data set #7 ('Move nested children to parent 0', 4, 0, true, array(array(1, 0, 1, 6, 'a:0:{}'), array(2, 1, 2, 3, 'a:0:{}'), array(3, 1, 4, 5, 'a:0:{}'), array(4, 0, 7, 8, 'a:0:{}'), array(7, 0, 9, 18, 'a:0:{}'), array(8, 7, 10, 11, 'a:0:{}'), array(9, 7, 12, 15, 'a:0:{}'), array(10, 9, 13, 14, 'a:0:{}'), array(11, 7, 16, 17, 'a:0:{}'), array(5, 0, 19, 22, ''), array(6, 5, 20, 21, '')))
04-Feb-2020 21:56:40 Error: Call to a member function modifyLimitQuery() on null
04-Feb-2020 21:56:40
04-Feb-2020 21:56:40 /data/phpBB/phpbb/db/driver/doctrine.php:154
04-Feb-2020 21:56:40 /data/phpBB/phpbb/db/tools/tools.php:233
04-Feb-2020 21:56:40 /data/phpBB/phpbb/db/tools/tools.php:253
04-Feb-2020 21:56:40 /data/tests/test_framework/phpbb_database_test_connection_manager.php:387
04-Feb-2020 21:56:40 /data/tests/test_framework/phpbb_database_test_connection_manager.php:181
04-Feb-2020 21:56:40 /data/tests/test_framework/phpbb_database_test_case.php:266
04-Feb-2020 21:56:40 /data/phpBB/vendor/phpunit/dbunit/src/TestCaseTrait.php:189
04-Feb-2020 21:56:40 /data/phpBB/vendor/phpunit/dbunit/src/TestCaseTrait.php:149
04-Feb-2020 21:56:40 /data/phpBB/vendor/phpunit/dbunit/src/TestCaseTrait.php:44
04-Feb-2020 21:56:40 /data/tests/test_framework/phpbb_database_test_case.php:119
04-Feb-2020 21:56:40 /data/tests/tree/nestedset_forum_base.php:53
04-Feb-2020 21:56:40
04-Feb-2020 21:56:40 888) phpbb_tests_tree_nestedset_forum_move_test::test_move_children_throws_item with data set #0 ('Item 0 does not exist', 0, 5)
04-Feb-2020 21:56:40 Error: Call to a member function modifyLimitQuery() on null
04-Feb-2020 21:56:40
04-Feb-2020 21:56:40 /data/phpBB/phpbb/db/driver/doctrine.php:154
04-Feb-2020 21:56:40 /data/phpBB/phpbb/db/tools/tools.php:233
04-Feb-2020 21:56:40 /data/phpBB/phpbb/db/tools/tools.php:253
04-Feb-2020 21:56:40 /data/tests/test_framework/phpbb_database_test_connection_manager.php:387
04-Feb-2020 21:56:40 /data/tests/test_framework/phpbb_database_test_connection_manager.php:181
04-Feb-2020 21:56:40 /data/tests/test_framework/phpbb_database_test_case.php:266
04-Feb-2020 21:56:40 /data/phpBB/vendor/phpunit/dbunit/src/TestCaseTrait.php:189
04-Feb-2020 21:56:40 /data/phpBB/vendor/phpunit/dbunit/src/TestCaseTrait.php:149
04-Feb-2020 21:56:40 /data/phpBB/vendor/phpunit/dbunit/src/TestCaseTrait.php:44
04-Feb-2020 21:56:40 /data/tests/test_framework/phpbb_database_test_case.php:119
04-Feb-2020 21:56:40 /data/tests/tree/nestedset_forum_base.php:53
04-Feb-2020 21:56:40
04-Feb-2020 21:56:40 889) phpbb_tests_tree_nestedset_forum_move_test::test_move_children_throws_item with data set #1 ('Item does not exist', 200, 5)
04-Feb-2020 21:56:40 Error: Call to a member function modifyLimitQuery() on null
04-Feb-2020 21:56:40
04-Feb-2020 21:56:40 /data/phpBB/phpbb/db/driver/doctrine.php:154
04-Feb-2020 21:56:40 /data/phpBB/phpbb/db/tools/tools.php:233
04-Feb-2020 21:56:40 /data/phpBB/phpbb/db/tools/tools.php:253
04-Feb-2020 21:56:40 /data/tests/test_framework/phpbb_database_test_connection_manager.php:387
04-Feb-2020 21:56:40 /data/tests/test_framework/phpbb_database_test_connection_manager.php:181
04-Feb-2020 21:56:40 /data/tests/test_framework/phpbb_database_test_case.php:266
04-Feb-2020 21:56:40 /data/phpBB/vendor/phpunit/dbunit/src/TestCaseTrait.php:189
04-Feb-2020 21:56:40 /data/phpBB/vendor/phpunit/dbunit/src/TestCaseTrait.php:149
04-Feb-2020 21:56:40 /data/phpBB/vendor/phpunit/dbunit/src/TestCaseTrait.php:44
04-Feb-2020 21:56:40 /data/tests/test_framework/phpbb_database_test_case.php:119
04-Feb-2020 21:56:40 /data/tests/tree/nestedset_forum_base.php:53
04-Feb-2020 21:56:40
04-Feb-2020 21:56:40 890) phpbb_tests_tree_nestedset_forum_move_test::test_move_children_throws_parent with data set #0 ('New parent is child', 4, 5)
04-Feb-2020 21:56:40 Error: Call to a member function modifyLimitQuery() on null
04-Feb-2020 21:56:40
04-Feb-2020 21:56:40 /data/phpBB/phpbb/db/driver/doctrine.php:154
04-Feb-2020 21:56:40 /data/phpBB/phpbb/db/tools/tools.php:233
04-Feb-2020 21:56:40 /data/phpBB/phpbb/db/tools/tools.php:253
04-Feb-2020 21:56:40 /data/tests/test_framework/phpbb_database_test_connection_manager.php:387
04-Feb-2020 21:56:40 /data/tests/test_framework/phpbb_database_test_connection_manager.php:181
04-Feb-2020 21:56:40 /data/tests/test_framework/phpbb_database_test_case.php:266
04-Feb-2020 21:56:40 /data/phpBB/vendor/phpunit/dbunit/src/TestCaseTrait.php:189
04-Feb-2020 21:56:40 /data/phpBB/vendor/phpunit/dbunit/src/TestCaseTrait.php:149
04-Feb-2020 21:56:40 /data/phpBB/vendor/phpunit/dbunit/src/TestCaseTrait.php:44
04-Feb-2020 21:56:40 /data/tests/test_framework/phpbb_database_test_case.php:119
04-Feb-2020 21:56:40 /data/tests/tree/nestedset_forum_base.php:53
04-Feb-2020 21:56:40
04-Feb-2020 21:56:40 891) phpbb_tests_tree_nestedset_forum_move_test::test_move_children_throws_parent with data set #1 ('New parent is child 2', 7, 9)
04-Feb-2020 21:56:40 Error: Call to a member function modifyLimitQuery() on null
04-Feb-2020 21:56:40
04-Feb-2020 21:56:40 /data/phpBB/phpbb/db/driver/doctrine.php:154
04-Feb-2020 21:56:40 /data/phpBB/phpbb/db/tools/tools.php:233
04-Feb-2020 21:56:40 /data/phpBB/phpbb/db/tools/tools.php:253
04-Feb-2020 21:56:40 /data/tests/test_framework/phpbb_database_test_connection_manager.php:387
04-Feb-2020 21:56:40 /data/tests/test_framework/phpbb_database_test_connection_manager.php:181
04-Feb-2020 21:56:40 /data/tests/test_framework/phpbb_database_test_case.php:266
04-Feb-2020 21:56:40 /data/phpBB/vendor/phpunit/dbunit/src/TestCaseTrait.php:189
04-Feb-2020 21:56:40 /data/phpBB/vendor/phpunit/dbunit/src/TestCaseTrait.php:149
04-Feb-2020 21:56:40 /data/phpBB/vendor/phpunit/dbunit/src/TestCaseTrait.php:44
04-Feb-2020 21:56:40 /data/tests/test_framework/phpbb_database_test_case.php:119
04-Feb-2020 21:56:40 /data/tests/tree/nestedset_forum_base.php:53
04-Feb-2020 21:56:40
04-Feb-2020 21:56:40 892) phpbb_tests_tree_nestedset_forum_move_test::test_move_children_throws_parent with data set #2 ('New parent does not exist', 1, 200)
04-Feb-2020 21:56:40 Error: Call to a member function modifyLimitQuery() on null
04-Feb-2020 21:56:40
04-Feb-2020 21:56:40 /data/phpBB/phpbb/db/driver/doctrine.php:154
04-Feb-2020 21:56:40 /data/phpBB/phpbb/db/tools/tools.php:233
04-Feb-2020 21:56:40 /data/phpBB/phpbb/db/tools/tools.php:253
04-Feb-2020 21:56:40 /data/tests/test_framework/phpbb_database_test_connection_manager.php:387
04-Feb-2020 21:56:40 /data/tests/test_framework/phpbb_database_test_connection_manager.php:181
04-Feb-2020 21:56:40 /data/tests/test_framework/phpbb_database_test_case.php:266
04-Feb-2020 21:56:40 /data/phpBB/vendor/phpunit/dbunit/src/TestCaseTrait.php:189
04-Feb-2020 21:56:40 /data/phpBB/vendor/phpunit/dbunit/src/TestCaseTrait.php:149
04-Feb-2020 21:56:40 /data/phpBB/vendor/phpunit/dbunit/src/TestCaseTrait.php:44
04-Feb-2020 21:56:40 /data/tests/test_framework/phpbb_database_test_case.php:119
04-Feb-2020 21:56:40 /data/tests/tree/nestedset_forum_base.php:53
04-Feb-2020 21:56:40
04-Feb-2020 21:56:40 893) phpbb_tests_tree_nestedset_forum_move_test::test_change_parent with data set #0 ('Move single child up', 6, 1, true, array(array(1, 0, 1, 8, 'a:0:{}'), array(2, 1, 2, 3, 'a:0:{}'), array(3, 1, 4, 5, 'a:0:{}'), array(6, 1, 6, 7, ''), array(4, 0, 9, 12, 'a:0:{}'), array(5, 4, 10, 11, 'a:0:{}'), array(7, 0, 13, 22, 'a:0:{}'), array(8, 7, 14, 15, 'a:0:{}'), array(9, 7, 16, 19, 'a:0:{}'), array(10, 9, 17, 18, 'a:0:{}'), array(11, 7, 20, 21, 'a:0:{}')))
04-Feb-2020 21:56:40 Error: Call to a member function modifyLimitQuery() on null
04-Feb-2020 21:56:40
04-Feb-2020 21:56:40 /data/phpBB/phpbb/db/driver/doctrine.php:154
04-Feb-2020 21:56:40 /data/phpBB/phpbb/db/tools/tools.php:233
04-Feb-2020 21:56:40 /data/phpBB/phpbb/db/tools/tools.php:253
04-Feb-2020 21:56:40 /data/tests/test_framework/phpbb_database_test_connection_manager.php:387
04-Feb-2020 21:56:40 /data/tests/test_framework/phpbb_database_test_connection_manager.php:181
04-Feb-2020 21:56:40 /data/tests/test_framework/phpbb_database_test_case.php:266
04-Feb-2020 21:56:40 /data/phpBB/vendor/phpunit/dbunit/src/TestCaseTrait.php:189
04-Feb-2020 21:56:40 /data/phpBB/vendor/phpunit/dbunit/src/TestCaseTrait.php:149
04-Feb-2020 21:56:40 /data/phpBB/vendor/phpunit/dbunit/src/TestCaseTrait.php:44
04-Feb-2020 21:56:40 /data/tests/test_framework/phpbb_database_test_case.php:119
04-Feb-2020 21:56:40 /data/tests/tree/nestedset_forum_base.php:53
04-Feb-2020 21:56:40
04-Feb-2020 21:56:40 894) phpbb_tests_tree_nestedset_forum_move_test::test_change_parent with data set #1 ('Move nested children up', 5, 1, true, array(array(1, 0, 1, 10, 'a:0:{}'), array(2, 1, 2, 3, 'a:0:{}'), array(3, 1, 4, 5, 'a:0:{}'), array(5, 1, 6, 9, ''), array(6, 5, 7, 8, ''), array(4, 0, 11, 12, 'a:0:{}'), array(7, 0, 13, 22, 'a:0:{}'), array(8, 7, 14, 15, 'a:0:{}'), array(9, 7, 16, 19, 'a:0:{}'), array(10, 9, 17, 18, 'a:0:{}'), array(11, 7, 20, 21, 'a:0:{}')))
04-Feb-2020 21:56:40 Error: Call to a member function modifyLimitQuery() on null
04-Feb-2020 21:56:40
04-Feb-2020 21:56:40 /data/phpBB/phpbb/db/driver/doctrine.php:154
04-Feb-2020 21:56:40 /data/phpBB/phpbb/db/tools/tools.php:233
04-Feb-2020 21:56:40 /data/phpBB/phpbb/db/tools/tools.php:253
04-Feb-2020 21:56:40 /data/tests/test_framework/phpbb_database_test_connection_manager.php:387
04-Feb-2020 21:56:40 /data/tests/test_framework/phpbb_database_test_connection_manager.php:181
04-Feb-2020 21:56:40 /data/tests/test_framework/phpbb_database_test_case.php:266
04-Feb-2020 21:56:40 /data/phpBB/vendor/phpunit/dbunit/src/TestCaseTrait.php:189
04-Feb-2020 21:56:40 /data/phpBB/vendor/phpunit/dbunit/src/TestCaseTrait.php:149
04-Feb-2020 21:56:40 /data/phpBB/vendor/phpunit/dbunit/src/TestCaseTrait.php:44
04-Feb-2020 21:56:40 /data/tests/test_framework/phpbb_database_test_case.php:119
04-Feb-2020 21:56:40 /data/tests/tree/nestedset_forum_base.php:53
04-Feb-2020 21:56:40
04-Feb-2020 21:56:40 895) phpbb_tests_tree_nestedset_forum_move_test::test_change_parent with data set #2 ('Move single child down', 6, 7, true, array(array(1, 0, 1, 6, 'a:0:{}'), array(2, 1, 2, 3, 'a:0:{}'), array(3, 1, 4, 5, 'a:0:{}'), array(4, 0, 7, 10, 'a:0:{}'), array(5, 4, 8, 9, 'a:0:{}'), array(7, 0, 11, 22, 'a:0:{}'), array(8, 7, 12, 13, 'a:0:{}'), array(9, 7, 14, 17, 'a:0:{}'), array(10, 9, 15, 16, 'a:0:{}'), array(11, 7, 18, 19, 'a:0:{}'), array(6, 7, 20, 21, '')))
04-Feb-2020 21:56:40 Error: Call to a member function modifyLimitQuery() on null
04-Feb-2020 21:56:40
04-Feb-2020 21:56:40 /data/phpBB/phpbb/db/driver/doctrine.php:154
04-Feb-2020 21:56:40 /data/phpBB/phpbb/db/tools/tools.php:233
04-Feb-2020 21:56:40 /data/phpBB/phpbb/db/tools/tools.php:253
04-Feb-2020 21:56:40 /data/tests/test_framework/phpbb_database_test_connection_manager.php:387
04-Feb-2020 21:56:40 /data/tests/test_framework/phpbb_database_test_connection_manager.php:181
04-Feb-2020 21:56:40 /data/tests/test_framework/phpbb_database_test_case.php:266
04-Feb-2020 21:56:40 /data/phpBB/vendor/phpunit/dbunit/src/TestCaseTrait.php:189
04-Feb-2020 21:56:40 /data/phpBB/vendor/phpunit/dbunit/src/TestCaseTrait.php:149
04-Feb-2020 21:56:40 /data/phpBB/vendor/phpunit/dbunit/src/TestCaseTrait.php:44
04-Feb-2020 21:56:40 /data/tests/test_framework/phpbb_database_test_case.php:119
04-Feb-2020 21:56:40 /data/tests/tree/nestedset_forum_base.php:53
04-Feb-2020 21:56:40
04-Feb-2020 21:56:40 896) phpbb_tests_tree_nestedset_forum_move_test::test_change_parent with data set #3 ('Move nested children down', 5, 7, true, array(array(1, 0, 1, 6, 'a:0:{}'), array(2, 1, 2, 3, 'a:0:{}'), array(3, 1, 4, 5, 'a:0:{}'), array(4, 0, 7, 8, 'a:0:{}'), array(7, 0, 9, 22, 'a:0:{}'), array(8, 7, 10, 11, 'a:0:{}'), array(9, 7, 12, 15, 'a:0:{}'), array(10, 9, 13, 14, 'a:0:{}'), array(11, 7, 16, 17, 'a:0:{}'), array(5, 7, 18, 21, ''), array(6, 5, 19, 20, '')))
04-Feb-2020 21:56:40 Error: Call to a member function modifyLimitQuery() on null
04-Feb-2020 21:56:40
04-Feb-2020 21:56:40 /data/phpBB/phpbb/db/driver/doctrine.php:154
04-Feb-2020 21:56:40 /data/phpBB/phpbb/db/tools/tools.php:233
04-Feb-2020 21:56:40 /data/phpBB/phpbb/db/tools/tools.php:253
04-Feb-2020 21:56:40 /data/tests/test_framework/phpbb_database_test_connection_manager.php:387
04-Feb-2020 21:56:40 /data/tests/test_framework/phpbb_database_test_connection_manager.php:181
04-Feb-2020 21:56:40 /data/tests/test_framework/phpbb_database_test_case.php:266
04-Feb-2020 21:56:40 /data/phpBB/vendor/phpunit/dbunit/src/TestCaseTrait.php:189
04-Feb-2020 21:56:40 /data/phpBB/vendor/phpunit/dbunit/src/TestCaseTrait.php:149
04-Feb-2020 21:56:40 /data/phpBB/vendor/phpunit/dbunit/src/TestCaseTrait.php:44
04-Feb-2020 21:56:40 /data/tests/test_framework/phpbb_database_test_case.php:119
04-Feb-2020 21:56:40 /data/tests/tree/nestedset_forum_base.php:53
04-Feb-2020 21:56:40
04-Feb-2020 21:56:40 897) phpbb_tests_tree_nestedset_forum_move_test::test_change_parent with data set #4 ('Move single child to parent 0', 6, 0, true, array(array(1, 0, 1, 6, 'a:0:{}'), array(2, 1, 2, 3, 'a:0:{}'), array(3, 1, 4, 5, 'a:0:{}'), array(4, 0, 7, 10, 'a:0:{}'), array(5, 4, 8, 9, 'a:0:{}'), array(7, 0, 11, 20, 'a:0:{}'), array(8, 7, 12, 13, 'a:0:{}'), array(9, 7, 14, 17, 'a:0:{}'), array(10, 9, 15, 16, 'a:0:{}'), array(11, 7, 18, 19, 'a:0:{}'), array(6, 0, 21, 22, '')))
04-Feb-2020 21:56:40 Error: Call to a member function modifyLimitQuery() on null
04-Feb-2020 21:56:40
04-Feb-2020 21:56:40 /data/phpBB/phpbb/db/driver/doctrine.php:154
04-Feb-2020 21:56:40 /data/phpBB/phpbb/db/tools/tools.php:233
04-Feb-2020 21:56:40 /data/phpBB/phpbb/db/tools/tools.php:253
04-Feb-2020 21:56:40 /data/tests/test_framework/phpbb_database_test_connection_manager.php:387
04-Feb-2020 21:56:40 /data/tests/test_framework/phpbb_database_test_connection_manager.php:181
04-Feb-2020 21:56:40 /data/tests/test_framework/phpbb_database_test_case.php:266
04-Feb-2020 21:56:40 /data/phpBB/vendor/phpunit/dbunit/src/TestCaseTrait.php:189
04-Feb-2020 21:56:40 /data/phpBB/vendor/phpunit/dbunit/src/TestCaseTrait.php:149
04-Feb-2020 21:56:40 /data/phpBB/vendor/phpunit/dbunit/src/TestCaseTrait.php:44
04-Feb-2020 21:56:40 /data/tests/test_framework/phpbb_database_test_case.php:119
04-Feb-2020 21:56:40 /data/tests/tree/nestedset_forum_base.php:53
04-Feb-2020 21:56:40
04-Feb-2020 21:56:40 898) phpbb_tests_tree_nestedset_forum_move_test::test_change_parent with data set #5 ('Move nested children to parent 0', 5, 0, true, array(array(1, 0, 1, 6, 'a:0:{}'), array(2, 1, 2, 3, 'a:0:{}'), array(3, 1, 4, 5, 'a:0:{}'), array(4, 0, 7, 8, 'a:0:{}'), array(7, 0, 9, 18, 'a:0:{}'), array(8, 7, 10, 11, 'a:0:{}'), array(9, 7, 12, 15, 'a:0:{}'), array(10, 9, 13, 14, 'a:0:{}'), array(11, 7, 16, 17, 'a:0:{}'), array(5, 0, 19, 22, ''), array(6, 5, 20, 21, '')))
04-Feb-2020 21:56:40 Error: Call to a member function modifyLimitQuery() on null
04-Feb-2020 21:56:40
04-Feb-2020 21:56:40 /data/phpBB/phpbb/db/driver/doctrine.php:154
04-Feb-2020 21:56:40 /data/phpBB/phpbb/db/tools/tools.php:233
04-Feb-2020 21:56:40 /data/phpBB/phpbb/db/tools/tools.php:253
04-Feb-2020 21:56:40 /data/tests/test_framework/phpbb_database_test_connection_manager.php:387
04-Feb-2020 21:56:40 /data/tests/test_framework/phpbb_database_test_connection_manager.php:181
04-Feb-2020 21:56:40 /data/tests/test_framework/phpbb_database_test_case.php:266
04-Feb-2020 21:56:40 /data/phpBB/vendor/phpunit/dbunit/src/TestCaseTrait.php:189
04-Feb-2020 21:56:40 /data/phpBB/vendor/phpunit/dbunit/src/TestCaseTrait.php:149
04-Feb-2020 21:56:40 /data/phpBB/vendor/phpunit/dbunit/src/TestCaseTrait.php:44
04-Feb-2020 21:56:40 /data/tests/test_framework/phpbb_database_test_case.php:119
04-Feb-2020 21:56:40 /data/tests/tree/nestedset_forum_base.php:53
04-Feb-2020 21:56:40
04-Feb-2020 21:56:40 899) phpbb_tests_tree_nestedset_forum_move_test::test_change_parent_throws_item with data set #0 ('Item 0 does not exist', 0, 5)
04-Feb-2020 21:56:40 Error: Call to a member function modifyLimitQuery() on null
04-Feb-2020 21:56:40
04-Feb-2020 21:56:40 /data/phpBB/phpbb/db/driver/doctrine.php:154
04-Feb-2020 21:56:40 /data/phpBB/phpbb/db/tools/tools.php:233
04-Feb-2020 21:56:40 /data/phpBB/phpbb/db/tools/tools.php:253
04-Feb-2020 21:56:40 /data/tests/test_framework/phpbb_database_test_connection_manager.php:387
04-Feb-2020 21:56:40 /data/tests/test_framework/phpbb_database_test_connection_manager.php:181
04-Feb-2020 21:56:40 /data/tests/test_framework/phpbb_database_test_case.php:266
04-Feb-2020 21:56:40 /data/phpBB/vendor/phpunit/dbunit/src/TestCaseTrait.php:189
04-Feb-2020 21:56:40 /data/phpBB/vendor/phpunit/dbunit/src/TestCaseTrait.php:149
04-Feb-2020 21:56:40 /data/phpBB/vendor/phpunit/dbunit/src/TestCaseTrait.php:44
04-Feb-2020 21:56:40 /data/tests/test_framework/phpbb_database_test_case.php:119
04-Feb-2020 21:56:40 /data/tests/tree/nestedset_forum_base.php:53
04-Feb-2020 21:56:40
04-Feb-2020 21:56:40 900) phpbb_tests_tree_nestedset_forum_move_test::test_change_parent_throws_item with data set #1 ('Item does not exist', 200, 5)
04-Feb-2020 21:56:40 Error: Call to a member function modifyLimitQuery() on null
04-Feb-2020 21:56:40
04-Feb-2020 21:56:40 /data/phpBB/phpbb/db/driver/doctrine.php:154
04-Feb-2020 21:56:40 /data/phpBB/phpbb/db/tools/tools.php:233
04-Feb-2020 21:56:40 /data/phpBB/phpbb/db/tools/tools.php:253
04-Feb-2020 21:56:40 /data/tests/test_framework/phpbb_database_test_connection_manager.php:387
04-Feb-2020 21:56:40 /data/tests/test_framework/phpbb_database_test_connection_manager.php:181
04-Feb-2020 21:56:40 /data/tests/test_framework/phpbb_database_test_case.php:266
04-Feb-2020 21:56:40 /data/phpBB/vendor/phpunit/dbunit/src/TestCaseTrait.php:189
04-Feb-2020 21:56:40 /data/phpBB/vendor/phpunit/dbunit/src/TestCaseTrait.php:149
04-Feb-2020 21:56:40 /data/phpBB/vendor/phpunit/dbunit/src/TestCaseTrait.php:44
04-Feb-2020 21:56:40 /data/tests/test_framework/phpbb_database_test_case.php:119
04-Feb-2020 21:56:40 /data/tests/tree/nestedset_forum_base.php:53
04-Feb-2020 21:56:40
04-Feb-2020 21:56:40 901) phpbb_tests_tree_nestedset_forum_move_test::test_change_parent_throws_parent with data set #0 ('New parent is child', 4, 5)
04-Feb-2020 21:56:40 Error: Call to a member function modifyLimitQuery() on null
04-Feb-2020 21:56:40
04-Feb-2020 21:56:40 /data/phpBB/phpbb/db/driver/doctrine.php:154
04-Feb-2020 21:56:40 /data/phpBB/phpbb/db/tools/tools.php:233
04-Feb-2020 21:56:40 /data/phpBB/phpbb/db/tools/tools.php:253
04-Feb-2020 21:56:40 /data/tests/test_framework/phpbb_database_test_connection_manager.php:387
04-Feb-2020 21:56:40 /data/tests/test_framework/phpbb_database_test_connection_manager.php:181
04-Feb-2020 21:56:40 /data/tests/test_framework/phpbb_database_test_case.php:266
04-Feb-2020 21:56:40 /data/phpBB/vendor/phpunit/dbunit/src/TestCaseTrait.php:189
04-Feb-2020 21:56:40 /data/phpBB/vendor/phpunit/dbunit/src/TestCaseTrait.php:149
04-Feb-2020 21:56:40 /data/phpBB/vendor/phpunit/dbunit/src/TestCaseTrait.php:44
04-Feb-2020 21:56:40 /data/tests/test_framework/phpbb_database_test_case.php:119
04-Feb-2020 21:56:40 /data/tests/tree/nestedset_forum_base.php:53
04-Feb-2020 21:56:40
04-Feb-2020 21:56:40 902) phpbb_tests_tree_nestedset_forum_move_test::test_change_parent_throws_parent with data set #1 ('New parent is child 2', 7, 9)
04-Feb-2020 21:56:40 Error: Call to a member function modifyLimitQuery() on null
04-Feb-2020 21:56:40
04-Feb-2020 21:56:40 /data/phpBB/phpbb/db/driver/doctrine.php:154
04-Feb-2020 21:56:40 /data/phpBB/phpbb/db/tools/tools.php:233
04-Feb-2020 21:56:40 /data/phpBB/phpbb/db/tools/tools.php:253
04-Feb-2020 21:56:40 /data/tests/test_framework/phpbb_database_test_connection_manager.php:387
04-Feb-2020 21:56:40 /data/tests/test_framework/phpbb_database_test_connection_manager.php:181
04-Feb-2020 21:56:40 /data/tests/test_framework/phpbb_database_test_case.php:266
04-Feb-2020 21:56:40 /data/phpBB/vendor/phpunit/dbunit/src/TestCaseTrait.php:189
04-Feb-2020 21:56:40 /data/phpBB/vendor/phpunit/dbunit/src/TestCaseTrait.php:149
04-Feb-2020 21:56:40 /data/phpBB/vendor/phpunit/dbunit/src/TestCaseTrait.php:44
04-Feb-2020 21:56:40 /data/tests/test_framework/phpbb_database_test_case.php:119
04-Feb-2020 21:56:40 /data/tests/tree/nestedset_forum_base.php:53
04-Feb-2020 21:56:40
04-Feb-2020 21:56:40 903) phpbb_tests_tree_nestedset_forum_move_test::test_change_parent_throws_parent with data set #2 ('New parent does not exist', 1, 200)
04-Feb-2020 21:56:40 Error: Call to a member function modifyLimitQuery() on null
04-Feb-2020 21:56:40
04-Feb-2020 21:56:40 /data/phpBB/phpbb/db/driver/doctrine.php:154
04-Feb-2020 21:56:40 /data/phpBB/phpbb/db/tools/tools.php:233
04-Feb-2020 21:56:40 /data/phpBB/phpbb/db/tools/tools.php:253
04-Feb-2020 21:56:40 /data/tests/test_framework/phpbb_database_test_connection_manager.php:387
04-Feb-2020 21:56:40 /data/tests/test_framework/phpbb_database_test_connection_manager.php:181
04-Feb-2020 21:56:40 /data/tests/test_framework/phpbb_database_test_case.php:266
04-Feb-2020 21:56:40 /data/phpBB/vendor/phpunit/dbunit/src/TestCaseTrait.php:189
04-Feb-2020 21:56:40 /data/phpBB/vendor/phpunit/dbunit/src/TestCaseTrait.php:149
04-Feb-2020 21:56:40 /data/phpBB/vendor/phpunit/dbunit/src/TestCaseTrait.php:44
04-Feb-2020 21:56:40 /data/tests/test_framework/phpbb_database_test_case.php:119
04-Feb-2020 21:56:40 /data/tests/tree/nestedset_forum_base.php:53
04-Feb-2020 21:56:40
04-Feb-2020 21:56:40 904) phpbb_tests_tree_nestedset_forum_regenerate_test::test_regenerate_left_right_ids with data set #0 ('UPDATE phpbb_forums\n                                SET ...id = 0', false)
04-Feb-2020 21:56:40 Error: Call to a member function modifyLimitQuery() on null
04-Feb-2020 21:56:40
04-Feb-2020 21:56:40 /data/phpBB/phpbb/db/driver/doctrine.php:154
04-Feb-2020 21:56:40 /data/phpBB/phpbb/db/tools/tools.php:233
04-Feb-2020 21:56:40 /data/phpBB/phpbb/db/tools/tools.php:253
04-Feb-2020 21:56:40 /data/tests/test_framework/phpbb_database_test_connection_manager.php:387
04-Feb-2020 21:56:40 /data/tests/test_framework/phpbb_database_test_connection_manager.php:181
04-Feb-2020 21:56:40 /data/tests/test_framework/phpbb_database_test_case.php:266
04-Feb-2020 21:56:40 /data/phpBB/vendor/phpunit/dbunit/src/TestCaseTrait.php:189
04-Feb-2020 21:56:40 /data/phpBB/vendor/phpunit/dbunit/src/TestCaseTrait.php:149
04-Feb-2020 21:56:40 /data/phpBB/vendor/phpunit/dbunit/src/TestCaseTrait.php:44
04-Feb-2020 21:56:40 /data/tests/test_framework/phpbb_database_test_case.php:119
04-Feb-2020 21:56:40 /data/tests/tree/nestedset_forum_base.php:53
04-Feb-2020 21:56:40
04-Feb-2020 21:56:40 905) phpbb_tests_tree_nestedset_forum_regenerate_test::test_regenerate_left_right_ids with data set #1 ('UPDATE phpbb_forums\n                                SET ...d > 12', false)
04-Feb-2020 21:56:40 Error: Call to a member function modifyLimitQuery() on null
04-Feb-2020 21:56:40
04-Feb-2020 21:56:40 /data/phpBB/phpbb/db/driver/doctrine.php:154
04-Feb-2020 21:56:40 /data/phpBB/phpbb/db/tools/tools.php:233
04-Feb-2020 21:56:40 /data/phpBB/phpbb/db/tools/tools.php:253
04-Feb-2020 21:56:40 /data/tests/test_framework/phpbb_database_test_connection_manager.php:387
04-Feb-2020 21:56:40 /data/tests/test_framework/phpbb_database_test_connection_manager.php:181
04-Feb-2020 21:56:40 /data/tests/test_framework/phpbb_database_test_case.php:266
04-Feb-2020 21:56:40 /data/phpBB/vendor/phpunit/dbunit/src/TestCaseTrait.php:189
04-Feb-2020 21:56:40 /data/phpBB/vendor/phpunit/dbunit/src/TestCaseTrait.php:149
04-Feb-2020 21:56:40 /data/phpBB/vendor/phpunit/dbunit/src/TestCaseTrait.php:44
04-Feb-2020 21:56:40 /data/tests/test_framework/phpbb_database_test_case.php:119
04-Feb-2020 21:56:40 /data/tests/tree/nestedset_forum_base.php:53
04-Feb-2020 21:56:40
04-Feb-2020 21:56:40 906) phpbb_tests_tree_nestedset_forum_regenerate_test::test_regenerate_left_right_ids with data set #2 ('UPDATE phpbb_forums\n                                SET ...id * 2', false)
04-Feb-2020 21:56:40 Error: Call to a member function modifyLimitQuery() on null
04-Feb-2020 21:56:40
04-Feb-2020 21:56:40 /data/phpBB/phpbb/db/driver/doctrine.php:154
04-Feb-2020 21:56:40 /data/phpBB/phpbb/db/tools/tools.php:233
04-Feb-2020 21:56:40 /data/phpBB/phpbb/db/tools/tools.php:253
04-Feb-2020 21:56:40 /data/tests/test_framework/phpbb_database_test_connection_manager.php:387
04-Feb-2020 21:56:40 /data/tests/test_framework/phpbb_database_test_connection_manager.php:181
04-Feb-2020 21:56:40 /data/tests/test_framework/phpbb_database_test_case.php:266
04-Feb-2020 21:56:40 /data/phpBB/vendor/phpunit/dbunit/src/TestCaseTrait.php:189
04-Feb-2020 21:56:40 /data/phpBB/vendor/phpunit/dbunit/src/TestCaseTrait.php:149
04-Feb-2020 21:56:40 /data/phpBB/vendor/phpunit/dbunit/src/TestCaseTrait.php:44
04-Feb-2020 21:56:40 /data/tests/test_framework/phpbb_database_test_case.php:119
04-Feb-2020 21:56:40 /data/tests/tree/nestedset_forum_base.php:53
04-Feb-2020 21:56:40
04-Feb-2020 21:56:40 907) phpbb_tests_tree_nestedset_forum_regenerate_test::test_regenerate_left_right_ids with data set #3 ('UPDATE phpbb_forums\n                                SET ...d > 12', false)
04-Feb-2020 21:56:40 Error: Call to a member function modifyLimitQuery() on null
04-Feb-2020 21:56:40
04-Feb-2020 21:56:40 /data/phpBB/phpbb/db/driver/doctrine.php:154
04-Feb-2020 21:56:40 /data/phpBB/phpbb/db/tools/tools.php:233
04-Feb-2020 21:56:40 /data/phpBB/phpbb/db/tools/tools.php:253
04-Feb-2020 21:56:40 /data/tests/test_framework/phpbb_database_test_connection_manager.php:387
04-Feb-2020 21:56:40 /data/tests/test_framework/phpbb_database_test_connection_manager.php:181
04-Feb-2020 21:56:40 /data/tests/test_framework/phpbb_database_test_case.php:266
04-Feb-2020 21:56:40 /data/phpBB/vendor/phpunit/dbunit/src/TestCaseTrait.php:189
04-Feb-2020 21:56:40 /data/phpBB/vendor/phpunit/dbunit/src/TestCaseTrait.php:149
04-Feb-2020 21:56:40 /data/phpBB/vendor/phpunit/dbunit/src/TestCaseTrait.php:44
04-Feb-2020 21:56:40 /data/tests/test_framework/phpbb_database_test_case.php:119
04-Feb-2020 21:56:40 /data/tests/tree/nestedset_forum_base.php:53
04-Feb-2020 21:56:40
04-Feb-2020 21:56:40 908) phpbb_tests_tree_nestedset_forum_regenerate_test::test_regenerate_left_right_ids with data set #4 ('UPDATE phpbb_forums\n                                SET ...id > 4', false)
04-Feb-2020 21:56:40 Error: Call to a member function modifyLimitQuery() on null
04-Feb-2020 21:56:40
04-Feb-2020 21:56:40 /data/phpBB/phpbb/db/driver/doctrine.php:154
04-Feb-2020 21:56:40 /data/phpBB/phpbb/db/tools/tools.php:233
04-Feb-2020 21:56:40 /data/phpBB/phpbb/db/tools/tools.php:253
04-Feb-2020 21:56:40 /data/tests/test_framework/phpbb_database_test_connection_manager.php:387
04-Feb-2020 21:56:40 /data/tests/test_framework/phpbb_database_test_connection_manager.php:181
04-Feb-2020 21:56:40 /data/tests/test_framework/phpbb_database_test_case.php:266
04-Feb-2020 21:56:40 /data/phpBB/vendor/phpunit/dbunit/src/TestCaseTrait.php:189
04-Feb-2020 21:56:40 /data/phpBB/vendor/phpunit/dbunit/src/TestCaseTrait.php:149
04-Feb-2020 21:56:40 /data/phpBB/vendor/phpunit/dbunit/src/TestCaseTrait.php:44
04-Feb-2020 21:56:40 /data/tests/test_framework/phpbb_database_test_case.php:119
04-Feb-2020 21:56:40 /data/tests/tree/nestedset_forum_base.php:53
04-Feb-2020 21:56:40
04-Feb-2020 21:56:40 909) phpbb_tests_tree_nestedset_forum_regenerate_test::test_regenerate_left_right_ids with data set #5 ('UPDATE phpbb_forums\n                                SET ...d > 12', true)
04-Feb-2020 21:56:40 Error: Call to a member function modifyLimitQuery() on null
04-Feb-2020 21:56:40
04-Feb-2020 21:56:40 /data/phpBB/phpbb/db/driver/doctrine.php:154
04-Feb-2020 21:56:40 /data/phpBB/phpbb/db/tools/tools.php:233
04-Feb-2020 21:56:40 /data/phpBB/phpbb/db/tools/tools.php:253
04-Feb-2020 21:56:40 /data/tests/test_framework/phpbb_database_test_connection_manager.php:387
04-Feb-2020 21:56:40 /data/tests/test_framework/phpbb_database_test_connection_manager.php:181
04-Feb-2020 21:56:40 /data/tests/test_framework/phpbb_database_test_case.php:266
04-Feb-2020 21:56:40 /data/phpBB/vendor/phpunit/dbunit/src/TestCaseTrait.php:189
04-Feb-2020 21:56:40 /data/phpBB/vendor/phpunit/dbunit/src/TestCaseTrait.php:149
04-Feb-2020 21:56:40 /data/phpBB/vendor/phpunit/dbunit/src/TestCaseTrait.php:44
04-Feb-2020 21:56:40 /data/tests/test_framework/phpbb_database_test_case.php:119
04-Feb-2020 21:56:40 /data/tests/tree/nestedset_forum_base.php:53
04-Feb-2020 21:56:40
04-Feb-2020 21:56:40 910) pphpbb_tests_tree_nestedset_forum_test::test_forum_constructor with data set #0 (array(array(1, 0, 1, 6), array(2, 1, 2, 3), array(3, 1, 4, 5), array(4, 0, 7, 12), array(5, 4, 8, 11), array(6, 5, 9, 10), array(7, 0, 13, 22), array(8, 7, 14, 15), array(9, 7, 16, 19), array(10, 9, 17, 18), array(11, 7, 20, 21)))
04-Feb-2020 21:56:40 Error: Call to a member function modifyLimitQuery() on null
04-Feb-2020 21:56:40
04-Feb-2020 21:56:40 /data/phpBB/phpbb/db/driver/doctrine.php:154
04-Feb-2020 21:56:40 /data/phpBB/phpbb/db/tools/tools.php:233
04-Feb-2020 21:56:40 /data/phpBB/phpbb/db/tools/tools.php:253
04-Feb-2020 21:56:40 /data/tests/test_framework/phpbb_database_test_connection_manager.php:387
04-Feb-2020 21:56:40 /data/tests/test_framework/phpbb_database_test_connection_manager.php:181
04-Feb-2020 21:56:40 /data/tests/test_framework/phpbb_database_test_case.php:266
04-Feb-2020 21:56:40 /data/phpBB/vendor/phpunit/dbunit/src/TestCaseTrait.php:189
04-Feb-2020 21:56:40 /data/phpBB/vendor/phpunit/dbunit/src/TestCaseTrait.php:149
04-Feb-2020 21:56:40 /data/phpBB/vendor/phpunit/dbunit/src/TestCaseTrait.php:44
04-Feb-2020 21:56:40 /data/tests/test_framework/phpbb_database_test_case.php:119
04-Feb-2020 21:56:40 /data/tests/tree/nestedset_forum_base.php:53
04-Feb-2020 21:56:40
04-Feb-2020 21:56:40 911) pphpbb_tests_tree_nestedset_forum_test::test_get_sql_where with data set #0 ('SELECT forum_id\n                                FROM php...id ASC', 'WHERE', '', array(array(1), array(2), array(3), array(4), array(5), array(6), array(7), array(8), array(9), array(10), array(11)))
04-Feb-2020 21:56:40 Error: Call to a member function modifyLimitQuery() on null
04-Feb-2020 21:56:40
04-Feb-2020 21:56:40 /data/phpBB/phpbb/db/driver/doctrine.php:154
04-Feb-2020 21:56:40 /data/phpBB/phpbb/db/tools/tools.php:233
04-Feb-2020 21:56:40 /data/phpBB/phpbb/db/tools/tools.php:253
04-Feb-2020 21:56:40 /data/tests/test_framework/phpbb_database_test_connection_manager.php:387
04-Feb-2020 21:56:40 /data/tests/test_framework/phpbb_database_test_connection_manager.php:181
04-Feb-2020 21:56:40 /data/tests/test_framework/phpbb_database_test_case.php:266
04-Feb-2020 21:56:40 /data/phpBB/vendor/phpunit/dbunit/src/TestCaseTrait.php:189
04-Feb-2020 21:56:40 /data/phpBB/vendor/phpunit/dbunit/src/TestCaseTrait.php:149
04-Feb-2020 21:56:40 /data/phpBB/vendor/phpunit/dbunit/src/TestCaseTrait.php:44
04-Feb-2020 21:56:40 /data/tests/test_framework/phpbb_database_test_case.php:119
04-Feb-2020 21:56:40 /data/tests/tree/nestedset_forum_base.php:53
04-Feb-2020 21:56:40
04-Feb-2020 21:56:40 912) pphpbb_tests_tree_nestedset_forum_test::test_get_sql_where with data set #1 ('SELECT f.forum_id\n                                FROM p...id ASC', 'WHERE', 'f.', array(array(1), array(2), array(3), array(4), array(5), array(6), array(7), array(8), array(9), array(10), array(11)))
04-Feb-2020 21:56:40 Error: Call to a member function modifyLimitQuery() on null
04-Feb-2020 21:56:40
04-Feb-2020 21:56:40 /data/phpBB/phpbb/db/driver/doctrine.php:154
04-Feb-2020 21:56:40 /data/phpBB/phpbb/db/tools/tools.php:233
04-Feb-2020 21:56:40 /data/phpBB/phpbb/db/tools/tools.php:253
04-Feb-2020 21:56:40 /data/tests/test_framework/phpbb_database_test_connection_manager.php:387
04-Feb-2020 21:56:40 /data/tests/test_framework/phpbb_database_test_connection_manager.php:181
04-Feb-2020 21:56:40 /data/tests/test_framework/phpbb_database_test_case.php:266
04-Feb-2020 21:56:40 /data/phpBB/vendor/phpunit/dbunit/src/TestCaseTrait.php:189
04-Feb-2020 21:56:40 /data/phpBB/vendor/phpunit/dbunit/src/TestCaseTrait.php:149
04-Feb-2020 21:56:40 /data/phpBB/vendor/phpunit/dbunit/src/TestCaseTrait.php:44
04-Feb-2020 21:56:40 /data/tests/test_framework/phpbb_database_test_case.php:119
04-Feb-2020 21:56:40 /data/tests/tree/nestedset_forum_base.php:53
04-Feb-2020 21:56:40
04-Feb-2020 21:56:40 913) pphpbb_tests_tree_nestedset_forum_test::test_get_sql_where with data set #2 ('SELECT forum_id\n                                FROM php...id ASC', 'AND', '', array(array(1), array(2), array(3)))
04-Feb-2020 21:56:40 Error: Call to a member function modifyLimitQuery() on null
04-Feb-2020 21:56:40
04-Feb-2020 21:56:40 /data/phpBB/phpbb/db/driver/doctrine.php:154
04-Feb-2020 21:56:40 /data/phpBB/phpbb/db/tools/tools.php:233
04-Feb-2020 21:56:40 /data/phpBB/phpbb/db/tools/tools.php:253
04-Feb-2020 21:56:40 /data/tests/test_framework/phpbb_database_test_connection_manager.php:387
04-Feb-2020 21:56:40 /data/tests/test_framework/phpbb_database_test_connection_manager.php:181
04-Feb-2020 21:56:40 /data/tests/test_framework/phpbb_database_test_case.php:266
04-Feb-2020 21:56:40 /data/phpBB/vendor/phpunit/dbunit/src/TestCaseTrait.php:189
04-Feb-2020 21:56:40 /data/phpBB/vendor/phpunit/dbunit/src/TestCaseTrait.php:149
04-Feb-2020 21:56:40 /data/phpBB/vendor/phpunit/dbunit/src/TestCaseTrait.php:44
04-Feb-2020 21:56:40 /data/tests/test_framework/phpbb_database_test_case.php:119
04-Feb-2020 21:56:40 /data/tests/tree/nestedset_forum_base.php:53
04-Feb-2020 21:56:40
04-Feb-2020 21:56:40 914) pphpbb_tests_tree_nestedset_forum_test::test_get_sql_where with data set #3 ('SELECT f.forum_id\n                                FROM p...id ASC', 'AND', 'f.', array(array(1), array(2), array(3)))
04-Feb-2020 21:56:40 Error: Call to a member function modifyLimitQuery() on null
04-Feb-2020 21:56:40
04-Feb-2020 21:56:40 /data/phpBB/phpbb/db/driver/doctrine.php:154
04-Feb-2020 21:56:40 /data/phpBB/phpbb/db/tools/tools.php:233
04-Feb-2020 21:56:40 /data/phpBB/phpbb/db/tools/tools.php:253
04-Feb-2020 21:56:40 /data/tests/test_framework/phpbb_database_test_connection_manager.php:387
04-Feb-2020 21:56:40 /data/tests/test_framework/phpbb_database_test_connection_manager.php:181
04-Feb-2020 21:56:40 /data/tests/test_framework/phpbb_database_test_case.php:266
04-Feb-2020 21:56:40 /data/phpBB/vendor/phpunit/dbunit/src/TestCaseTrait.php:189
04-Feb-2020 21:56:40 /data/phpBB/vendor/phpunit/dbunit/src/TestCaseTrait.php:149
04-Feb-2020 21:56:40 /data/phpBB/vendor/phpunit/dbunit/src/TestCaseTrait.php:44
04-Feb-2020 21:56:40 /data/tests/test_framework/phpbb_database_test_case.php:119
04-Feb-2020 21:56:40 /data/tests/tree/nestedset_forum_base.php:53
04-Feb-2020 21:56:40
04-Feb-2020 21:56:40 915) phpbb_user_loader_test::test_load_get
04-Feb-2020 21:56:40 Error: Call to a member function modifyLimitQuery() on null
04-Feb-2020 21:56:40
04-Feb-2020 21:56:40 /data/phpBB/phpbb/db/driver/doctrine.php:154
04-Feb-2020 21:56:40 /data/phpBB/phpbb/db/tools/tools.php:233
04-Feb-2020 21:56:40 /data/phpBB/phpbb/db/tools/tools.php:253
04-Feb-2020 21:56:40 /data/tests/test_framework/phpbb_database_test_connection_manager.php:387
04-Feb-2020 21:56:40 /data/tests/test_framework/phpbb_database_test_connection_manager.php:181
04-Feb-2020 21:56:40 /data/tests/test_framework/phpbb_database_test_case.php:266
04-Feb-2020 21:56:40 /data/phpBB/vendor/phpunit/dbunit/src/TestCaseTrait.php:189
04-Feb-2020 21:56:40 /data/phpBB/vendor/phpunit/dbunit/src/TestCaseTrait.php:149
04-Feb-2020 21:56:40 /data/phpBB/vendor/phpunit/dbunit/src/TestCaseTrait.php:44
04-Feb-2020 21:56:40 /data/tests/test_framework/phpbb_database_test_case.php:119
04-Feb-2020 21:56:40 /data/tests/user/user_loader_test.php:26
04-Feb-2020 21:56:40
04-Feb-2020 21:56:40 916) phpbb_user_loader_test::test_load_get_unloaded
04-Feb-2020 21:56:40 Error: Call to a member function modifyLimitQuery() on null
04-Feb-2020 21:56:40
04-Feb-2020 21:56:40 /data/phpBB/phpbb/db/driver/doctrine.php:154
04-Feb-2020 21:56:40 /data/phpBB/phpbb/db/tools/tools.php:233
04-Feb-2020 21:56:40 /data/phpBB/phpbb/db/tools/tools.php:253
04-Feb-2020 21:56:40 /data/tests/test_framework/phpbb_database_test_connection_manager.php:387
04-Feb-2020 21:56:40 /data/tests/test_framework/phpbb_database_test_connection_manager.php:181
04-Feb-2020 21:56:40 /data/tests/test_framework/phpbb_database_test_case.php:266
04-Feb-2020 21:56:40 /data/phpBB/vendor/phpunit/dbunit/src/TestCaseTrait.php:189
04-Feb-2020 21:56:40 /data/phpBB/vendor/phpunit/dbunit/src/TestCaseTrait.php:149
04-Feb-2020 21:56:40 /data/phpBB/vendor/phpunit/dbunit/src/TestCaseTrait.php:44
04-Feb-2020 21:56:40 /data/tests/test_framework/phpbb_database_test_case.php:119
04-Feb-2020 21:56:40 /data/tests/user/user_loader_test.php:26
04-Feb-2020 21:56:40
04-Feb-2020 21:56:40 917) phpbb_user_loader_test::test_load_user_by_username
04-Feb-2020 21:56:40 Error: Call to a member function modifyLimitQuery() on null
04-Feb-2020 21:56:40
04-Feb-2020 21:56:40 /data/phpBB/phpbb/db/driver/doctrine.php:154
04-Feb-2020 21:56:40 /data/phpBB/phpbb/db/tools/tools.php:233
04-Feb-2020 21:56:40 /data/phpBB/phpbb/db/tools/tools.php:253
04-Feb-2020 21:56:40 /data/tests/test_framework/phpbb_database_test_connection_manager.php:387
04-Feb-2020 21:56:40 /data/tests/test_framework/phpbb_database_test_connection_manager.php:181
04-Feb-2020 21:56:40 /data/tests/test_framework/phpbb_database_test_case.php:266
04-Feb-2020 21:56:40 /data/phpBB/vendor/phpunit/dbunit/src/TestCaseTrait.php:189
04-Feb-2020 21:56:40 /data/phpBB/vendor/phpunit/dbunit/src/TestCaseTrait.php:149
04-Feb-2020 21:56:40 /data/phpBB/vendor/phpunit/dbunit/src/TestCaseTrait.php:44
04-Feb-2020 21:56:40 /data/tests/test_framework/phpbb_database_test_case.php:119
04-Feb-2020 21:56:40 /data/tests/user/user_loader_test.php:26
04-Feb-2020 21:56:40
04-Feb-2020 21:56:40 ERRORS!
04-Feb-2020 21:56:40 Tests: 7287, Assertions: 122987, Errors: 917, Skipped: 240, Incomplete: 1.
04-Feb-2020 21:56:41 Error occurred while running Task 'Run tests(10)' of type com.atlassian.bamboo.plugins.bamboo-docker-plugin:task.docker.cli.
04-Feb-2020 21:56:41 com.atlassian.bamboo.task.TaskException: Failed to execute task
04-Feb-2020 21:56:41         at com.atlassian.bamboo.plugins.docker.service.RunService.execute(RunService.java:75)
04-Feb-2020 21:56:41         at com.atlassian.bamboo.plugins.docker.tasks.cli.DockerCliTask.execute(DockerCliTask.java:70)
04-Feb-2020 21:56:41         at com.atlassian.bamboo.task.TaskExecutorImpl.lambda$executeTasks$3(TaskExecutorImpl.java:285)
04-Feb-2020 21:56:41         at com.atlassian.bamboo.task.TaskExecutorImpl.executeTaskWithPrePostActions(TaskExecutorImpl.java:224)
04-Feb-2020 21:56:41         at com.atlassian.bamboo.task.TaskExecutorImpl.executeTasks(TaskExecutorImpl.java:285)
04-Feb-2020 21:56:41         at com.atlassian.bamboo.task.TaskExecutorImpl.execute(TaskExecutorImpl.java:112)
04-Feb-2020 21:56:41         at com.atlassian.bamboo.build.pipeline.tasks.ExecuteBuildTask.call(ExecuteBuildTask.java:71)
04-Feb-2020 21:56:41         at com.atlassian.bamboo.v2.build.agent.DefaultBuildAgent.executeBuildPhase(DefaultBuildAgent.java:203)
04-Feb-2020 21:56:41         at com.atlassian.bamboo.v2.build.agent.DefaultBuildAgent.build(DefaultBuildAgent.java:175)
04-Feb-2020 21:56:41         at com.atlassian.bamboo.v2.build.agent.BuildAgentControllerImpl.lambda$waitAndPerformBuild$0(BuildAgentControllerImpl.java:122)
04-Feb-2020 21:56:41         at com.atlassian.bamboo.variable.CustomVariableContextImpl.withVariableSubstitutor(CustomVariableContextImpl.java:185)
04-Feb-2020 21:56:41         at com.atlassian.bamboo.v2.build.agent.BuildAgentControllerImpl.waitAndPerformBuild(BuildAgentControllerImpl.java:117)
04-Feb-2020 21:56:41         at com.atlassian.bamboo.v2.build.agent.DefaultBuildAgent$1.run(DefaultBuildAgent.java:126)
04-Feb-2020 21:56:41         at com.atlassian.bamboo.utils.BambooRunnables$1.run(BambooRunnables.java:48)
04-Feb-2020 21:56:41         at com.atlassian.bamboo.security.ImpersonationHelper.runWith(ImpersonationHelper.java:26)
04-Feb-2020 21:56:41         at com.atlassian.bamboo.security.ImpersonationHelper.runWithSystemAuthority(ImpersonationHelper.java:17)
04-Feb-2020 21:56:41         at com.atlassian.bamboo.security.ImpersonationHelper$1.run(ImpersonationHelper.java:41)
04-Feb-2020 21:56:41         at java.lang.Thread.run(Thread.java:748)
04-Feb-2020 21:56:41 Caused by: com.atlassian.bamboo.docker.DockerException: Error running Docker run command
04-Feb-2020 21:56:41         at com.atlassian.bamboo.docker.DockerContainerServiceImpl.run(DockerContainerServiceImpl.java:118)
04-Feb-2020 21:56:41         at sun.reflect.GeneratedMethodAccessor1922.invoke(Unknown Source)
04-Feb-2020 21:56:41         at sun.reflect.DelegatingMethodAccessorImpl.invoke(DelegatingMethodAccessorImpl.java:43)
04-Feb-2020 21:56:41         at java.lang.reflect.Method.invoke(Method.java:498)
04-Feb-2020 21:56:41         at com.atlassian.plugin.util.ContextClassLoaderSettingInvocationHandler.invoke(ContextClassLoaderSettingInvocationHandler.java:26)
04-Feb-2020 21:56:41         at com.sun.proxy.$Proxy401.run(Unknown Source)
04-Feb-2020 21:56:41         at sun.reflect.GeneratedMethodAccessor1922.invoke(Unknown Source)
04-Feb-2020 21:56:41         at sun.reflect.DelegatingMethodAccessorImpl.invoke(DelegatingMethodAccessorImpl.java:43)
04-Feb-2020 21:56:41         at java.lang.reflect.Method.invoke(Method.java:498)
04-Feb-2020 21:56:41         at org.springframework.aop.support.AopUtils.invokeJoinpointUsingReflection(AopUtils.java:302)
04-Feb-2020 21:56:41         at org.eclipse.gemini.blueprint.service.importer.support.internal.aop.ServiceInvoker.doInvoke(ServiceInvoker.java:56)
04-Feb-2020 21:56:41         at org.eclipse.gemini.blueprint.service.importer.support.internal.aop.ServiceInvoker.invoke(ServiceInvoker.java:60)
04-Feb-2020 21:56:41         at org.springframework.aop.framework.ReflectiveMethodInvocation.proceed(ReflectiveMethodInvocation.java:179)
04-Feb-2020 21:56:41         at org.springframework.aop.support.DelegatingIntroductionInterceptor.doProceed(DelegatingIntroductionInterceptor.java:133)
04-Feb-2020 21:56:41         at org.springframework.aop.support.DelegatingIntroductionInterceptor.invoke(DelegatingIntroductionInterceptor.java:121)
04-Feb-2020 21:56:41         at org.springframework.aop.framework.ReflectiveMethodInvocation.proceed(ReflectiveMethodInvocation.java:179)
04-Feb-2020 21:56:41         at org.eclipse.gemini.blueprint.service.util.internal.aop.ServiceTCCLInterceptor.invokeUnprivileged(ServiceTCCLInterceptor.java:70)
04-Feb-2020 21:56:41         at org.eclipse.gemini.blueprint.service.util.internal.aop.ServiceTCCLInterceptor.invoke(ServiceTCCLInterceptor.java:53)
04-Feb-2020 21:56:41         at org.springframework.aop.framework.ReflectiveMethodInvocation.proceed(ReflectiveMethodInvocation.java:179)
04-Feb-2020 21:56:41         at org.eclipse.gemini.blueprint.service.importer.support.LocalBundleContextAdvice.invoke(LocalBundleContextAdvice.java:57)
04-Feb-2020 21:56:41         at org.springframework.aop.framework.ReflectiveMethodInvocation.proceed(ReflectiveMethodInvocation.java:179)
04-Feb-2020 21:56:41         at org.springframework.aop.support.DelegatingIntroductionInterceptor.doProceed(DelegatingIntroductionInterceptor.java:133)
04-Feb-2020 21:56:41         at org.springframework.aop.support.DelegatingIntroductionInterceptor.invoke(DelegatingIntroductionInterceptor.java:121)
04-Feb-2020 21:56:41         at org.springframework.aop.framework.ReflectiveMethodInvocation.proceed(ReflectiveMethodInvocation.java:179)
04-Feb-2020 21:56:41         at org.springframework.aop.framework.JdkDynamicAopProxy.invoke(JdkDynamicAopProxy.java:207)
04-Feb-2020 21:56:41         at com.sun.proxy.$Proxy646.run(Unknown Source)
04-Feb-2020 21:56:41         at com.atlassian.bamboo.plugins.docker.client.DockerCmd.run(DockerCmd.java:51)
04-Feb-2020 21:56:41         at com.atlassian.bamboo.plugins.docker.service.RunService.execute(RunService.java:64)
04-Feb-2020 21:56:41         ... 17 more
04-Feb-2020 21:56:41 Caused by: com.atlassian.utils.process.ProcessException: Error executing /usr/bin/docker run --volume /home/bamboo/xml-data/build-dir/PHPBB3-PR-JOB1:/data --workdir /data --rm -u=991 -t phpbb:php-7.1 /bin/bash -c "phpBB/vendor/bin/phpunit --log-junit build/logs/phpunit.xml"
04-Feb-2020 21:56:41         at com.atlassian.bamboo.docker.DockerContainerServiceImpl.execute(DockerContainerServiceImpl.java:252)
04-Feb-2020 21:56:41         at com.atlassian.bamboo.docker.DockerContainerServiceImpl.run(DockerContainerServiceImpl.java:106)
04-Feb-2020 21:56:41         ... 44 more
04-Feb-2020 21:56:41 Starting task 'Parsing test results produced by script' of type 'com.atlassian.bamboo.plugins.testresultparser:task.testresultparser.junit'
04-Feb-2020 21:56:41 Parsing test results under /home/bamboo/xml-data/build-dir/PHPBB3-PR-JOB1...
04-Feb-2020 21:56:41 Failing task since 917 failing test cases were found.
04-Feb-2020 21:56:41 Finished task 'Parsing test results produced by script' with result: Failed
04-Feb-2020 21:56:41
Substituting variable: ${bamboo.PRnumber} with 5841
04-Feb-2020 21:56:41
Substituting variable: ${bamboo.buildResultsUrl} with https://bamboo.phpbb.com/browse/PHPBB3-PR-JOB1-9881
04-Feb-2020 21:56:41
Substituting variable: ${bamboo.buildResultsUrl} with https://bamboo.phpbb.com/browse/PHPBB3-PR-JOB1-9881
04-Feb-2020 21:56:41 Starting task 'Set result build status' of type 'com.atlassian.bamboo.plugins.scripttask:task.builder.script'
04-Feb-2020 21:56:41
Beginning to execute external process for build 'phpBB3 - Pull Requests - Build and Test Job #9881 (PHPBB3-PR-JOB1-9881)'
... running command line:
/bin/sh /home/bamboo/temp/PHPBB3-PR-JOB1-9881-ScriptBuildTask-546454887593999196.sh
... in: /home/bamboo/xml-data/build-dir/PHPBB3-PR-JOB1
... using extra environment variables:
bamboo_planRepository_1_branch=3.1.x
bamboo_planRepository_1_branchDisplayName=3.1.x
bamboo_repository_revision_number=dc8ff9da28b8ab4ad11c7ea94cca526f17c87fe5
bamboo_PRref=master
bamboo_resultsUrl=https://bamboo.phpbb.com/browse/PHPBB3-PR-JOB1-9881
bamboo_capability_system_builder_command_Git=/usr/bin/git
bamboo_repository_75956235_git_username=bantu
bamboo_build_working_directory=/home/bamboo/xml-data/build-dir/PHPBB3-PR-JOB1
bamboo_planRepository_1_name=phpBB Ascraeus
bamboo_buildKey=PHPBB3-PR-JOB1
bamboo_capability_phpbb_tests=true
bamboo_shortPlanName=Pull Requests
bamboo_capability_system_builder_command_fop=/usr/bin/fop
bamboo_capability_dbms_sqlite_2=true
bamboo_planRepository_name=phpBB Ascraeus
bamboo_PRnumber=5841
bamboo_buildNumber=9881
bamboo_repository_75956235_git_repositoryUrl=https://github.com/phpbb/phpbb.git
bamboo_capability_system_builder_phpunit_PHPUnit=/usr/bin/phpunit
bamboo_shortJobName=Build and Test Job
bamboo_buildResultsUrl=https://bamboo.phpbb.com/browse/PHPBB3-PR-JOB1-9881
bamboo_repository_75956235_branch_name=3.1.x
bamboo_planRepository_repositoryUrl=https://github.com/phpbb/phpbb.git
bamboo_agentId=131073
bamboo_planName=phpBB3 - Pull Requests
bamboo_build_commandline_com_atlassian_bamboo_plugins_scripttask_task_builder_script_7=/bin/sh /home/bamboo/temp/PHPBB3-PR-JOB1-9881-ScriptBuildTask-3341616974061071880.sh
bamboo_shortPlanKey=PR
bamboo_shortJobKey=JOB1
bamboo_capability_dbms_mysql_55=true
bamboo_capability_system_jdk_JDK_1_7_0_65=/usr/lib/jvm/java-7-openjdk-amd64
bamboo_planRepository_revision=dc8ff9da28b8ab4ad11c7ea94cca526f17c87fe5
bamboo_buildTimeStamp=2020-02-04T21:52:13.016Z
bamboo_repository_previous_revision_number=dc8ff9da28b8ab4ad11c7ea94cca526f17c87fe5
bamboo_capability_system_jdk_JDK_1_6_0_16=/usr/lib/jvm/java-6-sun-1.6.0.16
bamboo_capability_system_builder_mvn2_Maven_2=/usr/share/maven2
bamboo_planRepository_previousRevision=dc8ff9da28b8ab4ad11c7ea94cca526f17c87fe5
bamboo_build_commandline_com_atlassian_bamboo_plugins_scripttask_task_builder_script_4=/bin/sh /home/bamboo/temp/PHPBB3-PR-JOB1-9881-ScriptBuildTask-7202822580749623316.sh
bamboo_repository_git_branch=3.1.x
bamboo_buildResultKey=PHPBB3-PR-JOB1-9881
bamboo_repository_branch_name=3.1.x
bamboo_buildPlanName=phpBB3 - Pull Requests - Build and Test Job
bamboo_planRepository_1_revision=dc8ff9da28b8ab4ad11c7ea94cca526f17c87fe5
bamboo_repository_name=phpBB Ascraeus
bamboo_buildFailed=true
bamboo_build_commandline_com_atlassian_bamboo_plugins_bamboo_docker_plugin_task_docker_cli_10=/usr/bin/docker run --volume /home/bamboo/xml-data/build-dir/PHPBB3-PR-JOB1:/data --workdir /data --rm -u=991 -t phpbb:php-7.1 /bin/bash -c phpBB/vendor/bin/phpunit --log-junit build/logs/phpunit.xml
bamboo_capability_system_docker_executable=/usr/bin/docker
bamboo_build_commandline_com_atlassian_bamboo_plugins_bamboo_docker_plugin_task_docker_cli_11=/usr/bin/docker run --volume /home/bamboo/xml-data/build-dir/PHPBB3-PR-JOB1:/data --workdir /data/build --rm -u=991 phpbb:php-7.1 ../phpBB/vendor/bin/phing sniff
bamboo_build_commandline_com_atlassian_bamboo_plugins_bamboo_docker_plugin_task_docker_cli_12=/usr/bin/docker run --volume /home/bamboo/xml-data/build-dir/PHPBB3-PR-JOB1:/data --workdir /data/phpBB --rm -e HOME=/home/bamboo -u=991 phpbb:php-7.1 /bin/bash -c php ../composer.phar install --dev; cd ../build; ../phpBB/vendor/bin/phing clean prepare
bamboo_build_commandline_com_atlassian_bamboo_plugins_bamboo_docker_plugin_task_docker_cli_13=/usr/bin/docker build --force-rm=true --tag=phpbb:php-7.1 /home/bamboo/xml-data/build-dir/PHPBB3-PR-JOB1
bamboo_planRepository_branch=3.1.x
bamboo_agentWorkingDirectory=/home/bamboo/xml-data/build-dir
bamboo_jobFailed=true
bamboo_capability_system_git_executable=/usr/bin/git
bamboo_capability_system_builder_phpunit_PHPUnit_3_4=/usr/bin/phpunit
bamboo_repository_git_username=bantu
bamboo_planRepository_1_previousRevision=dc8ff9da28b8ab4ad11c7ea94cca526f17c87fe5
bamboo_repository_75956235_revision_number=dc8ff9da28b8ab4ad11c7ea94cca526f17c87fe5
bamboo_planRepository_branchDisplayName=3.1.x
bamboo_planRepository_1_type=gitv2
bamboo_planRepository_branchName=3.1.x
bamboo_repository_75956235_previous_revision_number=dc8ff9da28b8ab4ad11c7ea94cca526f17c87fe5
bamboo_capability_system_jdk_JDK=/usr/lib/jvm/java-6-sun
bamboo_plan_storageTag=PHPBB3-PR
bamboo_hg_cache_directory=/home/bamboo/xml-data/build-dir/_hg-repositories-cache
bamboo_planRepository_1_username=bantu
bamboo_planRepository_type=gitv2
bamboo_git_cache_directory=/home/bamboo/xml-data/build-dir/_git-repositories-cache
bamboo_ManualBuildTriggerReason_userName=Build Robot
bamboo_repository_git_repositoryUrl=https://github.com/phpbb/phpbb.git
bamboo_repository_75956235_git_branch=3.1.x
bamboo_capability_system_builder_ant_Ant=/usr/share/ant
bamboo_repository_75956235_name=phpBB Ascraeus
bamboo_tmp_directory=/home/bamboo/temp
bamboo_working_directory=/home/bamboo/xml-data/build-dir/PHPBB3-PR-JOB1
bamboo_planKey=PHPBB3-PR
bamboo_capability_local=true
bamboo_planRepository_1_repositoryUrl=https://github.com/phpbb/phpbb.git
bamboo_planRepository_username=bantu
bamboo_capability_system_jdk_JDK_1_6=/usr/lib/jvm/java-6-sun
bamboo_capability_system_jdk_JDK_1_7=/usr/lib/jvm/java-7-openjdk-amd64
bamboo_planRepository_1_branchName=3.1.x
04-Feb-2020 21:56:42 From https://github.com/phpbb/phpbb
04-Feb-2020 21:56:42 * branch            refs/pull/5841/head -> FETCH_HEAD
04-Feb-2020 21:56:42         <testsuite name="phpbb_attachment_delete_test::test_attachment_delete" tests="9" assertions="0" errors="9" failures="0" skipped="0" time="0.032406">
04-Feb-2020 21:56:42         <testsuite name="phpbb_attachment_delete_test::test_attachment_delete_success" tests="3" assertions="0" errors="3" failures="0" skipped="0" time="0.008050">
04-Feb-2020 21:56:42       <testsuite name="phpbb_attachment_resync_test" file="/data/tests/attachment/resync_test.php" tests="7" assertions="0" errors="7" failures="0" skipped="0" time="0.019405">
04-Feb-2020 21:56:42         <testsuite name="phpbb_attachment_resync_test::test_resync" tests="7" assertions="0" errors="7" failures="0" skipped="0" time="0.019405">
04-Feb-2020 21:56:42         <testsuite name="phpbb_attachment_upload_test::test_upload" tests="3" assertions="0" errors="3" failures="0" skipped="0" time="0.008119">
04-Feb-2020 21:56:42         <testsuite name="phpbb_attachment_upload_test::test_image_upload" tests="6" assertions="0" errors="6" failures="0" skipped="0" time="0.016203">
04-Feb-2020 21:56:42       <testsuite name="phpbb_auth_provider_apache_test" file="/data/tests/auth/provider_apache_test.php" tests="4" assertions="0" errors="4" failures="0" skipped="0" time="0.010744">
04-Feb-2020 21:56:42       <testsuite name="phpbb_auth_provider_db_test" file="/data/tests/auth/provider_db_test.php" tests="1" assertions="0" errors="1" failures="0" skipped="0" time="0.002664">
04-Feb-2020 21:56:42         <testsuite name="phpbb_auth_provider_oauth_token_storage_test::test_retrieveAccessToken" tests="2" assertions="0" errors="2" failures="0" skipped="0" time="0.005967">
04-Feb-2020 21:56:42         <testsuite name="phpbb_auth_provider_oauth_token_storage_test::test_retrieve_access_token_by_session" tests="2" assertions="0" errors="2" failures="0" skipped="0" time="0.005412">
04-Feb-2020 21:56:42         <testsuite name="phpbb_auth_provider_oauth_token_storage_test::test_hasAccessToken" tests="2" assertions="0" errors="2" failures="0" skipped="0" time="0.005500">
04-Feb-2020 21:56:42         <testsuite name="phpbb_auth_provider_oauth_token_storage_test::test_has_access_token_by_session" tests="2" assertions="0" errors="2" failures="0" skipped="0" time="0.005357">
04-Feb-2020 21:56:42         <testsuite name="phpbb_avatar_manager_test::test_get_driver_enabled" tests="7" assertions="7" errors="7" failures="0" skipped="0" time="0.019709">
04-Feb-2020 21:56:42         <testsuite name="phpbb_avatar_manager_test::test_get_driver_all" tests="6" assertions="6" errors="6" failures="0" skipped="0" time="0.018936">
04-Feb-2020 21:56:42         <testsuite name="phpbb_avatar_manager_test::test_clean_row" tests="5" assertions="36" errors="5" failures="0" skipped="0" time="0.014439">
04-Feb-2020 21:56:42         <testsuite name="phpbb_avatar_manager_test::test_handle_avatar_delete" tests="2" assertions="0" errors="2" failures="0" skipped="0" time="0.012763">
04-Feb-2020 21:56:42       <testsuite name="phpbb_cache_memory_test" file="/data/tests/cache/cache_memory_test.php" tests="4" assertions="0" errors="4" failures="0" skipped="0" time="0.010744">
04-Feb-2020 21:56:42         <testsuite name="phpbb_cache_memory_test::test_cache_single_query" tests="4" assertions="0" errors="4" failures="0" skipped="0" time="0.010744">
04-Feb-2020 21:56:42       <testsuite name="phpbb_cache_dummy_driver_test" file="/data/tests/cache/dummy_driver_test.php" tests="4" assertions="0" errors="4" failures="0" skipped="0" time="0.010663">
04-Feb-2020 21:56:42       <testsuite name="phpbb_cache_file_driver_test" file="/data/tests/cache/file_driver_test.php" tests="4" assertions="0" errors="4" failures="0" skipped="0" time="0.010741">
04-Feb-2020 21:56:42       <testsuite name="phpbb_captcha_qa_test" file="/data/tests/captcha/qa_test.php" tests="5" assertions="0" errors="5" failures="0" skipped="0" time="0.013797">
04-Feb-2020 21:56:42         <testsuite name="phpbb_captcha_qa_test::test_acp_get_question_input" tests="3" assertions="0" errors="3" failures="0" skipped="0" time="0.008302">
04-Feb-2020 21:56:42       <testsuite name="phpbb_console_command_cron_run_test" file="/data/tests/console/cron/run_test.php" tests="8" assertions="34" errors="8" failures="0" skipped="0" time="0.025744">
04-Feb-2020 21:56:42       <testsuite name="phpbb_console_user_activate_test" file="/data/tests/console/user/activate_test.php" tests="6" assertions="0" errors="6" failures="0" skipped="0" time="0.025576">
04-Feb-2020 21:56:42         <testsuite name="phpbb_console_user_activate_test::test_activate" tests="6" assertions="0" errors="6" failures="0" skipped="0" time="0.025576">
04-Feb-2020 21:56:42       <testsuite name="phpbb_console_user_add_test" file="/data/tests/console/user/add_test.php" tests="3" assertions="0" errors="3" failures="0" skipped="0" time="0.009154">
04-Feb-2020 21:56:42       <testsuite name="phpbb_console_user_delete_test" file="/data/tests/console/user/delete_test.php" tests="3" assertions="0" errors="3" failures="0" skipped="0" time="0.009258">
04-Feb-2020 21:56:42       <testsuite name="phpbb_console_user_reclean_test" file="/data/tests/console/user/reclean_test.php" tests="1" assertions="0" errors="1" failures="0" skipped="0" time="0.003262">
04-Feb-2020 21:56:42       <testsuite name="phpbb_content_visibility_delete_post_test" file="/data/tests/content_visibility/delete_post_test.php" tests="8" assertions="0" errors="8" failures="0" skipped="0" time="0.023251">
04-Feb-2020 21:56:42         <testsuite name="phpbb_content_visibility_delete_post_test::test_delete_post" tests="8" assertions="0" errors="8" failures="0" skipped="0" time="0.023251">
04-Feb-2020 21:56:42       <testsuite name="phpbb_content_visibility_get_forums_visibility_sql_test" file="/data/tests/content_visibility/get_forums_visibility_sql_test.php" tests="6" assertions="0" errors="6" failures="0" skipped="0" time="0.017992">
04-Feb-2020 21:56:42         <testsuite name="phpbb_content_visibility_get_forums_visibility_sql_test::test_get_forums_visibility_sql" tests="6" assertions="0" errors="6" failures="0" skipped="0" time="0.017992">
04-Feb-2020 21:56:42       <testsuite name="phpbb_content_visibility_get_global_visibility_sql_test" file="/data/tests/content_visibility/get_global_visibility_sql_test.php" tests="6" assertions="0" errors="6" failures="0" skipped="0" time="0.016916">
04-Feb-2020 21:56:42         <testsuite name="phpbb_content_visibility_get_global_visibility_sql_test::test_get_global_visibility_sql" tests="6" assertions="0" errors="6" failures="0" skipped="0" time="0.016916">
04-Feb-2020 21:56:42       <testsuite name="phpbb_content_visibility_get_visibility_sql_test" file="/data/tests/content_visibility/get_visibility_sql_test.php" tests="8" assertions="0" errors="8" failures="0" skipped="0" time="0.022495">
04-Feb-2020 21:56:42         <testsuite name="phpbb_content_visibility_get_visibility_sql_test::test_get_visibility_sql" tests="8" assertions="0" errors="8" failures="0" skipped="0" time="0.022495">
04-Feb-2020 21:56:42       <testsuite name="phpbb_content_visibility_set_post_visibility_test" file="/data/tests/content_visibility/set_post_visibility_test.php" tests="8" assertions="0" errors="8" failures="0" skipped="0" time="0.023354">
04-Feb-2020 21:56:42         <testsuite name="phpbb_content_visibility_set_post_visibility_test::test_set_post_visibility" tests="6" assertions="0" errors="6" failures="0" skipped="0" time="0.017056">
04-Feb-2020 21:56:42         <testsuite name="phpbb_content_visibility_set_post_visibility_test::test_set_post_soft_deleted" tests="2" assertions="0" errors="2" failures="0" skipped="0" time="0.006298">
04-Feb-2020 21:56:42       <testsuite name="phpbb_content_visibility_set_topic_visibility_test" file="/data/tests/content_visibility/set_topic_visibility_test.php" tests="4" assertions="0" errors="4" failures="0" skipped="0" time="0.010962">
04-Feb-2020 21:56:42         <testsuite name="phpbb_content_visibility_set_topic_visibility_test::test_set_topic_visibility" tests="4" assertions="0" errors="4" failures="0" skipped="0" time="0.010962">
04-Feb-2020 21:56:42       <testsuite name="phpbb_dbal_auto_increment_test" file="/data/tests/dbal/auto_increment_test.php" tests="1" assertions="0" errors="1" failures="0" skipped="0" time="0.003158">
04-Feb-2020 21:56:42       <testsuite name="phpbb_boolean_processor_test" file="/data/tests/dbal/boolean_processor_test.php" tests="8" assertions="0" errors="8" failures="0" skipped="0" time="0.021787">
04-Feb-2020 21:56:42       <testsuite name="phpbb_dbal_case_test" file="/data/tests/dbal/case_test.php" tests="3" assertions="0" errors="3" failures="0" skipped="0" time="0.008208">
04-Feb-2020 21:56:42       <testsuite name="phpbb_dbal_concatenate_test" file="/data/tests/dbal/concatenate_test.php" tests="2" assertions="0" errors="2" failures="0" skipped="0" time="0.005445">
04-Feb-2020 21:56:42       <testsuite name="phpbb_dbal_connect_test" file="/data/tests/dbal/connect_test.php" tests="1" assertions="0" errors="1" failures="0" skipped="0" time="0.002809">
04-Feb-2020 21:56:42       <testsuite name="phpbb_dbal_cross_join_test" file="/data/tests/dbal/cross_join_test.php" tests="1" assertions="0" errors="1" failures="0" skipped="0" time="0.002690">
04-Feb-2020 21:56:42       <testsuite name="phpbb_dbal_migrator_tool_config_text_test" file="/data/tests/dbal/migrator_tool_config_text_test.php" tests="6" assertions="0" errors="6" failures="0" skipped="0" time="0.017820">
04-Feb-2020 21:56:42         <testsuite name="phpbb_dbal_migrator_tool_permission_test::test_exists" tests="5" assertions="0" errors="5" failures="0" skipped="0" time="0.014879">
04-Feb-2020 21:56:42         <testsuite name="phpbb_dbal_migrator_tool_permission_test::test_permission_set" tests="3" assertions="0" errors="3" failures="0" skipped="0" time="0.008464">
04-Feb-2020 21:56:42       <testsuite name="phpbb_dbal_order_lower_test" file="/data/tests/dbal/order_lower_test.php" tests="1" assertions="0" errors="1" failures="0" skipped="0" time="0.003097">
04-Feb-2020 21:56:42       <testsuite name="phpbb_dbal_schema_test" file="/data/tests/dbal/schema_test.php" tests="1" assertions="0" errors="1" failures="0" skipped="0" time="0.002780">
04-Feb-2020 21:56:42         <testsuite name="phpbb_dbal_select_test::test_return_on_error_select" tests="2" assertions="0" errors="2" failures="0" skipped="0" time="0.005686">
04-Feb-2020 21:56:42         <testsuite name="phpbb_dbal_select_test::test_fetchrow" tests="4" assertions="0" errors="4" failures="0" skipped="0" time="0.011768">
04-Feb-2020 21:56:42         <testsuite name="phpbb_dbal_select_test::test_fetchrowset" tests="4" assertions="0" errors="4" failures="0" skipped="0" time="0.013372">
04-Feb-2020 21:56:42         <testsuite name="phpbb_dbal_select_test::test_fetchfield" tests="2" assertions="0" errors="2" failures="0" skipped="0" time="0.005966">
04-Feb-2020 21:56:42         <testsuite name="phpbb_dbal_select_test::test_fetchfield_seek" tests="3" assertions="0" errors="3" failures="0" skipped="0" time="0.008806">
04-Feb-2020 21:56:42         <testsuite name="phpbb_dbal_select_test::test_query_limit" tests="9" assertions="0" errors="9" failures="0" skipped="0" time="0.026278">
04-Feb-2020 21:56:42         <testsuite name="phpbb_dbal_select_test::test_like_expression" tests="8" assertions="0" errors="8" failures="0" skipped="0" time="0.023489">
04-Feb-2020 21:56:42         <testsuite name="phpbb_dbal_select_test::test_not_like_expression" tests="8" assertions="0" errors="8" failures="0" skipped="0" time="0.021936">
04-Feb-2020 21:56:42         <testsuite name="phpbb_dbal_select_test::test_build_array" tests="6" assertions="0" errors="6" failures="0" skipped="0" time="0.017114">
04-Feb-2020 21:56:42       <testsuite name="phpbb_dbal_sql_affected_rows_test" file="/data/tests/dbal/sql_affected_rows_test.php" tests="4" assertions="0" errors="4" failures="0" skipped="0" time="0.012931">
04-Feb-2020 21:56:42       <testsuite name="phpbb_dbal_sql_insert_buffer_test" file="/data/tests/dbal/sql_insert_buffer_test.php" tests="6" assertions="0" errors="6" failures="0" skipped="0" time="0.017916">
04-Feb-2020 21:56:42       <testsuite name="phpbb_dbal_write_sequence_test" file="/data/tests/dbal/write_sequence_test.php" tests="1" assertions="0" errors="1" failures="0" skipped="0" time="0.003130">
04-Feb-2020 21:56:42         <testsuite name="phpbb_dbal_write_sequence_test::test_write_sequence" tests="1" assertions="0" errors="1" failures="0" skipped="0" time="0.003130">
04-Feb-2020 21:56:42       <testsuite name="phpbb_dbal_write_test" file="/data/tests/dbal/write_test.php" tests="6" assertions="0" errors="6" failures="0" skipped="0" time="0.016731">
04-Feb-2020 21:56:42         <testsuite name="phpbb_dbal_write_test::test_build_array_insert" tests="2" assertions="0" errors="2" failures="0" skipped="0" time="0.005649">
04-Feb-2020 21:56:42         <testsuite name="phpbb_dbal_write_test::test_update" tests="2" assertions="0" errors="2" failures="0" skipped="0" time="0.005581">
04-Feb-2020 21:56:42         <testsuite name="phpbb_extension_metadata_manager_test::test_validator_non_existing" tests="4" assertions="0" errors="4" failures="0" skipped="0" time="0.012315">
04-Feb-2020 21:56:42         <testsuite name="phpbb_extension_metadata_manager_test::test_validator_invalid" tests="4" assertions="0" errors="4" failures="0" skipped="0" time="0.011536">
04-Feb-2020 21:56:42         <testsuite name="phpbb_extension_metadata_manager_test::test_validator_requirements" tests="7" assertions="0" errors="7" failures="0" skipped="0" time="0.020290">
04-Feb-2020 21:56:42       <testsuite name="phpbb_feed_attachments_base_test" file="/data/tests/feed/attachments_base_test.php" tests="3" assertions="1" errors="3" failures="0" skipped="0" time="0.107519">
04-Feb-2020 21:56:42         <testsuite name="phpbb_feed_attachments_base_test::test_fetch_attachments" tests="3" assertions="1" errors="3" failures="0" skipped="0" time="0.107519">
04-Feb-2020 21:56:42       <testsuite name="phpbb_functions_language_select_test" file="/data/tests/functions/language_select_test.php" tests="4" assertions="0" errors="4" failures="0" skipped="0" time="0.011392">
04-Feb-2020 21:56:42         <testsuite name="phpbb_functions_language_select_test::test_language_select" tests="4" assertions="0" errors="4" failures="0" skipped="0" time="0.011392">
04-Feb-2020 21:56:42         <testsuite name="phpbb_functions_obtain_online_test::test_obtain_guest_count" tests="2" assertions="0" errors="2" failures="0" skipped="0" time="0.005413">
04-Feb-2020 21:56:42         <testsuite name="phpbb_functions_obtain_online_test::test_obtain_users_online" tests="6" assertions="0" errors="6" failures="0" skipped="0" time="0.016349">
04-Feb-2020 21:56:42         <testsuite name="phpbb_functions_obtain_online_test::test_obtain_users_online_string" tests="6" assertions="0" errors="6" failures="0" skipped="0" time="0.016173">
04-Feb-2020 21:56:42       <testsuite name="phpbb_functions_style_select_test" file="/data/tests/functions/style_select_test.php" tests="6" assertions="0" errors="6" failures="0" skipped="0" time="0.016472">
04-Feb-2020 21:56:42         <testsuite name="phpbb_functions_style_select_test::test_style_select" tests="6" assertions="0" errors="6" failures="0" skipped="0" time="0.016472">
04-Feb-2020 21:56:42       <testsuite name="phpbb_functions_user_delete_test" file="/data/tests/functions/user_delete_test.php" tests="1" assertions="0" errors="1" failures="0" skipped="0" time="0.002676">
04-Feb-2020 21:56:42       <testsuite name="phpbb_functions_validate_email_test" file="/data/tests/functions/validate_email_test.php" tests="6" assertions="0" errors="6" failures="0" skipped="0" time="0.016350">
04-Feb-2020 21:56:42         <testsuite name="phpbb_functions_validate_email_test::test_validate_email" tests="6" assertions="0" errors="6" failures="0" skipped="0" time="0.016350">
04-Feb-2020 21:56:42       <testsuite name="phpbb_functions_validate_lang_iso_test" file="/data/tests/functions/validate_lang_iso_test.php" tests="1" assertions="0" errors="1" failures="0" skipped="0" time="0.002780">
04-Feb-2020 21:56:42       <testsuite name="phpbb_functions_validate_user_email_test" file="/data/tests/functions/validate_user_email_test.php" tests="7" assertions="0" errors="7" failures="0" skipped="0" time="0.018968">
04-Feb-2020 21:56:42         <testsuite name="phpbb_functions_validate_user_email_test::test_validate_user_email" tests="7" assertions="0" errors="7" failures="0" skipped="0" time="0.018968">
04-Feb-2020 21:56:42       <testsuite name="phpbb_functions_validate_data_test" file="/data/tests/functions/validate_username_test.php" tests="6" assertions="0" errors="6" failures="0" skipped="0" time="0.016931">
04-Feb-2020 21:56:42         <testsuite name="phpbb_functions_validate_data_test::test_validate_username" tests="6" assertions="0" errors="6" failures="0" skipped="0" time="0.016931">
04-Feb-2020 21:56:42       <testsuite name="phpbb_update_rows_avoiding_duplicates_notify_status_test" file="/data/tests/functions_database_helper/update_rows_avoiding_duplicates_notify_status_test.php" tests="6" assertions="0" errors="6" failures="0" skipped="0" time="0.016540">
04-Feb-2020 21:56:42         <testsuite name="phpbb_update_rows_avoiding_duplicates_notify_status_test::test_update" tests="6" assertions="0" errors="6" failures="0" skipped="0" time="0.016540">
04-Feb-2020 21:56:42       <testsuite name="phpbb_update_rows_avoiding_duplicates_test" file="/data/tests/functions_database_helper/update_rows_avoiding_duplicates_test.php" tests="4" assertions="0" errors="4" failures="0" skipped="0" time="0.010881">
04-Feb-2020 21:56:42         <testsuite name="phpbb_update_rows_avoiding_duplicates_test::test_update" tests="4" assertions="0" errors="4" failures="0" skipped="0" time="0.010881">
04-Feb-2020 21:56:42         <testsuite name="phpbb_functions_user_delete_user_test::test_first_last_post_info" tests="4" assertions="0" errors="4" failures="0" skipped="0" time="0.011274">
04-Feb-2020 21:56:42         <testsuite name="phpbb_functions_user_delete_user_test::test_report_attachment_info" tests="2" assertions="0" errors="2" failures="0" skipped="0" time="0.006311">
04-Feb-2020 21:56:42         <testsuite name="phpbb_functions_user_delete_user_test::test_delete_data" tests="2" assertions="0" errors="2" failures="0" skipped="0" time="0.005825">
04-Feb-2020 21:56:42         <testsuite name="phpbb_functions_user_delete_user_test::test_delete_user_id_data" tests="2" assertions="0" errors="2" failures="0" skipped="0" time="0.006311">
04-Feb-2020 21:56:42       <testsuite name="phpbb_functions_user_group_user_attributes_test" file="/data/tests/functions_user/group_user_attributes_test.php" tests="6" assertions="0" errors="6" failures="0" skipped="0" time="0.016561">
04-Feb-2020 21:56:42         <testsuite name="phpbb_functions_user_group_user_attributes_test::test_group_user_attributes" tests="6" assertions="0" errors="6" failures="0" skipped="0" time="0.016561">
04-Feb-2020 21:56:42         <testsuite name="phpbb_groupposition_legend_test::test_get_group_value" tests="3" assertions="0" errors="3" failures="0" skipped="0" time="0.008753">
04-Feb-2020 21:56:42         <testsuite name="phpbb_groupposition_legend_test::test_add_group" tests="2" assertions="0" errors="2" failures="0" skipped="0" time="0.005405">
04-Feb-2020 21:56:42         <testsuite name="phpbb_groupposition_legend_test::test_delete_group" tests="6" assertions="0" errors="6" failures="0" skipped="0" time="0.017903">
04-Feb-2020 21:56:42         <testsuite name="phpbb_groupposition_legend_test::test_move_up" tests="3" assertions="0" errors="3" failures="0" skipped="0" time="0.008219">
04-Feb-2020 21:56:42         <testsuite name="phpbb_groupposition_legend_test::test_move_down" tests="3" assertions="0" errors="3" failures="0" skipped="0" time="0.008307">
04-Feb-2020 21:56:42         <testsuite name="phpbb_groupposition_legend_test::test_move" tests="7" assertions="0" errors="7" failures="0" skipped="0" time="0.019807">
04-Feb-2020 21:56:42         <testsuite name="phpbb_groupposition_teampage_test::test_get_group_value" tests="3" assertions="0" errors="3" failures="0" skipped="0" time="0.008471">
04-Feb-2020 21:56:42         <testsuite name="phpbb_groupposition_teampage_test::test_add_group_teampage" tests="4" assertions="0" errors="4" failures="0" skipped="0" time="0.011148">
04-Feb-2020 21:56:42         <testsuite name="phpbb_groupposition_teampage_test::test_add_category_teampage" tests="1" assertions="0" errors="1" failures="0" skipped="0" time="0.002736">
04-Feb-2020 21:56:42         <testsuite name="phpbb_groupposition_teampage_test::test_delete_group" tests="3" assertions="0" errors="3" failures="0" skipped="0" time="0.009736">
04-Feb-2020 21:56:42         <testsuite name="phpbb_groupposition_teampage_test::test_delete_teampage" tests="2" assertions="0" errors="2" failures="0" skipped="0" time="0.006065">
04-Feb-2020 21:56:42         <testsuite name="phpbb_groupposition_teampage_test::test_move" tests="9" assertions="0" errors="9" failures="0" skipped="0" time="0.026440">
04-Feb-2020 21:56:42         <testsuite name="phpbb_groupposition_teampage_test::test_move_teampage" tests="9" assertions="0" errors="9" failures="0" skipped="0" time="0.026811">
04-Feb-2020 21:56:42       <testsuite name="phpbb_lock_db_test" file="/data/tests/lock/db_test.php" tests="4" assertions="29" errors="4" failures="0" skipped="0" time="0.008634">
04-Feb-2020 21:56:42       <testsuite name="phpbb_log_add_test" file="/data/tests/log/add_test.php" tests="2" assertions="0" errors="2" failures="0" skipped="0" time="0.005902">
04-Feb-2020 21:56:42       <testsuite name="phpbb_log_delete_test" file="/data/tests/log/delete_test.php" tests="6" assertions="0" errors="6" failures="0" skipped="0" time="0.017597">
04-Feb-2020 21:56:42         <testsuite name="phpbb_log_delete_test::test_log_delete" tests="6" assertions="0" errors="6" failures="0" skipped="0" time="0.017597">
04-Feb-2020 21:56:42       <testsuite name="phpbb_log_function_add_log_test" file="/data/tests/log/function_add_log_test.php" tests="7" assertions="0" errors="7" failures="0" skipped="0" time="0.019890">
04-Feb-2020 21:56:42         <testsuite name="phpbb_log_function_add_log_test::test_add_log_function" tests="7" assertions="0" errors="7" failures="0" skipped="0" time="0.019890">
04-Feb-2020 21:56:42       <testsuite name="phpbb_mcp_post_ip_test" file="/data/tests/mcp/post_ip_test.php" tests="7" assertions="0" errors="7" failures="0" skipped="0" time="0.020901">
04-Feb-2020 21:56:42         <testsuite name="phpbb_mcp_post_ip_test::test_get_num_ips" tests="3" assertions="0" errors="3" failures="0" skipped="0" time="0.009102">
04-Feb-2020 21:56:42         <testsuite name="phpbb_mcp_post_ip_test::test_get_num_posters" tests="4" assertions="0" errors="4" failures="0" skipped="0" time="0.011799">
04-Feb-2020 21:56:42       <testsuite name="phpbb_migrator_convert_timezones_test" file="/data/tests/migrator/convert_timezones_test.php" tests="1" assertions="0" errors="1" failures="0" skipped="0" time="0.003074">
04-Feb-2020 21:56:42       <testsuite name="get_callable_from_step_test" file="/data/tests/migrator/get_callable_from_step_test.php" tests="3" assertions="0" errors="3" failures="0" skipped="0" time="0.008911">
04-Feb-2020 21:56:42         <testsuite name="get_callable_from_step_test::test_get_callable_from_step" tests="3" assertions="0" errors="3" failures="0" skipped="0" time="0.008911">
04-Feb-2020 21:56:42       <testsuite name="phpbb_notification_convert_test" file="/data/tests/notification/convert_test.php" tests="1" assertions="0" errors="1" failures="0" skipped="0" time="0.003757">
04-Feb-2020 21:56:42       <testsuite name="phpbb_notification_group_request_test" file="/data/tests/notification/group_request_test.php" tests="1" assertions="0" errors="1" failures="0" skipped="0" time="0.002827">
04-Feb-2020 21:56:42       <testsuite name="phpbb_notification_test" file="/data/tests/notification/notification_test.php" tests="4" assertions="0" errors="4" failures="0" skipped="0" time="0.010981">
04-Feb-2020 21:56:42       <testsuite name="phpbb_notification_submit_post_type_bookmark_test" file="/data/tests/notification/submit_post_type_bookmark_test.php" tests="2" assertions="0" errors="2" failures="0" skipped="0" time="0.005544">
04-Feb-2020 21:56:42         <testsuite name="phpbb_notification_submit_post_type_bookmark_test::test_submit_post" tests="2" assertions="0" errors="2" failures="0" skipped="0" time="0.005544">
04-Feb-2020 21:56:42       <testsuite name="phpbb_notification_submit_post_type_post_in_queue_test" file="/data/tests/notification/submit_post_type_post_in_queue_test.php" tests="2" assertions="0" errors="2" failures="0" skipped="0" time="0.005721">
04-Feb-2020 21:56:42         <testsuite name="phpbb_notification_submit_post_type_post_in_queue_test::test_submit_post" tests="2" assertions="0" errors="2" failures="0" skipped="0" time="0.005721">
04-Feb-2020 21:56:42       <testsuite name="phpbb_notification_submit_post_type_post_test" file="/data/tests/notification/submit_post_type_post_test.php" tests="2" assertions="0" errors="2" failures="0" skipped="0" time="0.006137">
04-Feb-2020 21:56:42         <testsuite name="phpbb_notification_submit_post_type_post_test::test_submit_post" tests="2" assertions="0" errors="2" failures="0" skipped="0" time="0.006137">
04-Feb-2020 21:56:42       <testsuite name="phpbb_notification_submit_post_type_quote_test" file="/data/tests/notification/submit_post_type_quote_test.php" tests="2" assertions="0" errors="2" failures="0" skipped="0" time="0.005794">
04-Feb-2020 21:56:42         <testsuite name="phpbb_notification_submit_post_type_quote_test::test_submit_post" tests="2" assertions="0" errors="2" failures="0" skipped="0" time="0.005794">
04-Feb-2020 21:56:42       <testsuite name="phpbb_notification_submit_post_type_topic_test" file="/data/tests/notification/submit_post_type_topic_test.php" tests="2" assertions="0" errors="2" failures="0" skipped="0" time="0.005949">
04-Feb-2020 21:56:42         <testsuite name="phpbb_notification_submit_post_type_topic_test::test_submit_post" tests="2" assertions="0" errors="2" failures="0" skipped="0" time="0.005949">
04-Feb-2020 21:56:42       <testsuite name="phpbb_notification_user_list_trim_test" file="/data/tests/notification/user_list_trim_test.php" tests="5" assertions="0" errors="5" failures="0" skipped="0" time="0.013933">
04-Feb-2020 21:56:42         <testsuite name="phpbb_notification_user_list_trim_test::test_user_list_trim" tests="5" assertions="0" errors="5" failures="0" skipped="0" time="0.013933">
04-Feb-2020 21:56:42       <testsuite name="phpbb_privmsgs_delete_user_pms_test" file="/data/tests/privmsgs/delete_user_pms_test.php" tests="3" assertions="0" errors="3" failures="0" skipped="0" time="0.008710">
04-Feb-2020 21:56:42         <testsuite name="phpbb_privmsgs_delete_user_pms_test::test_delete_user_pms" tests="3" assertions="0" errors="3" failures="0" skipped="0" time="0.008710">
04-Feb-2020 21:56:42       <testsuite name="phpbb_session_check_ban_test" file="/data/tests/session/check_ban_test.php" tests="3" assertions="0" errors="3" failures="0" skipped="0" time="0.008926">
04-Feb-2020 21:56:42         <testsuite name="phpbb_session_check_ban_test::test_check_is_banned" tests="3" assertions="0" errors="3" failures="0" skipped="0" time="0.008926">
04-Feb-2020 21:56:42       <testsuite name="phpbb_session_check_isvalid_test" file="/data/tests/session/check_isvalid_test.php" tests="2" assertions="0" errors="2" failures="0" skipped="0" time="0.005592">
04-Feb-2020 21:56:42       <testsuite name="phpbb_session_create_test" file="/data/tests/session/create_test.php" tests="1" assertions="0" errors="1" failures="0" skipped="0" time="0.002744">
04-Feb-2020 21:56:42       <testsuite name="phpbb_session_extract_hostname_test" file="/data/tests/session/extract_hostname_test.php" tests="8" assertions="0" errors="8" failures="0" skipped="0" time="0.022191">
04-Feb-2020 21:56:42         <testsuite name="phpbb_session_extract_hostname_test::test_extract_current_hostname" tests="8" assertions="0" errors="8" failures="0" skipped="0" time="0.022191">
04-Feb-2020 21:56:42       <testsuite name="phpbb_session_extract_page_test" file="/data/tests/session/extract_page_test.php" tests="8" assertions="0" errors="8" failures="0" skipped="0" time="0.101921">
04-Feb-2020 21:56:42         <testsuite name="phpbb_session_extract_page_test::test_extract_current_page" tests="8" assertions="0" errors="8" failures="0" skipped="0" time="0.101921">
04-Feb-2020 21:56:42       <testsuite name="phpbb_session_garbage_collection_test" file="/data/tests/session/garbage_collection_test.php" tests="2" assertions="0" errors="2" failures="0" skipped="0" time="0.005736">
04-Feb-2020 21:56:42       <testsuite name="phpbb_session_login_keys_test" file="/data/tests/session/session_key_test.php" tests="2" assertions="0" errors="2" failures="0" skipped="0" time="0.005572">
04-Feb-2020 21:56:42       <testsuite name="phpbb_session_unset_admin_test" file="/data/tests/session/unset_admin_test.php" tests="1" assertions="0" errors="1" failures="0" skipped="0" time="0.002820">
04-Feb-2020 21:56:42       <testsuite name="phpbb_textreparser_base_test" file="/data/tests/text_reparser/base_test.php" tests="2" assertions="0" errors="2" failures="0" skipped="0" time="0.012621">
04-Feb-2020 21:56:42       <testsuite name="phpbb_text_reparser_manager_test" file="/data/tests/text_reparser/manager_test.php" tests="4" assertions="0" errors="4" failures="0" skipped="0" time="0.011771">
04-Feb-2020 21:56:42       <testsuite name="phpbb_textreparser_contact_admin_info_test" file="/data/tests/text_reparser/plugins/contact_admin_info_test.php" tests="3" assertions="0" errors="3" failures="0" skipped="0" time="0.023720">
04-Feb-2020 21:56:42       <testsuite name="phpbb_textreparser_forum_description_test" file="/data/tests/text_reparser/plugins/forum_description_test.php" tests="5" assertions="0" errors="5" failures="0" skipped="0" time="0.039982">
04-Feb-2020 21:56:42         <testsuite name="phpbb_textreparser_forum_description_test::test_reparse" tests="3" assertions="0" errors="3" failures="0" skipped="0" time="0.023914">
04-Feb-2020 21:56:42       <testsuite name="phpbb_textreparser_forum_rules_test" file="/data/tests/text_reparser/plugins/forum_rules_test.php" tests="5" assertions="0" errors="5" failures="0" skipped="0" time="0.031789">
04-Feb-2020 21:56:42         <testsuite name="phpbb_textreparser_forum_rules_test::test_reparse" tests="3" assertions="0" errors="3" failures="0" skipped="0" time="0.018459">
04-Feb-2020 21:56:42       <testsuite name="phpbb_textreparser_group_description_test" file="/data/tests/text_reparser/plugins/group_description_test.php" tests="5" assertions="0" errors="5" failures="0" skipped="0" time="0.032322">
04-Feb-2020 21:56:42         <testsuite name="phpbb_textreparser_group_description_test::test_reparse" tests="3" assertions="0" errors="3" failures="0" skipped="0" time="0.019665">
04-Feb-2020 21:56:42       <testsuite name="phpbb_textreparser_pm_text_test" file="/data/tests/text_reparser/plugins/pm_text_test.php" tests="5" assertions="0" errors="5" failures="0" skipped="0" time="0.030806">
04-Feb-2020 21:56:42         <testsuite name="phpbb_textreparser_pm_text_test::test_reparse" tests="3" assertions="0" errors="3" failures="0" skipped="0" time="0.018522">
04-Feb-2020 21:56:42       <testsuite name="phpbb_textreparser_poll_option_test" file="/data/tests/text_reparser/plugins/poll_option_test.php" tests="3" assertions="0" errors="3" failures="0" skipped="0" time="0.018966">
04-Feb-2020 21:56:42       <testsuite name="phpbb_textreparser_poll_title_test" file="/data/tests/text_reparser/plugins/poll_title_test.php" tests="5" assertions="0" errors="5" failures="0" skipped="0" time="0.136718">
04-Feb-2020 21:56:42         <testsuite name="phpbb_textreparser_poll_title_test::test_reparse" tests="3" assertions="0" errors="3" failures="0" skipped="0" time="0.019761">
04-Feb-2020 21:56:42       <testsuite name="phpbb_textreparser_post_text_test" file="/data/tests/text_reparser/plugins/post_text_test.php" tests="5" assertions="0" errors="5" failures="0" skipped="0" time="0.032781">
04-Feb-2020 21:56:42         <testsuite name="phpbb_textreparser_post_text_test::test_reparse" tests="3" assertions="0" errors="3" failures="0" skipped="0" time="0.019533">
04-Feb-2020 21:56:42       <testsuite name="phpbb_textreparser_user_signature_test" file="/data/tests/text_reparser/plugins/user_signature_test.php" tests="5" assertions="0" errors="5" failures="0" skipped="0" time="0.033166">
04-Feb-2020 21:56:42         <testsuite name="phpbb_textreparser_user_signature_test::test_reparse" tests="3" assertions="0" errors="3" failures="0" skipped="0" time="0.019153">
04-Feb-2020 21:56:42         <testsuite name="phpbb_tests_tree_nestedset_forum_get_data_test::test_get_path_basic_data" tests="6" assertions="0" errors="6" failures="0" skipped="0" time="0.017843">
04-Feb-2020 21:56:42         <testsuite name="phpbb_tests_tree_nestedset_forum_get_data_test::test_get_all_tree_data" tests="2" assertions="0" errors="2" failures="0" skipped="0" time="0.006074">
04-Feb-2020 21:56:42       <testsuite name="phpbb_tests_tree_nestedset_forum_add_remove_test" file="/data/tests/tree/nestedset_forum_insert_delete_test.php" tests="5" assertions="0" errors="5" failures="0" skipped="0" time="0.015902">
04-Feb-2020 21:56:42         <testsuite name="phpbb_tests_tree_nestedset_forum_add_remove_test::test_delete" tests="2" assertions="0" errors="2" failures="0" skipped="0" time="0.006546">
04-Feb-2020 21:56:42         <testsuite name="phpbb_tests_tree_nestedset_forum_add_remove_test::test_delete_throws" tests="2" assertions="0" errors="2" failures="0" skipped="0" time="0.006287">
04-Feb-2020 21:56:42         <testsuite name="phpbb_tests_tree_nestedset_forum_add_remove_test::test_insert" tests="1" assertions="0" errors="1" failures="0" skipped="0" time="0.003068">
04-Feb-2020 21:56:42         <testsuite name="phpbb_tests_tree_nestedset_forum_move_test::test_move" tests="7" assertions="0" errors="7" failures="0" skipped="0" time="0.022830">
04-Feb-2020 21:56:42         <testsuite name="phpbb_tests_tree_nestedset_forum_move_test::test_move_down" tests="2" assertions="0" errors="2" failures="0" skipped="0" time="0.006333">
04-Feb-2020 21:56:42         <testsuite name="phpbb_tests_tree_nestedset_forum_move_test::test_move_up" tests="2" assertions="0" errors="2" failures="0" skipped="0" time="0.006326">
04-Feb-2020 21:56:42         <testsuite name="phpbb_tests_tree_nestedset_forum_move_test::test_move_children" tests="8" assertions="0" errors="8" failures="0" skipped="0" time="0.024669">
04-Feb-2020 21:56:42         <testsuite name="phpbb_tests_tree_nestedset_forum_move_test::test_move_children_throws_item" tests="2" assertions="0" errors="2" failures="0" skipped="0" time="0.006131">
04-Feb-2020 21:56:42         <testsuite name="phpbb_tests_tree_nestedset_forum_move_test::test_move_children_throws_parent" tests="3" assertions="0" errors="3" failures="0" skipped="0" time="0.009728">
04-Feb-2020 21:56:42         <testsuite name="phpbb_tests_tree_nestedset_forum_move_test::test_change_parent" tests="6" assertions="0" errors="6" failures="0" skipped="0" time="0.018183">
04-Feb-2020 21:56:42         <testsuite name="phpbb_tests_tree_nestedset_forum_move_test::test_change_parent_throws_item" tests="2" assertions="0" errors="2" failures="0" skipped="0" time="0.006050">
04-Feb-2020 21:56:42         <testsuite name="phpbb_tests_tree_nestedset_forum_move_test::test_change_parent_throws_parent" tests="3" assertions="0" errors="3" failures="0" skipped="0" time="0.008929">
04-Feb-2020 21:56:42       <testsuite name="phpbb_tests_tree_nestedset_forum_regenerate_test" file="/data/tests/tree/nestedset_forum_regenerate_test.php" tests="6" assertions="0" errors="6" failures="0" skipped="0" time="0.018841">
04-Feb-2020 21:56:42         <testsuite name="phpbb_tests_tree_nestedset_forum_regenerate_test::test_regenerate_left_right_ids" tests="6" assertions="0" errors="6" failures="0" skipped="0" time="0.018841">
04-Feb-2020 21:56:42       <testsuite name="pphpbb_tests_tree_nestedset_forum_test" file="/data/tests/tree/nestedset_forum_test.php" tests="5" assertions="0" errors="5" failures="0" skipped="0" time="0.015429">
04-Feb-2020 21:56:42         <testsuite name="pphpbb_tests_tree_nestedset_forum_test::test_forum_constructor" tests="1" assertions="0" errors="1" failures="0" skipped="0" time="0.003151">
04-Feb-2020 21:56:42         <testsuite name="pphpbb_tests_tree_nestedset_forum_test::test_get_sql_where" tests="4" assertions="0" errors="4" failures="0" skipped="0" time="0.012278">
04-Feb-2020 21:56:42       <testsuite name="phpbb_user_loader_test" file="/data/tests/user/user_loader_test.php" tests="3" assertions="0" errors="3" failures="0" skipped="0" time="0.009386">
04-Feb-2020 21:56:42   % Total    % Received % Xferd  Average Speed   Time    Time     Time  Current
04-Feb-2020 21:56:42                                  Dload  Upload   Total   Spent    Left  Speed
04-Feb-2020 21:56:42
04-Feb-2020 21:56:42   0     0    0     0    0     0      0      0 --:--:-- --:--:-- --:--:--     0
04-Feb-2020 21:56:42 100   267  100    93  100   174    307    575 --:--:-- --:--:-- --:--:--   578
04-Feb-2020 21:56:42 Finished task 'Set result build status' with result: Success
04-Feb-2020 21:56:42 Running post build plugin 'NCover Results Collector'
04-Feb-2020 21:56:42 Running post build plugin 'Artifact Copier'
04-Feb-2020 21:56:42 Running post build plugin 'npm Cache Cleanup'
04-Feb-2020 21:56:42 Running post build plugin 'Clover Results Collector'
04-Feb-2020 21:56:42 Running post build plugin 'Docker Container Cleanup'
04-Feb-2020 21:56:43 Successfully removed working directory at '/home/bamboo/xml-data/build-dir/PHPBB3-PR-JOB1'
04-Feb-2020 21:56:43 Finalising the build...
04-Feb-2020 21:56:43 Stopping timer.
04-Feb-2020 21:56:43 Build PHPBB3-PR-JOB1-9881 completed.
04-Feb-2020 21:56:43 Running on server: post build plugin 'NCover Results Collector'
04-Feb-2020 21:56:43 Running on server: post build plugin 'Build Hanging Detection Configuration'
04-Feb-2020 21:56:43 Running on server: post build plugin 'Clover Delta Calculator'
04-Feb-2020 21:56:43 Running on server: post build plugin 'Maven Dependencies Postprocessor'
04-Feb-2020 21:56:43 All post build plugins have finished
04-Feb-2020 21:56:43 Generating build results summary...
04-Feb-2020 21:56:50 Saving build results to disk...
04-Feb-2020 21:56:50 Logging substituted variables...
04-Feb-2020 21:56:52 Indexing build results...
04-Feb-2020 21:56:52 Finished building PHPBB3-PR-JOB1-9881.
04-Feb-2020 21:56:52
Substituting variable: ${bamboo.PRnumber} with 5841