Build: #886 failed

Job: PHP 7.3 - SQLite failed

Stages & jobs

  1. Default Stage

Build log

The build generated 408 lines of output. Download or view full build log

16-Feb-2021 21:10:32 Build phpBB3 - Development Docker Master - PHP 7.1 - SQLite #886 (PHPBB3-DDM-JOB1-886) started building on agent Docker
16-Feb-2021 21:10:32
16-Feb-2021 21:10:32 Build working directory is /home/bamboo/xml-data/build-dir/PHPBB3-DDM-JOB1
16-Feb-2021 21:10:32 Executing build phpBB3 - Development Docker Master - PHP 7.1 - SQLite #886 (PHPBB3-DDM-JOB1-886)
16-Feb-2021 21:10:32 Starting task 'Checkout Default Repository' of type 'com.atlassian.bamboo.plugins.vcs:task.vcs.checkout'
16-Feb-2021 21:10:32 Checking out into /home/bamboo/xml-data/build-dir/PHPBB3-DDM-JOB1
16-Feb-2021 21:10:32 Updating source code to revision: 1f5c64185caf6fcd268b646464b5f5e1b79b8208
16-Feb-2021 21:10:33 Fetching 'refs/heads/master' from 'https://github.com/phpbb/phpbb.git'.
16-Feb-2021 21:10:33 Checking out revision 1f5c64185caf6fcd268b646464b5f5e1b79b8208.
16-Feb-2021 21:10:33 Creating local git repository in '/home/bamboo/xml-data/build-dir/PHPBB3-DDM-JOB1/.git'.
16-Feb-2021 21:10:33 Cloning into '/home/bamboo/xml-data/build-dir/PHPBB3-DDM-JOB1'...
16-Feb-2021 21:10:33 done.
16-Feb-2021 21:10:37 Already on 'master'
16-Feb-2021 21:10:37 Updated source code to revision: 1f5c64185caf6fcd268b646464b5f5e1b79b8208
16-Feb-2021 21:10:37 Finished task 'Checkout Default Repository' with result: Success
16-Feb-2021 21:10:37 Running pre-build action: VCS Version Collector
16-Feb-2021 21:10:37
Substituting variable: ${bamboo.working.directory} with /home/bamboo/xml-data/build-dir/PHPBB3-DDM-JOB1
16-Feb-2021 21:10:37 Starting task 'Build image' of type 'com.atlassian.bamboo.plugins.bamboo-docker-plugin:task.docker.cli'
16-Feb-2021 21:10:37
Beginning to execute external process for build 'phpBB3 - Development Docker Master - PHP 7.1 - SQLite #886 (PHPBB3-DDM-JOB1-886)'
... running command line:
/usr/bin/docker build --force-rm=true --tag=phpbb:php-7.1 /home/bamboo/xml-data/build-dir/PHPBB3-DDM-JOB1
... in: /home/bamboo/xml-data/build-dir/PHPBB3-DDM-JOB1
... using extra environment variables:
bamboo_planRepository_1_branch=master
bamboo_repository_75956230_previous_revision_number=cc89d481d8608cfabd79bb6dcf1e9289d32431fb
bamboo_planRepository_1_branchDisplayName=master
bamboo_repository_revision_number=1f5c64185caf6fcd268b646464b5f5e1b79b8208
bamboo_resultsUrl=https://bamboo.phpbb.com/browse/PHPBB3-DDM-JOB1-886
bamboo_capability_system_builder_command_Git=/usr/bin/git
bamboo_build_working_directory=/home/bamboo/xml-data/build-dir/PHPBB3-DDM-JOB1
bamboo_planRepository_1_name=phpBB Master
bamboo_buildKey=PHPBB3-DDM-JOB1
bamboo_shortPlanName=Development Docker Master
bamboo_planRepository_name=phpBB Master
bamboo_repository_75956230_git_branch=master
bamboo_buildNumber=886
bamboo_capability_system_builder_phpunit_PHPUnit=/usr/bin/phpunit
bamboo_repository_75956230_name=phpBB Master
bamboo_shortJobName=PHP 7.1 - SQLite
bamboo_buildResultsUrl=https://bamboo.phpbb.com/browse/PHPBB3-DDM-JOB1-886
bamboo_planRepository_repositoryUrl=https://github.com/phpbb/phpbb.git
bamboo_repository_75956230_git_repositoryUrl=https://github.com/phpbb/phpbb.git
bamboo_agentId=65929217
bamboo_planName=phpBB3 - Development Docker Master
bamboo_shortPlanKey=DDM
bamboo_shortJobKey=JOB1
bamboo_capability_system_jdk_JDK_1_7_0_65=/usr/lib/jvm/java-7-openjdk-amd64
bamboo_planRepository_revision=1f5c64185caf6fcd268b646464b5f5e1b79b8208
bamboo_buildTimeStamp=2021-02-16T20:56:55.955Z
bamboo_repository_previous_revision_number=cc89d481d8608cfabd79bb6dcf1e9289d32431fb
bamboo_capability_system_jdk_JDK_1_6_0_16=/usr/lib/jvm/java-6-sun-1.6.0.16
bamboo_capability_system_builder_mvn2_Maven_2=/usr/share/maven2
bamboo_planRepository_previousRevision=cc89d481d8608cfabd79bb6dcf1e9289d32431fb
bamboo_repository_git_branch=master
bamboo_buildResultKey=PHPBB3-DDM-JOB1-886
bamboo_repository_branch_name=master
bamboo_buildPlanName=phpBB3 - Development Docker Master - PHP 7.1 - SQLite
bamboo_planRepository_1_revision=1f5c64185caf6fcd268b646464b5f5e1b79b8208
bamboo_repository_name=phpBB Master
bamboo_buildFailed=false
bamboo_capability_system_docker_executable=/usr/bin/docker
bamboo_repository_75956230_git_username=
bamboo_planRepository_branch=master
bamboo_agentWorkingDirectory=/home/bamboo/xml-data/build-dir
bamboo_capability_system_git_executable=/usr/bin/git
bamboo_capability_system_builder_phpunit_PHPUnit_3_4=/usr/bin/phpunit
bamboo_repository_git_username=
bamboo_planRepository_1_previousRevision=cc89d481d8608cfabd79bb6dcf1e9289d32431fb
bamboo_repository_75956230_branch_name=master
bamboo_planRepository_branchDisplayName=master
bamboo_planRepository_1_type=gitv2
bamboo_planRepository_branchName=master
bamboo_capability_system_jdk_JDK=/usr/lib/jvm/java-6-sun
bamboo_plan_storageTag=PHPBB3-DDM
bamboo_hg_cache_directory=/home/bamboo/xml-data/build-dir/_hg-repositories-cache
bamboo_planRepository_1_username=
bamboo_planRepository_type=gitv2
bamboo_git_cache_directory=/home/bamboo/xml-data/build-dir/_git-repositories-cache
bamboo_repository_git_repositoryUrl=https://github.com/phpbb/phpbb.git
bamboo_capability_system_builder_ant_Ant=/usr/share/ant
bamboo_repository_75956230_revision_number=1f5c64185caf6fcd268b646464b5f5e1b79b8208
bamboo_tmp_directory=/home/bamboo/temp
bamboo_working_directory=/home/bamboo/xml-data/build-dir/PHPBB3-DDM-JOB1
bamboo_planKey=PHPBB3-DDM
bamboo_capability_local=true
bamboo_planRepository_1_repositoryUrl=https://github.com/phpbb/phpbb.git
bamboo_planRepository_username=
bamboo_capability_system_jdk_JDK_1_6=/usr/lib/jvm/java-6-sun
bamboo_capability_system_jdk_JDK_1_7=/usr/lib/jvm/java-7-openjdk-amd64
bamboo_planRepository_1_branchName=master
16-Feb-2021 21:10:37 Sending build context to Docker daemon  25.13MB
16-Feb-2021 21:10:37
16-Feb-2021 21:10:38 Step 1/5 : FROM php:7.1
16-Feb-2021 21:10:38 ---> 060b5298208c
16-Feb-2021 21:10:38 Step 2/5 : RUN apt-get update && apt-get install -y         git         zlib1g-dev         bzip2         zip         && docker-php-ext-install -j$(nproc) zip
16-Feb-2021 21:10:38 ---> Using cache
16-Feb-2021 21:10:38 ---> 2cbb79fbac44
16-Feb-2021 21:10:38 Step 3/5 : RUN pecl install xdebug-2.6.1
16-Feb-2021 21:10:38 ---> Using cache
16-Feb-2021 21:10:38 ---> 89722eae3058
16-Feb-2021 21:10:38 Step 4/5 : RUN docker-php-ext-enable xdebug
16-Feb-2021 21:10:38 ---> Using cache
16-Feb-2021 21:10:38 ---> 211aebaaec56
16-Feb-2021 21:10:38 Step 5/5 : RUN echo "memory_limit = 1536M" >> /usr/local/etc/php/conf.d/memory.ini
16-Feb-2021 21:10:38 ---> Running in 3b93f8ed3165
16-Feb-2021 21:10:42 Removing intermediate container 3b93f8ed3165
16-Feb-2021 21:10:42 ---> 1c396e7f0181
16-Feb-2021 21:10:43 Successfully built 1c396e7f0181
16-Feb-2021 21:10:43 Successfully tagged phpbb:php-7.1
16-Feb-2021 21:10:43 Built Docker image 'phpbb:php-7.1'
16-Feb-2021 21:10:43 Finished task 'Build image' with result: Success
16-Feb-2021 21:10:43
Substituting variable: ${bamboo.working.directory} with /home/bamboo/xml-data/build-dir/PHPBB3-DDM-JOB1
16-Feb-2021 21:10:43 Starting task 'Run tests' of type 'com.atlassian.bamboo.plugins.bamboo-docker-plugin:task.docker.cli'
16-Feb-2021 21:10:43 Running image name (phpbb:php-7.1)
16-Feb-2021 21:10:43
Beginning to execute external process for build 'phpBB3 - Development Docker Master - PHP 7.1 - SQLite #886 (PHPBB3-DDM-JOB1-886)'
... running command line:
/usr/bin/docker run --volume /home/bamboo/xml-data/build-dir/PHPBB3-DDM-JOB1:/data --workdir /data/phpBB --rm -u=991 -t phpbb:php-7.1 /bin/bash -c php ../composer.phar install --dev; cd ../build; ../phpBB/vendor/bin/phing build
... in: /home/bamboo/xml-data/build-dir/PHPBB3-DDM-JOB1
... using extra environment variables:
bamboo_planRepository_1_branch=master
bamboo_repository_75956230_previous_revision_number=cc89d481d8608cfabd79bb6dcf1e9289d32431fb
bamboo_planRepository_1_branchDisplayName=master
bamboo_repository_revision_number=1f5c64185caf6fcd268b646464b5f5e1b79b8208
bamboo_resultsUrl=https://bamboo.phpbb.com/browse/PHPBB3-DDM-JOB1-886
bamboo_capability_system_builder_command_Git=/usr/bin/git
bamboo_build_working_directory=/home/bamboo/xml-data/build-dir/PHPBB3-DDM-JOB1
bamboo_planRepository_1_name=phpBB Master
bamboo_buildKey=PHPBB3-DDM-JOB1
bamboo_shortPlanName=Development Docker Master
bamboo_planRepository_name=phpBB Master
bamboo_repository_75956230_git_branch=master
bamboo_buildNumber=886
bamboo_capability_system_builder_phpunit_PHPUnit=/usr/bin/phpunit
bamboo_repository_75956230_name=phpBB Master
bamboo_shortJobName=PHP 7.1 - SQLite
bamboo_buildResultsUrl=https://bamboo.phpbb.com/browse/PHPBB3-DDM-JOB1-886
bamboo_planRepository_repositoryUrl=https://github.com/phpbb/phpbb.git
bamboo_repository_75956230_git_repositoryUrl=https://github.com/phpbb/phpbb.git
bamboo_agentId=65929217
bamboo_planName=phpBB3 - Development Docker Master
bamboo_shortPlanKey=DDM
bamboo_shortJobKey=JOB1
bamboo_capability_system_jdk_JDK_1_7_0_65=/usr/lib/jvm/java-7-openjdk-amd64
bamboo_planRepository_revision=1f5c64185caf6fcd268b646464b5f5e1b79b8208
bamboo_buildTimeStamp=2021-02-16T20:56:55.955Z
bamboo_repository_previous_revision_number=cc89d481d8608cfabd79bb6dcf1e9289d32431fb
bamboo_capability_system_jdk_JDK_1_6_0_16=/usr/lib/jvm/java-6-sun-1.6.0.16
bamboo_capability_system_builder_mvn2_Maven_2=/usr/share/maven2
bamboo_planRepository_previousRevision=cc89d481d8608cfabd79bb6dcf1e9289d32431fb
bamboo_repository_git_branch=master
bamboo_buildResultKey=PHPBB3-DDM-JOB1-886
bamboo_repository_branch_name=master
bamboo_buildPlanName=phpBB3 - Development Docker Master - PHP 7.1 - SQLite
bamboo_planRepository_1_revision=1f5c64185caf6fcd268b646464b5f5e1b79b8208
bamboo_build_commandline_com_atlassian_bamboo_plugins_bamboo_docker_plugin_task_docker_cli_3=/usr/bin/docker build --force-rm=true --tag=phpbb:php-7.1 /home/bamboo/xml-data/build-dir/PHPBB3-DDM-JOB1
bamboo_repository_name=phpBB Master
bamboo_buildFailed=false
bamboo_capability_system_docker_executable=/usr/bin/docker
bamboo_repository_75956230_git_username=
bamboo_planRepository_branch=master
bamboo_agentWorkingDirectory=/home/bamboo/xml-data/build-dir
bamboo_capability_system_git_executable=/usr/bin/git
bamboo_capability_system_builder_phpunit_PHPUnit_3_4=/usr/bin/phpunit
bamboo_repository_git_username=
bamboo_planRepository_1_previousRevision=cc89d481d8608cfabd79bb6dcf1e9289d32431fb
bamboo_repository_75956230_branch_name=master
bamboo_planRepository_branchDisplayName=master
bamboo_planRepository_1_type=gitv2
bamboo_planRepository_branchName=master
bamboo_capability_system_jdk_JDK=/usr/lib/jvm/java-6-sun
bamboo_plan_storageTag=PHPBB3-DDM
bamboo_hg_cache_directory=/home/bamboo/xml-data/build-dir/_hg-repositories-cache
bamboo_planRepository_1_username=
bamboo_planRepository_type=gitv2
bamboo_git_cache_directory=/home/bamboo/xml-data/build-dir/_git-repositories-cache
bamboo_repository_git_repositoryUrl=https://github.com/phpbb/phpbb.git
bamboo_capability_system_builder_ant_Ant=/usr/share/ant
bamboo_repository_75956230_revision_number=1f5c64185caf6fcd268b646464b5f5e1b79b8208
bamboo_tmp_directory=/home/bamboo/temp
bamboo_working_directory=/home/bamboo/xml-data/build-dir/PHPBB3-DDM-JOB1
bamboo_planKey=PHPBB3-DDM
bamboo_capability_local=true
bamboo_planRepository_1_repositoryUrl=https://github.com/phpbb/phpbb.git
bamboo_planRepository_username=
bamboo_capability_system_jdk_JDK_1_6=/usr/lib/jvm/java-6-sun
bamboo_capability_system_jdk_JDK_1_7=/usr/lib/jvm/java-7-openjdk-amd64
bamboo_planRepository_1_branchName=master
16-Feb-2021 21:10:43 Cannot create cache directory /.composer/cache/repo/https---repo.packagist.org/, or directory is not writable. Proceeding without cache
16-Feb-2021 21:10:43 Cannot create cache directory /.composer/cache/files/, or directory is not writable. Proceeding without cache
16-Feb-2021 21:10:43 You are using the deprecated option "--dev". It has no effect and will break in Composer 3.
16-Feb-2021 21:10:43 Installing dependencies from lock file (including require-dev)
16-Feb-2021 21:10:43 Verifying lock file contents can be installed on current platform.
16-Feb-2021 21:10:43 Warning: The lock file is not up to date with the latest changes in composer.json. You may be getting outdated dependencies. It is recommended that you run `composer update` or `composer update <package name>`.
16-Feb-2021 21:10:43 Package operations: 90 installs, 0 updates, 0 removals
16-Feb-2021 21:10:43   - Downloading composer/installers (v1.10.0)
16-Feb-2021 21:10:43   - Downloading composer/package-versions-deprecated (1.11.99.1)
16-Feb-2021 21:10:43   - Downloading bantu/ini-get-wrapper (v1.0.1)
16-Feb-2021 21:10:43   - Downloading chita/topological_sort (v3.0.1)
16-Feb-2021 21:10:43   - Downloading symfony/process (v3.4.47)
16-Feb-2021 21:10:43   - Downloading symfony/finder (v3.4.47)
16-Feb-2021 21:10:43   - Downloading symfony/polyfill-ctype (v1.22.0)
16-Feb-2021 21:10:43   - Downloading symfony/filesystem (v3.4.47)
16-Feb-2021 21:10:43   - Downloading symfony/polyfill-mbstring (v1.22.0)
16-Feb-2021 21:10:43   - Downloading psr/log (1.1.3)
16-Feb-2021 21:10:43   - Downloading symfony/debug (v3.4.47)
16-Feb-2021 21:10:43   - Downloading symfony/console (v3.4.47)
16-Feb-2021 21:10:43   - Downloading seld/phar-utils (1.1.1)
16-Feb-2021 21:10:43   - Downloading seld/jsonlint (1.8.3)
16-Feb-2021 21:10:43   - Downloading react/promise (v2.8.0)
16-Feb-2021 21:10:43   - Downloading justinrainbow/json-schema (5.2.10)
16-Feb-2021 21:10:43   - Downloading composer/xdebug-handler (1.4.5)
16-Feb-2021 21:10:43   - Downloading composer/spdx-licenses (1.5.5)
16-Feb-2021 21:10:43   - Downloading composer/semver (3.2.4)
16-Feb-2021 21:10:43   - Downloading composer/ca-bundle (1.2.9)
16-Feb-2021 21:10:43   - Downloading composer/composer (2.0.8)
16-Feb-2021 21:10:43   - Downloading doctrine/event-manager (1.1.1)
16-Feb-2021 21:10:43   - Downloading doctrine/cache (1.10.2)
16-Feb-2021 21:10:43   - Downloading doctrine/dbal (3.0.0)
16-Feb-2021 21:10:43   - Downloading symfony/dom-crawler (v3.4.47)
16-Feb-2021 21:10:43   - Downloading symfony/css-selector (v3.4.47)
16-Feb-2021 21:10:43   - Downloading symfony/browser-kit (v3.4.47)
16-Feb-2021 21:10:43   - Downloading symfony/polyfill-php72 (v1.22.0)
16-Feb-2021 21:10:43   - Downloading symfony/polyfill-intl-normalizer (v1.22.0)
16-Feb-2021 21:10:43   - Downloading symfony/polyfill-intl-idn (v1.22.0)
16-Feb-2021 21:10:43   - Downloading ralouphie/getallheaders (3.0.3)
16-Feb-2021 21:10:43   - Downloading psr/http-message (1.0.1)
16-Feb-2021 21:10:43   - Downloading guzzlehttp/psr7 (1.7.0)
16-Feb-2021 21:10:43   - Downloading guzzlehttp/promises (1.4.0)
16-Feb-2021 21:10:43   - Downloading guzzlehttp/guzzle (6.5.5)
16-Feb-2021 21:10:43   - Downloading fabpot/goutte (v3.2.3)
16-Feb-2021 21:10:43   - Downloading google/recaptcha (1.2.4)
16-Feb-2021 21:10:43   - Downloading symfony/yaml (v3.4.47)
16-Feb-2021 21:10:43   - Downloading laravel/homestead (v7.20.0)
16-Feb-2021 21:10:43   - Downloading lusitanian/oauth (v0.8.11)
16-Feb-2021 21:10:43   - Downloading marc1706/fast-image-size (v1.1.6)
16-Feb-2021 21:10:43   - Downloading patchwork/utf8 (v1.3.3)
16-Feb-2021 21:10:43   - Downloading phing/phing (2.16.3)
16-Feb-2021 21:10:43   - Downloading webmozart/assert (1.9.1)
16-Feb-2021 21:10:43   - Downloading phpdocumentor/reflection-common (2.2.0)
16-Feb-2021 21:10:43   - Downloading phpdocumentor/type-resolver (1.4.0)
16-Feb-2021 21:10:43   - Downloading phpdocumentor/reflection-docblock (5.2.2)
16-Feb-2021 21:10:43   - Downloading sebastian/version (2.0.1)
16-Feb-2021 21:10:43   - Downloading sebastian/resource-operations (2.0.2)
16-Feb-2021 21:10:43   - Downloading sebastian/recursion-context (3.0.1)
16-Feb-2021 21:10:43   - Downloading sebastian/object-reflector (1.1.2)
16-Feb-2021 21:10:43   - Downloading sebastian/object-enumerator (3.0.4)
16-Feb-2021 21:10:43   - Downloading sebastian/global-state (2.0.0)
16-Feb-2021 21:10:43   - Downloading sebastian/exporter (3.1.3)
16-Feb-2021 21:10:43   - Downloading sebastian/environment (4.2.4)
16-Feb-2021 21:10:43   - Downloading sebastian/diff (3.0.3)
16-Feb-2021 21:10:43   - Downloading sebastian/comparator (3.0.3)
16-Feb-2021 21:10:43   - Downloading phpunit/php-timer (2.1.3)
16-Feb-2021 21:10:43   - Downloading phpunit/php-text-template (1.2.1)
16-Feb-2021 21:10:43   - Downloading phpunit/php-file-iterator (2.0.3)
16-Feb-2021 21:10:43   - Downloading theseer/tokenizer (1.2.0)
16-Feb-2021 21:10:43   - Downloading sebastian/code-unit-reverse-lookup (1.0.2)
16-Feb-2021 21:10:43   - Downloading phpunit/php-token-stream (3.1.2)
16-Feb-2021 21:10:43   - Downloading phpunit/php-code-coverage (6.1.4)
16-Feb-2021 21:10:43   - Downloading doctrine/instantiator (1.4.0)
16-Feb-2021 21:10:43   - Downloading phpspec/prophecy (1.12.2)
16-Feb-2021 21:10:43   - Downloading phar-io/version (2.0.1)
16-Feb-2021 21:10:43   - Downloading phar-io/manifest (1.0.3)
16-Feb-2021 21:10:43   - Downloading myclabs/deep-copy (1.10.2)
16-Feb-2021 21:10:43   - Downloading phpunit/phpunit (7.5.20)
16-Feb-2021 21:10:43   - Downloading phpunit/dbunit (4.0.0)
16-Feb-2021 21:10:43   - Downloading psr/container (1.0.0)
16-Feb-2021 21:10:43   - Downloading s9e/sweetdom (2.0.0)
16-Feb-2021 21:10:43   - Downloading s9e/regexp-builder (1.4.4)
16-Feb-2021 21:10:43   - Downloading s9e/text-formatter (2.8.1)
16-Feb-2021 21:10:43   - Downloading squizlabs/php_codesniffer (3.5.8)
16-Feb-2021 21:10:43   - Downloading symfony/config (v3.4.47)
16-Feb-2021 21:10:43   - Downloading symfony/http-foundation (v3.4.47)
16-Feb-2021 21:10:43   - Downloading symfony/event-dispatcher (v3.4.47)
16-Feb-2021 21:10:43   - Downloading symfony/http-kernel (v3.4.47)
16-Feb-2021 21:10:43   - Downloading symfony/dependency-injection (v3.4.47)
16-Feb-2021 21:10:43   - Downloading zendframework/zend-eventmanager (3.2.1)
16-Feb-2021 21:10:43   - Downloading zendframework/zend-code (3.4.1)
16-Feb-2021 21:10:43   - Downloading ocramius/proxy-manager (2.2.3)
16-Feb-2021 21:10:43   - Downloading symfony/proxy-manager-bridge (v3.4.47)
16-Feb-2021 21:10:43   - Downloading symfony/routing (v3.4.47)
16-Feb-2021 21:10:43   - Downloading twig/twig (v2.14.3)
16-Feb-2021 21:10:43   - Downloading symfony/twig-bridge (v3.4.47)
16-Feb-2021 21:10:44   0/88 [>---------------------------]   0%  - Downloading composer/package-versions-deprecated (1.11.99.1)
16-Feb-2021 21:10:45   - Downloading bantu/ini-get-wrapper (v1.0.1)
16-Feb-2021 21:10:45   - Downloading chita/topological_sort (v3.0.1)
16-Feb-2021 21:10:46   - Downloading symfony/process (v3.4.47)
16-Feb-2021 21:10:46   - Downloading symfony/finder (v3.4.47)
16-Feb-2021 21:10:47   - Downloading symfony/polyfill-ctype (v1.22.0)
16-Feb-2021 21:10:47   - Downloading symfony/filesystem (v3.4.47)
16-Feb-2021 21:10:48   - Downloading symfony/polyfill-mbstring (v1.22.0)
16-Feb-2021 21:10:49   - Downloading psr/log (1.1.3)
16-Feb-2021 21:10:49
16-Feb-2021 21:10:49   4/88 [=>--------------------------]   4%
16-Feb-2021 21:10:49   5/88 [=>--------------------------]   5%
16-Feb-2021 21:10:49   7/88 [==>-------------------------]   7%
16-Feb-2021 21:10:49   8/88 [==>-------------------------]   9%
16-Feb-2021 21:10:49   9/88 [==>-------------------------]  10%
16-Feb-2021 21:10:49 10/88 [===>------------------------]  11%
16-Feb-2021 21:10:49 16/88 [=====>----------------------]  18%
16-Feb-2021 21:10:49 17/88 [=====>----------------------]  19%
16-Feb-2021 21:10:49 18/88 [=====>----------------------]  20%
16-Feb-2021 21:10:49 19/88 [======>---------------------]  21%
16-Feb-2021 21:10:49 20/88 [======>---------------------]  22%
16-Feb-2021 21:10:49 21/88 [======>---------------------]  23%
16-Feb-2021 21:10:49 23/88 [=======>--------------------]  26%
16-Feb-2021 21:10:49 24/88 [=======>--------------------]  27%
16-Feb-2021 21:10:49 27/88 [========>-------------------]  30%
16-Feb-2021 21:10:49 28/88 [========>-------------------]  31%
16-Feb-2021 21:10:49 29/88 [=========>------------------]  32%
16-Feb-2021 21:10:49 30/88 [=========>------------------]  34%
16-Feb-2021 21:10:49 31/88 [=========>------------------]  35%
16-Feb-2021 21:10:49 33/88 [==========>-----------------]  37%
16-Feb-2021 21:10:49 34/88 [==========>-----------------]  38%
16-Feb-2021 21:10:49 35/88 [===========>----------------]  39%
16-Feb-2021 21:10:49 38/88 [============>---------------]  43%
16-Feb-2021 21:10:49 39/88 [============>---------------]  44%
16-Feb-2021 21:10:49 40/88 [============>---------------]  45%
16-Feb-2021 21:10:49 41/88 [=============>--------------]  46%
16-Feb-2021 21:10:50 45/88 [==============>-------------]  51%
16-Feb-2021 21:10:50 49/88 [===============>------------]  55%
16-Feb-2021 21:10:50 51/88 [================>-----------]  57%
16-Feb-2021 21:10:50 53/88 [================>-----------]  60%
16-Feb-2021 21:10:50 55/88 [=================>----------]  62%
16-Feb-2021 21:10:50 58/88 [==================>---------]  65%
16-Feb-2021 21:10:50 59/88 [==================>---------]  67%
16-Feb-2021 21:10:50 60/88 [===================>--------]  68%
16-Feb-2021 21:10:50 62/88 [===================>--------]  70%
16-Feb-2021 21:10:50 65/88 [====================>-------]  73%
16-Feb-2021 21:10:50 68/88 [=====================>------]  77%
16-Feb-2021 21:10:50 69/88 [=====================>------]  78%
16-Feb-2021 21:10:50 70/88 [======================>-----]  79%
16-Feb-2021 21:10:50 71/88 [======================>-----]  80%
16-Feb-2021 21:10:50 72/88 [======================>-----]  81%
16-Feb-2021 21:10:50 74/88 [=======================>----]  84%
16-Feb-2021 21:10:50 75/88 [=======================>----]  85%
16-Feb-2021 21:10:50 76/88 [========================>---]  86%
16-Feb-2021 21:10:50 77/88 [========================>---]  87%
16-Feb-2021 21:10:50 79/88 [=========================>--]  89%
16-Feb-2021 21:10:50 80/88 [=========================>--]  90%
16-Feb-2021 21:10:50 81/88 [=========================>--]  92%
16-Feb-2021 21:10:50 82/88 [==========================>-]  93%
16-Feb-2021 21:10:50 83/88 [==========================>-]  94%
16-Feb-2021 21:10:50 84/88 [==========================>-]  95%
16-Feb-2021 21:10:50 85/88 [===========================>]  96%
16-Feb-2021 21:10:50 86/88 [===========================>]  97%
16-Feb-2021 21:10:50 87/88 [===========================>]  98%
16-Feb-2021 21:10:50 88/88 [============================] 100%
16-Feb-2021 21:10:50   - Installing composer/installers (v1.10.0): Extracting archive
16-Feb-2021 21:10:50   - Installing composer/package-versions-deprecated (1.11.99.1): Extracting archive
16-Feb-2021 21:10:50   - Installing bantu/ini-get-wrapper (v1.0.1): Extracting archive
16-Feb-2021 21:10:50   - Installing chita/topological_sort (v3.0.1): Extracting archive
16-Feb-2021 21:10:50   - Installing symfony/process (v3.4.47): Extracting archive
16-Feb-2021 21:10:50   - Installing symfony/finder (v3.4.47): Extracting archive
16-Feb-2021 21:10:51   - Installing symfony/polyfill-ctype (v1.22.0): Extracting archive
16-Feb-2021 21:10:51   - Installing symfony/filesystem (v3.4.47): Extracting archive
16-Feb-2021 21:10:51   - Installing symfony/polyfill-mbstring (v1.22.0): Extracting archive
16-Feb-2021 21:10:51   - Installing psr/log (1.1.3): Extracting archive
16-Feb-2021 21:10:51   - Installing symfony/debug (v3.4.47): Extracting archive
16-Feb-2021 21:10:51   - Installing symfony/console (v3.4.47): Extracting archive
16-Feb-2021 21:10:51   - Installing seld/phar-utils (1.1.1): Extracting archive
16-Feb-2021 21:10:51   - Installing seld/jsonlint (1.8.3): Extracting archive
16-Feb-2021 21:10:51   - Installing react/promise (v2.8.0): Extracting archive
16-Feb-2021 21:10:51   - Installing justinrainbow/json-schema (5.2.10): Extracting archive
16-Feb-2021 21:10:51   - Installing composer/xdebug-handler (1.4.5): Extracting archive
16-Feb-2021 21:10:51   - Installing composer/spdx-licenses (1.5.5): Extracting archive
16-Feb-2021 21:10:51   - Installing composer/semver (3.2.4): Extracting archive
16-Feb-2021 21:10:51   - Installing composer/ca-bundle (1.2.9): Extracting archive
16-Feb-2021 21:10:51   - Installing composer/composer (2.0.8): Extracting archive
16-Feb-2021 21:10:51   - Installing doctrine/event-manager (1.1.1): Extracting archive
16-Feb-2021 21:10:51   - Installing doctrine/cache (1.10.2): Extracting archive
16-Feb-2021 21:10:51   - Installing doctrine/dbal (3.0.0): Extracting archive
16-Feb-2021 21:10:51   - Installing symfony/dom-crawler (v3.4.47): Extracting archive
16-Feb-2021 21:10:51   - Installing symfony/css-selector (v3.4.47): Extracting archive
16-Feb-2021 21:10:51   - Installing symfony/browser-kit (v3.4.47): Extracting archive
16-Feb-2021 21:10:51   - Installing symfony/polyfill-php72 (v1.22.0): Extracting archive
16-Feb-2021 21:10:51   - Installing symfony/polyfill-intl-normalizer (v1.22.0): Extracting archive
16-Feb-2021 21:10:51   - Installing symfony/polyfill-intl-idn (v1.22.0): Extracting archive
16-Feb-2021 21:10:51   - Installing ralouphie/getallheaders (3.0.3): Extracting archive
16-Feb-2021 21:10:51   - Installing psr/http-message (1.0.1): Extracting archive
16-Feb-2021 21:10:51   - Installing guzzlehttp/psr7 (1.7.0): Extracting archive
16-Feb-2021 21:10:51   - Installing guzzlehttp/promises (1.4.0): Extracting archive
16-Feb-2021 21:10:51   - Installing guzzlehttp/guzzle (6.5.5): Extracting archive
16-Feb-2021 21:10:51   - Installing fabpot/goutte (v3.2.3): Extracting archive
16-Feb-2021 21:10:51   - Installing google/recaptcha (1.2.4): Extracting archive
16-Feb-2021 21:10:51   - Installing symfony/yaml (v3.4.47): Extracting archive
16-Feb-2021 21:10:51   - Installing laravel/homestead (v7.20.0): Extracting archive
16-Feb-2021 21:10:51   - Installing lusitanian/oauth (v0.8.11): Extracting archive
16-Feb-2021 21:10:51   - Installing marc1706/fast-image-size (v1.1.6): Extracting archive
16-Feb-2021 21:10:51   - Installing patchwork/utf8 (v1.3.3): Extracting archive
16-Feb-2021 21:10:51   - Installing phing/phing (2.16.3): Extracting archive
16-Feb-2021 21:10:51   - Installing webmozart/assert (1.9.1): Extracting archive
16-Feb-2021 21:10:51   - Installing phpdocumentor/reflection-common (2.2.0): Extracting archive
16-Feb-2021 21:10:51   - Installing phpdocumentor/type-resolver (1.4.0): Extracting archive
16-Feb-2021 21:10:51   - Installing phpdocumentor/reflection-docblock (5.2.2): Extracting archive
16-Feb-2021 21:10:51   - Installing sebastian/version (2.0.1): Extracting archive
16-Feb-2021 21:10:51   - Installing sebastian/resource-operations (2.0.2): Extracting archive
16-Feb-2021 21:10:51   - Installing sebastian/recursion-context (3.0.1): Extracting archive
16-Feb-2021 21:10:51   - Installing sebastian/object-reflector (1.1.2): Extracting archive
16-Feb-2021 21:10:51   - Installing sebastian/object-enumerator (3.0.4): Extracting archive
16-Feb-2021 21:10:51   - Installing sebastian/global-state (2.0.0): Extracting archive
16-Feb-2021 21:10:51   - Installing sebastian/exporter (3.1.3): Extracting archive
16-Feb-2021 21:10:51   - Installing sebastian/environment (4.2.4): Extracting archive
16-Feb-2021 21:10:51   - Installing sebastian/diff (3.0.3): Extracting archive
16-Feb-2021 21:10:51   - Installing sebastian/comparator (3.0.3): Extracting archive
16-Feb-2021 21:10:51   - Installing phpunit/php-timer (2.1.3): Extracting archive
16-Feb-2021 21:10:51   - Installing phpunit/php-text-template (1.2.1): Extracting archive
16-Feb-2021 21:10:51   - Installing phpunit/php-file-iterator (2.0.3): Extracting archive
16-Feb-2021 21:10:51   - Installing theseer/tokenizer (1.2.0): Extracting archive
16-Feb-2021 21:10:51   - Installing sebastian/code-unit-reverse-lookup (1.0.2): Extracting archive
16-Feb-2021 21:10:51   - Installing phpunit/php-token-stream (3.1.2): Extracting archive
16-Feb-2021 21:10:51   - Installing phpunit/php-code-coverage (6.1.4): Extracting archive
16-Feb-2021 21:10:51   - Installing doctrine/instantiator (1.4.0): Extracting archive
16-Feb-2021 21:10:51   - Installing phpspec/prophecy (1.12.2): Extracting archive
16-Feb-2021 21:10:51   - Installing phar-io/version (2.0.1): Extracting archive
16-Feb-2021 21:10:51   - Installing phar-io/manifest (1.0.3): Extracting archive
16-Feb-2021 21:10:51   - Installing myclabs/deep-copy (1.10.2): Extracting archive
16-Feb-2021 21:10:51   - Installing phpunit/phpunit (7.5.20): Extracting archive
16-Feb-2021 21:10:51   - Installing phpunit/dbunit (4.0.0): Extracting archive
16-Feb-2021 21:10:51   - Installing psr/container (1.0.0): Extracting archive
16-Feb-2021 21:10:51   - Installing s9e/sweetdom (2.0.0): Extracting archive
16-Feb-2021 21:10:51   - Installing s9e/regexp-builder (1.4.4): Extracting archive
16-Feb-2021 21:10:51   - Installing s9e/text-formatter (2.8.1): Extracting archive
16-Feb-2021 21:10:51   - Installing squizlabs/php_codesniffer (3.5.8): Extracting archive
16-Feb-2021 21:10:51   - Installing symfony/config (v3.4.47): Extracting archive
16-Feb-2021 21:10:51   - Installing symfony/polyfill-php56 (v1.20.0)
16-Feb-2021 21:10:51   - Installing symfony/polyfill-php70 (v1.20.0)
16-Feb-2021 21:10:51   - Installing symfony/http-foundation (v3.4.47): Extracting archive
16-Feb-2021 21:10:51   - Installing symfony/event-dispatcher (v3.4.47): Extracting archive
16-Feb-2021 21:10:51   - Installing symfony/http-kernel (v3.4.47): Extracting archive
16-Feb-2021 21:10:51   - Installing symfony/dependency-injection (v3.4.47): Extracting archive
16-Feb-2021 21:10:51   - Installing zendframework/zend-eventmanager (3.2.1): Extracting archive
16-Feb-2021 21:10:51   - Installing zendframework/zend-code (3.4.1): Extracting archive
16-Feb-2021 21:10:51   - Installing ocramius/proxy-manager (2.2.3): Extracting archive
16-Feb-2021 21:10:51   - Installing symfony/proxy-manager-bridge (v3.4.47): Extracting archive
16-Feb-2021 21:10:51   - Installing symfony/routing (v3.4.47): Extracting archive
16-Feb-2021 21:10:51   - Installing twig/twig (v2.14.3): Extracting archive
16-Feb-2021 21:10:51   - Installing symfony/twig-bridge (v3.4.47): Extracting archive
16-Feb-2021 21:10:51   0/76 [>---------------------------]   0%
16-Feb-2021 21:10:51 10/76 [===>------------------------]  13%
16-Feb-2021 21:10:51 15/76 [=====>----------------------]  19%
16-Feb-2021 21:10:51 25/76 [=========>------------------]  32%
16-Feb-2021 21:10:52 30/76 [===========>----------------]  39%
16-Feb-2021 21:10:52 40/76 [==============>-------------]  52%
16-Feb-2021 21:10:52 50/76 [==================>---------]  65%
16-Feb-2021 21:10:52 59/76 [=====================>------]  77%
16-Feb-2021 21:10:52 67/76 [========================>---]  88%
16-Feb-2021 21:10:52 75/76 [===========================>]  98%
16-Feb-2021 21:10:52 76/76 [============================] 100%
16-Feb-2021 21:10:53 Package patchwork/utf8 is abandoned, you should avoid using it. Use symfony/polyfill-mbstring or symfony/string instead.
16-Feb-2021 21:10:53 Package zendframework/zend-code is abandoned, you should avoid using it. Use laminas/laminas-code instead.
16-Feb-2021 21:10:53 Package zendframework/zend-eventmanager is abandoned, you should avoid using it. Use laminas/laminas-eventmanager instead.
16-Feb-2021 21:10:53 Package phpunit/dbunit is abandoned, you should avoid using it. No replacement was suggested.
16-Feb-2021 21:10:53 Package phpunit/php-token-stream is abandoned, you should avoid using it. No replacement was suggested.
16-Feb-2021 21:10:53 Generating autoload files
16-Feb-2021 21:10:53 composer/package-versions-deprecated: Generating version class...
16-Feb-2021 21:10:53 composer/package-versions-deprecated: ...done generating version class
16-Feb-2021 21:10:53 52 packages you are using are looking for funding.
16-Feb-2021 21:10:53 Use the `composer fund` command to find out more!
16-Feb-2021 21:10:53
16-Feb-2021 21:10:53 Fatal error: Composer detected issues in your platform: Your Composer dependencies require a PHP version ">= 7.3.0". You are running 7.1.33. in /data/phpBB/vendor/composer/platform_check.php on line 24
16-Feb-2021 21:10:53
16-Feb-2021 21:10:53 Call Stack:
16-Feb-2021 21:10:53     0.0003     351944   1. {main}() /data/phpBB/vendor/phing/phing/bin/phing:0
16-Feb-2021 21:10:53     0.0007     366576   2. require_once('/data/phpBB/vendor/phing/phing/bin/phing.php') /data/phpBB/vendor/phing/phing/bin/phing:14
16-Feb-2021 21:10:53     0.0008     367680   3. require_once('/data/phpBB/vendor/autoload.php') /data/phpBB/vendor/phing/phing/bin/phing.php:14
16-Feb-2021 21:10:53     0.0010     382712   4. ComposerAutoloaderInite9f4c09cec8da3ee726f631461773d48::getLoader() /data/phpBB/vendor/autoload.php:7
16-Feb-2021 21:10:53     0.0012     388176   5. require('/data/phpBB/vendor/composer/platform_check.php') /data/phpBB/vendor/composer/autoload_real.php:25
16-Feb-2021 21:10:53     0.0013     388752   6. trigger_error() /data/phpBB/vendor/composer/platform_check.php:24
16-Feb-2021 21:10:53
16-Feb-2021 21:10:55 Exit code: 255, output: STDOUT:  Package zendframework/zend-code is abandoned, you should avoid using it. Use laminas/laminas-code instead.STDOUT:  Package zendframework/zend-eventmanager is abandoned, you should avoid using it. Use laminas/laminas-eventmanager instead.STDOUT:  Package phpunit/dbunit is abandoned, you should avoid using it. No replacement was suggested.STDOUT:  Package phpunit/php-token-stream is abandoned, you should avoid using it. No replacement was suggested.STDOUT:  Generating autoload filesSTDOUT:  composer/package-versions-deprecated: Generating version class...STDOUT:  composer/package-versions-deprecated: ...done generating version classSTDOUT:  52 packages you are using are looking for funding.STDOUT:  Use the `composer fund` command to find out more!STDOUT:  STDOUT:  Fatal error: Composer detected issues in your platform: Your Composer dependencies require a PHP version ">= 7.3.0". You are running 7.1.33. in /data/phpBB/vendor/composer/platform_check.php on line 24STDOUT:  STDOUT:  Call Stack:STDOUT:      0.0003     351944   1. {main}() /data/phpBB/vendor/phing/phing/bin/phing:0STDOUT:      0.0007     366576   2. require_once('/data/phpBB/vendor/phing/phing/bin/phing.php') /data/phpBB/vendor/phing/phing/bin/phing:14STDOUT:      0.0008     367680   3. require_once('/data/phpBB/vendor/autoload.php') /data/phpBB/vendor/phing/phing/bin/phing.php:14STDOUT:      0.0010     382712   4. ComposerAutoloaderInite9f4c09cec8da3ee726f631461773d48::getLoader() /data/phpBB/vendor/autoload.php:7STDOUT:      0.0012     388176   5. require('/data/phpBB/vendor/composer/platform_check.php') /data/phpBB/vendor/composer/autoload_real.php:25STDOUT:      0.0013     388752   6. trigger_error() /data/phpBB/vendor/composer/platform_check.php:24STDOUT: 
16-Feb-2021 21:10:55 Error occurred while running Task 'Run tests(2)' of type com.atlassian.bamboo.plugins.bamboo-docker-plugin:task.docker.cli.
16-Feb-2021 21:10:55 com.atlassian.bamboo.task.TaskException: Failed to execute task
16-Feb-2021 21:10:55         at com.atlassian.bamboo.plugins.docker.service.RunService.execute(RunService.java:75)
16-Feb-2021 21:10:55         at com.atlassian.bamboo.plugins.docker.tasks.cli.DockerCliTask.execute(DockerCliTask.java:70)
16-Feb-2021 21:10:55         at com.atlassian.bamboo.task.TaskExecutorImpl.lambda$executeTasks$3(TaskExecutorImpl.java:323)
16-Feb-2021 21:10:55         at com.atlassian.bamboo.task.TaskExecutorImpl.executeTaskWithPrePostActions(TaskExecutorImpl.java:256)
16-Feb-2021 21:10:55         at com.atlassian.bamboo.task.TaskExecutorImpl.executeTasks(TaskExecutorImpl.java:323)
16-Feb-2021 21:10:55         at com.atlassian.bamboo.task.TaskExecutorImpl.execute(TaskExecutorImpl.java:116)
16-Feb-2021 21:10:55         at com.atlassian.bamboo.build.pipeline.tasks.ExecuteBuildTask.call(ExecuteBuildTask.java:73)
16-Feb-2021 21:10:55         at com.atlassian.bamboo.v2.build.agent.DefaultBuildAgent.executeBuildPhase(DefaultBuildAgent.java:184)
16-Feb-2021 21:10:55         at com.atlassian.bamboo.v2.build.agent.DefaultBuildAgent.build(DefaultBuildAgent.java:156)
16-Feb-2021 21:10:55         at com.atlassian.bamboo.v2.build.agent.BuildAgentControllerImpl.lambda$waitAndPerformBuild$0(BuildAgentControllerImpl.java:130)
16-Feb-2021 21:10:55         at com.atlassian.bamboo.variable.CustomVariableContextImpl.withVariableSubstitutor(CustomVariableContextImpl.java:118)
16-Feb-2021 21:10:55         at com.atlassian.bamboo.v2.build.agent.BuildAgentControllerImpl.waitAndPerformBuild(BuildAgentControllerImpl.java:124)
16-Feb-2021 21:10:55         at com.atlassian.bamboo.v2.build.agent.DefaultBuildAgent.lambda$start$0(DefaultBuildAgent.java:108)
16-Feb-2021 21:10:55         at com.atlassian.bamboo.utils.BambooRunnables$1.run(BambooRunnables.java:48)
16-Feb-2021 21:10:55         at com.atlassian.bamboo.security.ImpersonationHelper.runWith(ImpersonationHelper.java:26)
16-Feb-2021 21:10:55         at com.atlassian.bamboo.security.ImpersonationHelper.runWithSystemAuthority(ImpersonationHelper.java:17)
16-Feb-2021 21:10:55         at com.atlassian.bamboo.security.ImpersonationHelper$1.run(ImpersonationHelper.java:41)
16-Feb-2021 21:10:55         at java.lang.Thread.run(Thread.java:748)
16-Feb-2021 21:10:55 Caused by: com.atlassian.bamboo.docker.DockerException: Error running Docker run command
16-Feb-2021 21:10:55         at com.atlassian.bamboo.docker.DockerContainerServiceImpl.run(DockerContainerServiceImpl.java:130)
16-Feb-2021 21:10:55         at sun.reflect.GeneratedMethodAccessor3133.invoke(Unknown Source)
16-Feb-2021 21:10:55         at sun.reflect.DelegatingMethodAccessorImpl.invoke(DelegatingMethodAccessorImpl.java:43)
16-Feb-2021 21:10:55         at java.lang.reflect.Method.invoke(Method.java:498)
16-Feb-2021 21:10:55         at com.atlassian.plugin.util.ContextClassLoaderSettingInvocationHandler.invoke(ContextClassLoaderSettingInvocationHandler.java:26)
16-Feb-2021 21:10:55         at com.sun.proxy.$Proxy446.run(Unknown Source)
16-Feb-2021 21:10:55         at sun.reflect.GeneratedMethodAccessor3133.invoke(Unknown Source)
16-Feb-2021 21:10:55         at sun.reflect.DelegatingMethodAccessorImpl.invoke(DelegatingMethodAccessorImpl.java:43)
16-Feb-2021 21:10:55         at java.lang.reflect.Method.invoke(Method.java:498)
16-Feb-2021 21:10:55         at org.springframework.aop.support.AopUtils.invokeJoinpointUsingReflection(AopUtils.java:343)
16-Feb-2021 21:10:55         at org.eclipse.gemini.blueprint.service.importer.support.internal.aop.ServiceInvoker.doInvoke(ServiceInvoker.java:56)
16-Feb-2021 21:10:55         at org.eclipse.gemini.blueprint.service.importer.support.internal.aop.ServiceInvoker.invoke(ServiceInvoker.java:60)
16-Feb-2021 21:10:55         at org.springframework.aop.framework.ReflectiveMethodInvocation.proceed(ReflectiveMethodInvocation.java:186)
16-Feb-2021 21:10:55         at org.springframework.aop.support.DelegatingIntroductionInterceptor.doProceed(DelegatingIntroductionInterceptor.java:136)
16-Feb-2021 21:10:55         at org.springframework.aop.support.DelegatingIntroductionInterceptor.invoke(DelegatingIntroductionInterceptor.java:124)
16-Feb-2021 21:10:55         at org.springframework.aop.framework.ReflectiveMethodInvocation.proceed(ReflectiveMethodInvocation.java:186)
16-Feb-2021 21:10:55         at org.eclipse.gemini.blueprint.service.util.internal.aop.ServiceTCCLInterceptor.invokeUnprivileged(ServiceTCCLInterceptor.java:70)
16-Feb-2021 21:10:55         at org.eclipse.gemini.blueprint.service.util.internal.aop.ServiceTCCLInterceptor.invoke(ServiceTCCLInterceptor.java:53)
16-Feb-2021 21:10:55         at org.springframework.aop.framework.ReflectiveMethodInvocation.proceed(ReflectiveMethodInvocation.java:186)
16-Feb-2021 21:10:55         at org.eclipse.gemini.blueprint.service.importer.support.LocalBundleContextAdvice.invoke(LocalBundleContextAdvice.java:57)
16-Feb-2021 21:10:55         at org.springframework.aop.framework.ReflectiveMethodInvocation.proceed(ReflectiveMethodInvocation.java:186)
16-Feb-2021 21:10:55         at org.springframework.aop.support.DelegatingIntroductionInterceptor.doProceed(DelegatingIntroductionInterceptor.java:136)
16-Feb-2021 21:10:55         at org.springframework.aop.support.DelegatingIntroductionInterceptor.invoke(DelegatingIntroductionInterceptor.java:124)
16-Feb-2021 21:10:55         at org.springframework.aop.framework.ReflectiveMethodInvocation.proceed(ReflectiveMethodInvocation.java:186)
16-Feb-2021 21:10:55         at org.springframework.aop.framework.JdkDynamicAopProxy.invoke(JdkDynamicAopProxy.java:212)
16-Feb-2021 21:10:55         at com.sun.proxy.$Proxy889.run(Unknown Source)
16-Feb-2021 21:10:55         at com.atlassian.bamboo.plugins.docker.client.DockerCmd.run(DockerCmd.java:47)
16-Feb-2021 21:10:55         at com.atlassian.bamboo.plugins.docker.service.RunService.execute(RunService.java:64)
16-Feb-2021 21:10:55         ... 17 more
16-Feb-2021 21:10:55 Caused by: com.atlassian.utils.process.ProcessException: Error executing /usr/bin/docker run --volume /home/bamboo/xml-data/build-dir/PHPBB3-DDM-JOB1:/data --workdir /data/phpBB --rm -u=991 -t phpbb:php-7.1 /bin/bash -c "php ../composer.phar install --dev; cd ../build; ../phpBB/vendor/bin/phing build"
16-Feb-2021 21:10:55         at com.atlassian.bamboo.docker.DockerContainerServiceImpl.execute(DockerContainerServiceImpl.java:302)
16-Feb-2021 21:10:55         at com.atlassian.bamboo.docker.DockerContainerServiceImpl.execute(DockerContainerServiceImpl.java:273)
16-Feb-2021 21:10:55         at com.atlassian.bamboo.docker.DockerContainerServiceImpl.run(DockerContainerServiceImpl.java:107)
16-Feb-2021 21:10:55         ... 44 more
16-Feb-2021 21:10:55 Starting task 'Parsing test results' of type 'com.atlassian.bamboo.plugins.testresultparser:task.testresultparser.junit'
16-Feb-2021 21:10:55 Parsing test results under /home/bamboo/xml-data/build-dir/PHPBB3-DDM-JOB1...
16-Feb-2021 21:10:55 Failing task since test cases were expected but none were found.
16-Feb-2021 21:10:55 Finished task 'Parsing test results' with result: Failed
16-Feb-2021 21:10:55 Running post build plugin 'NCover Results Collector'
16-Feb-2021 21:10:55 Running post build plugin 'Artifact Copier'
16-Feb-2021 21:10:55 Publishing an artifact: Coverage HTML Report
16-Feb-2021 21:10:55 Unable to publish artifact [Coverage HTML Report]: the source directory /home/bamboo/xml-data/build-dir/PHPBB3-DDM-JOB1/build/coverage does not exist.
16-Feb-2021 21:10:55 The artifact hasn't been successfully published after 179.7 μs
16-Feb-2021 21:10:55 Running post build plugin 'npm Cache Cleanup'
16-Feb-2021 21:10:55 Running post build plugin 'Clover Results Collector'
16-Feb-2021 21:10:55 Running post build plugin 'Docker Container Cleanup'
16-Feb-2021 21:10:55 Successfully removed working directory at '/home/bamboo/xml-data/build-dir/PHPBB3-DDM-JOB1'
16-Feb-2021 21:10:55 Finalising the build...
16-Feb-2021 21:10:55 Stopping timer.
16-Feb-2021 21:10:55 Build PHPBB3-DDM-JOB1-886 completed.
16-Feb-2021 21:10:55 Running on server: post build plugin 'NCover Results Collector'
16-Feb-2021 21:10:55 Running on server: post build plugin 'Build Hanging Detection Configuration'
16-Feb-2021 21:10:55 Running on server: post build plugin 'Clover Delta Calculator'
16-Feb-2021 21:10:56 Running on server: post build plugin 'Maven Dependencies Postprocessor'
16-Feb-2021 21:10:56 All post build plugins have finished
16-Feb-2021 21:10:56 Generating build results summary...
16-Feb-2021 21:10:56 Saving build results to disk...
16-Feb-2021 21:10:56 Store variable context...
16-Feb-2021 21:10:56 Indexing build results...
16-Feb-2021 21:10:56 Finished building PHPBB3-DDM-JOB1-886.