Build: #894 failed

Job: PHP 7.3 - SQLite failed

Stages & jobs

  1. Default Stage

Build log

The build generated 281 lines of output. Download or view full build log

01-Mar-2021 20:55:50 Build phpBB3 - Development Docker Master - PHP 7.3 - SQLite #894 (PHPBB3-DDM-JOB1-894) started building on agent Docker
01-Mar-2021 20:55:50
01-Mar-2021 20:55:50 Build working directory is /home/bamboo/xml-data/build-dir/PHPBB3-DDM-JOB1
01-Mar-2021 20:55:50 Executing build phpBB3 - Development Docker Master - PHP 7.3 - SQLite #894 (PHPBB3-DDM-JOB1-894)
01-Mar-2021 20:55:50 Starting task 'Checkout Default Repository' of type 'com.atlassian.bamboo.plugins.vcs:task.vcs.checkout'
01-Mar-2021 20:55:50 Checking out into /home/bamboo/xml-data/build-dir/PHPBB3-DDM-JOB1
01-Mar-2021 20:55:50 Updating source code to revision: 3629b587fa0a6e0e4c4875e78e93a015062def38
01-Mar-2021 20:55:50 Fetching 'refs/heads/master' from 'https://github.com/phpbb/phpbb.git'.
01-Mar-2021 20:55:51 Checking out revision 3629b587fa0a6e0e4c4875e78e93a015062def38.
01-Mar-2021 20:55:51 Creating local git repository in '/home/bamboo/xml-data/build-dir/PHPBB3-DDM-JOB1/.git'.
01-Mar-2021 20:55:51 Cloning into '/home/bamboo/xml-data/build-dir/PHPBB3-DDM-JOB1'...
01-Mar-2021 20:55:51 done.
01-Mar-2021 20:55:53 Already on 'master'
01-Mar-2021 20:55:53 Updated source code to revision: 3629b587fa0a6e0e4c4875e78e93a015062def38
01-Mar-2021 20:55:53 Finished task 'Checkout Default Repository' with result: Success
01-Mar-2021 20:55:53 Running pre-build action: VCS Version Collector
01-Mar-2021 20:55:53
Substituting variable: ${bamboo.working.directory} with /home/bamboo/xml-data/build-dir/PHPBB3-DDM-JOB1
01-Mar-2021 20:55:53 Starting task 'Build image' of type 'com.atlassian.bamboo.plugins.bamboo-docker-plugin:task.docker.cli'
01-Mar-2021 20:55:53
Beginning to execute external process for build 'phpBB3 - Development Docker Master - PHP 7.3 - SQLite #894 (PHPBB3-DDM-JOB1-894)'
... running command line:
/usr/bin/docker build --force-rm=true --tag=phpbb:php-7.3 /home/bamboo/xml-data/build-dir/PHPBB3-DDM-JOB1
... in: /home/bamboo/xml-data/build-dir/PHPBB3-DDM-JOB1
... using extra environment variables:
bamboo_planRepository_1_branch=master
bamboo_repository_75956230_previous_revision_number=3629b587fa0a6e0e4c4875e78e93a015062def38
bamboo_planRepository_1_branchDisplayName=master
bamboo_repository_revision_number=3629b587fa0a6e0e4c4875e78e93a015062def38
bamboo_resultsUrl=https://bamboo.phpbb.com/browse/PHPBB3-DDM-JOB1-894
bamboo_capability_system_builder_command_Git=/usr/bin/git
bamboo_build_working_directory=/home/bamboo/xml-data/build-dir/PHPBB3-DDM-JOB1
bamboo_planRepository_1_name=phpBB Master
bamboo_buildKey=PHPBB3-DDM-JOB1
bamboo_shortPlanName=Development Docker Master
bamboo_planRepository_name=phpBB Master
bamboo_repository_75956230_git_branch=master
bamboo_buildNumber=894
bamboo_capability_system_builder_phpunit_PHPUnit=/usr/bin/phpunit
bamboo_repository_75956230_name=phpBB Master
bamboo_shortJobName=PHP 7.3 - SQLite
bamboo_buildResultsUrl=https://bamboo.phpbb.com/browse/PHPBB3-DDM-JOB1-894
bamboo_planRepository_repositoryUrl=https://github.com/phpbb/phpbb.git
bamboo_repository_75956230_git_repositoryUrl=https://github.com/phpbb/phpbb.git
bamboo_agentId=65929217
bamboo_planName=phpBB3 - Development Docker Master
bamboo_shortPlanKey=DDM
bamboo_shortJobKey=JOB1
bamboo_capability_system_jdk_JDK_1_7_0_65=/usr/lib/jvm/java-7-openjdk-amd64
bamboo_planRepository_revision=3629b587fa0a6e0e4c4875e78e93a015062def38
bamboo_buildTimeStamp=2021-03-01T20:55:50.429Z
bamboo_repository_previous_revision_number=3629b587fa0a6e0e4c4875e78e93a015062def38
bamboo_capability_system_jdk_JDK_1_6_0_16=/usr/lib/jvm/java-6-sun-1.6.0.16
bamboo_capability_system_builder_mvn2_Maven_2=/usr/share/maven2
bamboo_planRepository_previousRevision=3629b587fa0a6e0e4c4875e78e93a015062def38
bamboo_repository_git_branch=master
bamboo_buildResultKey=PHPBB3-DDM-JOB1-894
bamboo_repository_branch_name=master
bamboo_buildPlanName=phpBB3 - Development Docker Master - PHP 7.3 - SQLite
bamboo_planRepository_1_revision=3629b587fa0a6e0e4c4875e78e93a015062def38
bamboo_repository_name=phpBB Master
bamboo_dependenciesDisabled=false
bamboo_buildFailed=false
bamboo_capability_system_docker_executable=/usr/bin/docker
bamboo_repository_75956230_git_username=
bamboo_planRepository_branch=master
bamboo_agentWorkingDirectory=/home/bamboo/xml-data/build-dir
bamboo_capability_system_git_executable=/usr/bin/git
bamboo_capability_system_builder_phpunit_PHPUnit_3_4=/usr/bin/phpunit
bamboo_repository_git_username=
bamboo_planRepository_1_previousRevision=3629b587fa0a6e0e4c4875e78e93a015062def38
bamboo_repository_75956230_branch_name=master
bamboo_planRepository_branchDisplayName=master
bamboo_planRepository_1_type=gitv2
bamboo_planRepository_branchName=master
bamboo_capability_system_jdk_JDK=/usr/lib/jvm/java-6-sun
bamboo_plan_storageTag=PHPBB3-DDM
bamboo_hg_cache_directory=/home/bamboo/xml-data/build-dir/_hg-repositories-cache
bamboo_planRepository_1_username=
bamboo_planRepository_type=gitv2
bamboo_git_cache_directory=/home/bamboo/xml-data/build-dir/_git-repositories-cache
bamboo_ManualBuildTriggerReason_userName=Marc
bamboo_repository_git_repositoryUrl=https://github.com/phpbb/phpbb.git
bamboo_capability_system_builder_ant_Ant=/usr/share/ant
bamboo_repository_75956230_revision_number=3629b587fa0a6e0e4c4875e78e93a015062def38
bamboo_tmp_directory=/home/bamboo/temp
bamboo_working_directory=/home/bamboo/xml-data/build-dir/PHPBB3-DDM-JOB1
bamboo_planKey=PHPBB3-DDM
bamboo_capability_local=true
bamboo_planRepository_1_repositoryUrl=https://github.com/phpbb/phpbb.git
bamboo_planRepository_username=
bamboo_capability_system_jdk_JDK_1_6=/usr/lib/jvm/java-6-sun
bamboo_capability_system_jdk_JDK_1_7=/usr/lib/jvm/java-7-openjdk-amd64
bamboo_planRepository_1_branchName=master
01-Mar-2021 20:55:54 Sending build context to Docker daemon  25.18MB
01-Mar-2021 20:55:54
01-Mar-2021 20:55:54 Step 1/5 : FROM php:7.3
01-Mar-2021 20:55:54 ---> 3f7dde016e9f
01-Mar-2021 20:55:54 Step 2/5 : RUN apt-get update && apt-get install -y         git         zlib1g-dev         bzip2         zip         && docker-php-ext-install -j$(nproc) zip
01-Mar-2021 20:55:55 ---> Running in 3003771b9ad5
01-Mar-2021 20:55:55 Get:1 http://security.debian.org/debian-security buster/updates InRelease [65.4 kB]
01-Mar-2021 20:55:55 Get:2 http://deb.debian.org/debian buster InRelease [122 kB]
01-Mar-2021 20:55:55 Get:3 http://deb.debian.org/debian buster-updates InRelease [51.9 kB]
01-Mar-2021 20:55:55 Get:4 http://security.debian.org/debian-security buster/updates/main amd64 Packages [268 kB]
01-Mar-2021 20:55:56 Get:5 http://deb.debian.org/debian buster/main amd64 Packages [7907 kB]
01-Mar-2021 20:55:56 Get:6 http://deb.debian.org/debian buster-updates/main amd64 Packages [9504 B]
01-Mar-2021 20:55:57 Fetched 8423 kB in 2s (4625 kB/s)
01-Mar-2021 20:55:58 Reading package lists...
01-Mar-2021 20:55:59 Reading package lists...
01-Mar-2021 20:55:59 Building dependency tree...
01-Mar-2021 20:55:59 Reading state information...
01-Mar-2021 20:56:00 bzip2 is already the newest version (1.0.6-9.2~deb10u1).
01-Mar-2021 20:56:00 bzip2 set to manually installed.
01-Mar-2021 20:56:00 The following package was automatically installed and is no longer required:
01-Mar-2021 20:56:00   lsb-base
01-Mar-2021 20:56:00 Use 'apt autoremove' to remove it.
01-Mar-2021 20:56:00 The following additional packages will be installed:
01-Mar-2021 20:56:00   git-man less libcurl3-gnutls liberror-perl libexpat1 libpcre2-8-0 libx11-6
01-Mar-2021 20:56:00   libx11-data libxau6 libxcb1 libxdmcp6 libxext6 libxmuu1 openssh-client unzip
01-Mar-2021 20:56:00   xauth
01-Mar-2021 20:56:00 Suggested packages:
01-Mar-2021 20:56:00   gettext-base git-daemon-run | git-daemon-sysvinit git-doc git-el git-email
01-Mar-2021 20:56:00   git-gui gitk gitweb git-cvs git-mediawiki git-svn keychain libpam-ssh
01-Mar-2021 20:56:00   monkeysphere ssh-askpass
01-Mar-2021 20:56:00 The following NEW packages will be installed:
01-Mar-2021 20:56:00   git git-man less libcurl3-gnutls liberror-perl libexpat1 libpcre2-8-0
01-Mar-2021 20:56:00   libx11-6 libx11-data libxau6 libxcb1 libxdmcp6 libxext6 libxmuu1
01-Mar-2021 20:56:00   openssh-client unzip xauth zip zlib1g-dev
01-Mar-2021 20:56:00 0 upgraded, 19 newly installed, 0 to remove and 5 not upgraded.
01-Mar-2021 20:56:00 Need to get 10.8 MB of archives.
01-Mar-2021 20:56:00 After this operation, 49.4 MB of additional disk space will be used.
01-Mar-2021 20:56:00 Get:1 http://deb.debian.org/debian buster/main amd64 less amd64 487-0.1+b1 [129 kB]
01-Mar-2021 20:56:00 Get:2 http://deb.debian.org/debian buster/main amd64 openssh-client amd64 1:7.9p1-10+deb10u2 [782 kB]
01-Mar-2021 20:56:00 Get:3 http://deb.debian.org/debian buster/main amd64 libcurl3-gnutls amd64 7.64.0-4+deb10u1 [330 kB]
01-Mar-2021 20:56:00 Get:4 http://deb.debian.org/debian buster/main amd64 libexpat1 amd64 2.2.6-2+deb10u1 [106 kB]
01-Mar-2021 20:56:00 Get:5 http://deb.debian.org/debian buster/main amd64 libpcre2-8-0 amd64 10.32-5 [213 kB]
01-Mar-2021 20:56:00 Get:6 http://deb.debian.org/debian buster/main amd64 liberror-perl all 0.17027-2 [30.9 kB]
01-Mar-2021 20:56:00 Get:7 http://deb.debian.org/debian buster/main amd64 git-man all 1:2.20.1-2+deb10u3 [1620 kB]
01-Mar-2021 20:56:00 Get:8 http://deb.debian.org/debian buster/main amd64 git amd64 1:2.20.1-2+deb10u3 [5633 kB]
01-Mar-2021 20:56:00 Get:9 http://deb.debian.org/debian buster/main amd64 libxau6 amd64 1:1.0.8-1+b2 [19.9 kB]
01-Mar-2021 20:56:00 Get:10 http://deb.debian.org/debian buster/main amd64 libxdmcp6 amd64 1:1.1.2-3 [26.3 kB]
01-Mar-2021 20:56:00 Get:11 http://deb.debian.org/debian buster/main amd64 libxcb1 amd64 1.13.1-2 [137 kB]
01-Mar-2021 20:56:00 Get:12 http://deb.debian.org/debian buster/main amd64 libx11-data all 2:1.6.7-1+deb10u1 [294 kB]
01-Mar-2021 20:56:00 Get:13 http://deb.debian.org/debian buster/main amd64 libx11-6 amd64 2:1.6.7-1+deb10u1 [757 kB]
01-Mar-2021 20:56:00 Get:14 http://deb.debian.org/debian buster/main amd64 libxext6 amd64 2:1.3.3-1+b2 [52.5 kB]
01-Mar-2021 20:56:00 Get:15 http://deb.debian.org/debian buster/main amd64 libxmuu1 amd64 2:1.1.2-2+b3 [23.9 kB]
01-Mar-2021 20:56:00 Get:16 http://deb.debian.org/debian buster/main amd64 unzip amd64 6.0-23+deb10u2 [172 kB]
01-Mar-2021 20:56:00 Get:17 http://deb.debian.org/debian buster/main amd64 xauth amd64 1:1.0.10-1 [40.3 kB]
01-Mar-2021 20:56:00 Get:18 http://deb.debian.org/debian buster/main amd64 zip amd64 3.0-11+b1 [234 kB]
01-Mar-2021 20:56:00 Get:19 http://deb.debian.org/debian buster/main amd64 zlib1g-dev amd64 1:1.2.11.dfsg-1 [214 kB]
01-Mar-2021 20:56:00 debconf: delaying package configuration, since apt-utils is not installed
01-Mar-2021 20:56:00 Fetched 10.8 MB in 0s (59.2 MB/s)
01-Mar-2021 20:56:01 Selecting previously unselected package less.
01-Mar-2021 20:56:01 (Reading database ...
01-Mar-2021 20:56:01 (Reading database ... 5%
01-Mar-2021 20:56:01 (Reading database ... 10%
01-Mar-2021 20:56:01 (Reading database ... 15%
01-Mar-2021 20:56:01 (Reading database ... 20%
01-Mar-2021 20:56:01 (Reading database ... 25%
01-Mar-2021 20:56:01 (Reading database ... 30%
01-Mar-2021 20:56:01 (Reading database ... 35%
01-Mar-2021 20:56:01 (Reading database ... 40%
01-Mar-2021 20:56:01 (Reading database ... 45%
01-Mar-2021 20:56:01 (Reading database ... 50%
01-Mar-2021 20:56:01 (Reading database ... 55%
01-Mar-2021 20:56:01 (Reading database ... 60%
01-Mar-2021 20:56:01 (Reading database ... 65%
01-Mar-2021 20:56:01 (Reading database ... 70%
01-Mar-2021 20:56:01 (Reading database ... 75%
01-Mar-2021 20:56:01 (Reading database ... 80%
01-Mar-2021 20:56:01 (Reading database ... 85%
01-Mar-2021 20:56:01 (Reading database ... 90%
01-Mar-2021 20:56:01 (Reading database ... 95%
01-Mar-2021 20:56:01 (Reading database ... 100%
01-Mar-2021 20:56:01 (Reading database ... 12684 files and directories currently installed.)
01-Mar-2021 20:56:01 Preparing to unpack .../00-less_487-0.1+b1_amd64.deb ...
01-Mar-2021 20:56:01 Unpacking less (487-0.1+b1) ...
01-Mar-2021 20:56:01 Selecting previously unselected package openssh-client.
01-Mar-2021 20:56:01 Preparing to unpack .../01-openssh-client_1%3a7.9p1-10+deb10u2_amd64.deb ...
01-Mar-2021 20:56:01 Unpacking openssh-client (1:7.9p1-10+deb10u2) ...
01-Mar-2021 20:56:01 Selecting previously unselected package libcurl3-gnutls:amd64.
01-Mar-2021 20:56:01 Preparing to unpack .../02-libcurl3-gnutls_7.64.0-4+deb10u1_amd64.deb ...
01-Mar-2021 20:56:01 Unpacking libcurl3-gnutls:amd64 (7.64.0-4+deb10u1) ...
01-Mar-2021 20:56:01 Selecting previously unselected package libexpat1:amd64.
01-Mar-2021 20:56:01 Preparing to unpack .../03-libexpat1_2.2.6-2+deb10u1_amd64.deb ...
01-Mar-2021 20:56:01 Unpacking libexpat1:amd64 (2.2.6-2+deb10u1) ...
01-Mar-2021 20:56:01 Selecting previously unselected package libpcre2-8-0:amd64.
01-Mar-2021 20:56:01 Preparing to unpack .../04-libpcre2-8-0_10.32-5_amd64.deb ...
01-Mar-2021 20:56:01 Unpacking libpcre2-8-0:amd64 (10.32-5) ...
01-Mar-2021 20:56:01 Selecting previously unselected package liberror-perl.
01-Mar-2021 20:56:01 Preparing to unpack .../05-liberror-perl_0.17027-2_all.deb ...
01-Mar-2021 20:56:01 Unpacking liberror-perl (0.17027-2) ...
01-Mar-2021 20:56:01 Selecting previously unselected package git-man.
01-Mar-2021 20:56:01 Preparing to unpack .../06-git-man_1%3a2.20.1-2+deb10u3_all.deb ...
01-Mar-2021 20:56:01 Unpacking git-man (1:2.20.1-2+deb10u3) ...
01-Mar-2021 20:56:01 Selecting previously unselected package git.
01-Mar-2021 20:56:01 Preparing to unpack .../07-git_1%3a2.20.1-2+deb10u3_amd64.deb ...
01-Mar-2021 20:56:01 Unpacking git (1:2.20.1-2+deb10u3) ...
01-Mar-2021 20:56:02 Selecting previously unselected package libxau6:amd64.
01-Mar-2021 20:56:02 Preparing to unpack .../08-libxau6_1%3a1.0.8-1+b2_amd64.deb ...
01-Mar-2021 20:56:02 Unpacking libxau6:amd64 (1:1.0.8-1+b2) ...
01-Mar-2021 20:56:02 Selecting previously unselected package libxdmcp6:amd64.
01-Mar-2021 20:56:02 Preparing to unpack .../09-libxdmcp6_1%3a1.1.2-3_amd64.deb ...
01-Mar-2021 20:56:02 Unpacking libxdmcp6:amd64 (1:1.1.2-3) ...
01-Mar-2021 20:56:02 Selecting previously unselected package libxcb1:amd64.
01-Mar-2021 20:56:02 Preparing to unpack .../10-libxcb1_1.13.1-2_amd64.deb ...
01-Mar-2021 20:56:02 Unpacking libxcb1:amd64 (1.13.1-2) ...
01-Mar-2021 20:56:02 Selecting previously unselected package libx11-data.
01-Mar-2021 20:56:02 Preparing to unpack .../11-libx11-data_2%3a1.6.7-1+deb10u1_all.deb ...
01-Mar-2021 20:56:02 Unpacking libx11-data (2:1.6.7-1+deb10u1) ...
01-Mar-2021 20:56:02 Selecting previously unselected package libx11-6:amd64.
01-Mar-2021 20:56:02 Preparing to unpack .../12-libx11-6_2%3a1.6.7-1+deb10u1_amd64.deb ...
01-Mar-2021 20:56:02 Unpacking libx11-6:amd64 (2:1.6.7-1+deb10u1) ...
01-Mar-2021 20:56:02 Selecting previously unselected package libxext6:amd64.
01-Mar-2021 20:56:02 Preparing to unpack .../13-libxext6_2%3a1.3.3-1+b2_amd64.deb ...
01-Mar-2021 20:56:02 Unpacking libxext6:amd64 (2:1.3.3-1+b2) ...
01-Mar-2021 20:56:02 Selecting previously unselected package libxmuu1:amd64.
01-Mar-2021 20:56:02 Preparing to unpack .../14-libxmuu1_2%3a1.1.2-2+b3_amd64.deb ...
01-Mar-2021 20:56:02 Unpacking libxmuu1:amd64 (2:1.1.2-2+b3) ...
01-Mar-2021 20:56:02 Selecting previously unselected package unzip.
01-Mar-2021 20:56:02 Preparing to unpack .../15-unzip_6.0-23+deb10u2_amd64.deb ...
01-Mar-2021 20:56:02 Unpacking unzip (6.0-23+deb10u2) ...
01-Mar-2021 20:56:03 Selecting previously unselected package xauth.
01-Mar-2021 20:56:03 Preparing to unpack .../16-xauth_1%3a1.0.10-1_amd64.deb ...
01-Mar-2021 20:56:03 Unpacking xauth (1:1.0.10-1) ...
01-Mar-2021 20:56:03 Selecting previously unselected package zip.
01-Mar-2021 20:56:03 Preparing to unpack .../17-zip_3.0-11+b1_amd64.deb ...
01-Mar-2021 20:56:03 Unpacking zip (3.0-11+b1) ...
01-Mar-2021 20:56:03 Selecting previously unselected package zlib1g-dev:amd64.
01-Mar-2021 20:56:03 Preparing to unpack .../18-zlib1g-dev_1%3a1.2.11.dfsg-1_amd64.deb ...
01-Mar-2021 20:56:03 Unpacking zlib1g-dev:amd64 (1:1.2.11.dfsg-1) ...
01-Mar-2021 20:56:03 Setting up libexpat1:amd64 (2.2.6-2+deb10u1) ...
01-Mar-2021 20:56:03 Setting up libxau6:amd64 (1:1.0.8-1+b2) ...
01-Mar-2021 20:56:03 Setting up libxdmcp6:amd64 (1:1.1.2-3) ...
01-Mar-2021 20:56:03 Setting up libxcb1:amd64 (1.13.1-2) ...
01-Mar-2021 20:56:03 Setting up openssh-client (1:7.9p1-10+deb10u2) ...
01-Mar-2021 20:56:03 Setting up unzip (6.0-23+deb10u2) ...
01-Mar-2021 20:56:03 Setting up less (487-0.1+b1) ...
01-Mar-2021 20:56:03 debconf: unable to initialize frontend: Dialog
01-Mar-2021 20:56:03 debconf: (TERM is not set, so the dialog frontend is not usable.)
01-Mar-2021 20:56:03 debconf: falling back to frontend: Readline
01-Mar-2021 20:56:03 Setting up libcurl3-gnutls:amd64 (7.64.0-4+deb10u1) ...
01-Mar-2021 20:56:03 Setting up liberror-perl (0.17027-2) ...
01-Mar-2021 20:56:03 Setting up zip (3.0-11+b1) ...
01-Mar-2021 20:56:03 Setting up libx11-data (2:1.6.7-1+deb10u1) ...
01-Mar-2021 20:56:03 Setting up libpcre2-8-0:amd64 (10.32-5) ...
01-Mar-2021 20:56:03 Setting up zlib1g-dev:amd64 (1:1.2.11.dfsg-1) ...
01-Mar-2021 20:56:03 Setting up git-man (1:2.20.1-2+deb10u3) ...
01-Mar-2021 20:56:03 Setting up libx11-6:amd64 (2:1.6.7-1+deb10u1) ...
01-Mar-2021 20:56:03 Setting up libxmuu1:amd64 (2:1.1.2-2+b3) ...
01-Mar-2021 20:56:03 Setting up libxext6:amd64 (2:1.3.3-1+b2) ...
01-Mar-2021 20:56:03 Setting up git (1:2.20.1-2+deb10u3) ...
01-Mar-2021 20:56:03 Setting up xauth (1:1.0.10-1) ...
01-Mar-2021 20:56:03 Processing triggers for libc-bin (2.28-10) ...
01-Mar-2021 20:56:08 Configuring for:
01-Mar-2021 20:56:08 PHP Api Version:         20180731
01-Mar-2021 20:56:08 Zend Module Api No:      20180731
01-Mar-2021 20:56:08 Zend Extension Api No:   320180731
01-Mar-2021 20:56:09 checking for grep that handles long lines and -e... /bin/grep
01-Mar-2021 20:56:09 checking for egrep... /bin/grep -E
01-Mar-2021 20:56:09 checking for a sed that does not truncate output... /bin/sed
01-Mar-2021 20:56:09 checking for cc... cc
01-Mar-2021 20:56:09 checking whether the C compiler works... yes
01-Mar-2021 20:56:09 checking for C compiler default output file name... a.out
01-Mar-2021 20:56:09 checking for suffix of executables...
01-Mar-2021 20:56:09 checking whether we are cross compiling... no
01-Mar-2021 20:56:09 checking for suffix of object files... o
01-Mar-2021 20:56:09 checking whether we are using the GNU C compiler... yes
01-Mar-2021 20:56:09 checking whether cc accepts -g... yes
01-Mar-2021 20:56:09 checking for cc option to accept ISO C89... none needed
01-Mar-2021 20:56:09 checking how to run the C preprocessor... cc -E
01-Mar-2021 20:56:10 checking for icc... no
01-Mar-2021 20:56:10 checking for suncc... no
01-Mar-2021 20:56:10 checking whether cc understands -c and -o together... yes
01-Mar-2021 20:56:10 checking for system library directory... lib
01-Mar-2021 20:56:10 checking if compiler supports -R... no
01-Mar-2021 20:56:10 checking if compiler supports -Wl,-rpath,... yes
01-Mar-2021 20:56:10 checking build system type... x86_64-pc-linux-gnu
01-Mar-2021 20:56:10 checking host system type... x86_64-pc-linux-gnu
01-Mar-2021 20:56:10 checking target system type... x86_64-pc-linux-gnu
01-Mar-2021 20:56:10 checking for PHP prefix... /usr/local
01-Mar-2021 20:56:10 checking for PHP includes... -I/usr/local/include/php -I/usr/local/include/php/main -I/usr/local/include/php/TSRM -I/usr/local/include/php/Zend -I/usr/local/include/php/ext -I/usr/local/include/php/ext/date/lib
01-Mar-2021 20:56:10 checking for PHP extension directory... /usr/local/lib/php/extensions/no-debug-non-zts-20180731
01-Mar-2021 20:56:10 checking for PHP installed headers prefix... /usr/local/include/php
01-Mar-2021 20:56:10 checking if debug is enabled... no
01-Mar-2021 20:56:10 checking if zts is enabled... no
01-Mar-2021 20:56:10 checking for re2c... re2c
01-Mar-2021 20:56:10 checking for re2c version... 1.1.1 (ok)
01-Mar-2021 20:56:10 checking for gawk... no
01-Mar-2021 20:56:10 checking for nawk... nawk
01-Mar-2021 20:56:10 checking if nawk is broken... no
01-Mar-2021 20:56:10 checking for zip archive read/writesupport... yes, shared
01-Mar-2021 20:56:10 checking for the location of libz... no
01-Mar-2021 20:56:10 checking pcre install prefix... no
01-Mar-2021 20:56:10 checking libzip... yes
01-Mar-2021 20:56:10 checking for the location of zlib... /usr
01-Mar-2021 20:56:10 checking for pkg-config... /usr/bin/pkg-config
01-Mar-2021 20:56:10 checking for libzip... not found
01-Mar-2021 20:56:10 configure: error: Please reinstall the libzip distribution
01-Mar-2021 20:56:12 Removing intermediate container 3003771b9ad5
01-Mar-2021 20:56:12 The command '/bin/sh -c apt-get update && apt-get install -y         git         zlib1g-dev         bzip2         zip         && docker-php-ext-install -j$(nproc) zip' returned a non-zero code: 1
01-Mar-2021 20:56:12 Failing task since return code of [/usr/bin/docker build --force-rm=true --tag=phpbb:php-7.3 /home/bamboo/xml-data/build-dir/PHPBB3-DDM-JOB1] was 1 while expected 0
01-Mar-2021 20:56:12 Error occurred while running Task 'Build image(3)' of type com.atlassian.bamboo.plugins.bamboo-docker-plugin:task.docker.cli.
01-Mar-2021 20:56:12 com.atlassian.bamboo.task.TaskException: Failed to execute task
01-Mar-2021 20:56:12         at com.atlassian.bamboo.plugins.docker.service.BuildService.execute(BuildService.java:57)
01-Mar-2021 20:56:12         at com.atlassian.bamboo.plugins.docker.tasks.cli.DockerCliTask.execute(DockerCliTask.java:70)
01-Mar-2021 20:56:12         at com.atlassian.bamboo.task.TaskExecutorImpl.lambda$executeTasks$3(TaskExecutorImpl.java:323)
01-Mar-2021 20:56:12         at com.atlassian.bamboo.task.TaskExecutorImpl.executeTaskWithPrePostActions(TaskExecutorImpl.java:256)
01-Mar-2021 20:56:12         at com.atlassian.bamboo.task.TaskExecutorImpl.executeTasks(TaskExecutorImpl.java:323)
01-Mar-2021 20:56:12         at com.atlassian.bamboo.task.TaskExecutorImpl.execute(TaskExecutorImpl.java:116)
01-Mar-2021 20:56:12         at com.atlassian.bamboo.build.pipeline.tasks.ExecuteBuildTask.call(ExecuteBuildTask.java:73)
01-Mar-2021 20:56:12         at com.atlassian.bamboo.v2.build.agent.DefaultBuildAgent.executeBuildPhase(DefaultBuildAgent.java:184)
01-Mar-2021 20:56:12         at com.atlassian.bamboo.v2.build.agent.DefaultBuildAgent.build(DefaultBuildAgent.java:156)
01-Mar-2021 20:56:12         at com.atlassian.bamboo.v2.build.agent.BuildAgentControllerImpl.lambda$waitAndPerformBuild$0(BuildAgentControllerImpl.java:130)
01-Mar-2021 20:56:12         at com.atlassian.bamboo.variable.CustomVariableContextImpl.withVariableSubstitutor(CustomVariableContextImpl.java:118)
01-Mar-2021 20:56:12         at com.atlassian.bamboo.v2.build.agent.BuildAgentControllerImpl.waitAndPerformBuild(BuildAgentControllerImpl.java:124)
01-Mar-2021 20:56:12         at com.atlassian.bamboo.v2.build.agent.DefaultBuildAgent.lambda$start$0(DefaultBuildAgent.java:108)
01-Mar-2021 20:56:12         at com.atlassian.bamboo.utils.BambooRunnables$1.run(BambooRunnables.java:48)
01-Mar-2021 20:56:12         at com.atlassian.bamboo.security.ImpersonationHelper.runWith(ImpersonationHelper.java:26)
01-Mar-2021 20:56:12         at com.atlassian.bamboo.security.ImpersonationHelper.runWithSystemAuthority(ImpersonationHelper.java:17)
01-Mar-2021 20:56:12         at com.atlassian.bamboo.security.ImpersonationHelper$1.run(ImpersonationHelper.java:41)
01-Mar-2021 20:56:12         at java.lang.Thread.run(Thread.java:748)
01-Mar-2021 20:56:12 Caused by: com.atlassian.bamboo.docker.DockerException: Error running Docker build command
01-Mar-2021 20:56:12         at com.atlassian.bamboo.plugins.docker.client.DockerCmd.build(DockerCmd.java:113)
01-Mar-2021 20:56:12         at com.atlassian.bamboo.plugins.docker.service.BuildService.execute(BuildService.java:44)
01-Mar-2021 20:56:12         ... 17 more
01-Mar-2021 20:56:12 Caused by: com.atlassian.utils.process.ProcessException: Error executing /usr/bin/docker build --force-rm=true --tag=phpbb:php-7.3 /home/bamboo/xml-data/build-dir/PHPBB3-DDM-JOB1
01-Mar-2021 20:56:12         at com.atlassian.bamboo.plugins.docker.process.DockerTaskProcessService.execute(DockerTaskProcessService.java:64)
01-Mar-2021 20:56:12         at com.atlassian.bamboo.plugins.docker.client.DockerCmd.build(DockerCmd.java:111)
01-Mar-2021 20:56:12         ... 18 more
01-Mar-2021 20:56:12 Starting task 'Parsing test results' of type 'com.atlassian.bamboo.plugins.testresultparser:task.testresultparser.junit'
01-Mar-2021 20:56:12 Parsing test results under /home/bamboo/xml-data/build-dir/PHPBB3-DDM-JOB1...
01-Mar-2021 20:56:12 Failing task since test cases were expected but none were found.
01-Mar-2021 20:56:12 Finished task 'Parsing test results' with result: Failed
01-Mar-2021 20:56:12 Running post build plugin 'NCover Results Collector'
01-Mar-2021 20:56:12 Running post build plugin 'Artifact Copier'
01-Mar-2021 20:56:12 Publishing an artifact: Coverage HTML Report
01-Mar-2021 20:56:12 Unable to publish artifact [Coverage HTML Report]: the source directory /home/bamboo/xml-data/build-dir/PHPBB3-DDM-JOB1/build/coverage does not exist.
01-Mar-2021 20:56:12 The artifact hasn't been successfully published after 249.9 μs
01-Mar-2021 20:56:12 Running post build plugin 'npm Cache Cleanup'
01-Mar-2021 20:56:12 Running post build plugin 'Clover Results Collector'
01-Mar-2021 20:56:12 Running post build plugin 'Docker Container Cleanup'
01-Mar-2021 20:56:12 Successfully removed working directory at '/home/bamboo/xml-data/build-dir/PHPBB3-DDM-JOB1'
01-Mar-2021 20:56:12 Finalising the build...
01-Mar-2021 20:56:12 Stopping timer.
01-Mar-2021 20:56:12 Build PHPBB3-DDM-JOB1-894 completed.
01-Mar-2021 20:56:12 Running on server: post build plugin 'NCover Results Collector'
01-Mar-2021 20:56:12 Running on server: post build plugin 'Build Hanging Detection Configuration'
01-Mar-2021 20:56:12 Running on server: post build plugin 'Clover Delta Calculator'
01-Mar-2021 20:56:13 Running on server: post build plugin 'Maven Dependencies Postprocessor'
01-Mar-2021 20:56:13 All post build plugins have finished
01-Mar-2021 20:56:13 Generating build results summary...
01-Mar-2021 20:56:13 Saving build results to disk...
01-Mar-2021 20:56:13 Store variable context...
01-Mar-2021 20:56:13 Indexing build results...
01-Mar-2021 20:56:13 Finished building PHPBB3-DDM-JOB1-894.