Build: #352 failed

Job: PHP 7.3 - SQLite Package failed

Stages & jobs

  1. Default Stage

Build log

The build generated 83 lines of output. Download or view full build log

26-Mar-2018 19:24:48 Build phpBB3 - Development Docker Master - PHP 5.6 - SQLite Package #352 (PHPBB3-DDM-P5SP-352) started building on agent Default Agent
26-Mar-2018 19:24:48
26-Mar-2018 19:24:49 Build working directory is /home/bamboo/xml-data/build-dir/PHPBB3-DDM-P5SP
26-Mar-2018 19:24:49 Executing build phpBB3 - Development Docker Master - PHP 5.6 - SQLite Package #352 (PHPBB3-DDM-P5SP-352)
26-Mar-2018 19:24:49 Starting task 'Checkout Default Repository' of type 'com.atlassian.bamboo.plugins.vcs:task.vcs.checkout'
26-Mar-2018 19:24:49 Updating source code to revision: f3338b2874fdffbf43fd500d2cc5cea90b7e86d8
26-Mar-2018 19:24:58 Fetching 'refs/heads/master' from 'https://github.com/phpbb/phpbb.git'.
26-Mar-2018 19:24:59 Checking out revision f3338b2874fdffbf43fd500d2cc5cea90b7e86d8.
26-Mar-2018 19:24:59 Creating local git repository in '/home/bamboo/xml-data/build-dir/PHPBB3-DDM-P5SP/.git'.
26-Mar-2018 19:24:59 Cloning into '/home/bamboo/xml-data/build-dir/PHPBB3-DDM-P5SP'...
26-Mar-2018 19:24:59 done.
26-Mar-2018 19:25:01 Already on 'master'
26-Mar-2018 19:25:01 Updated source code to revision: f3338b2874fdffbf43fd500d2cc5cea90b7e86d8
26-Mar-2018 19:25:01 Finished task 'Checkout Default Repository' with result: Success
26-Mar-2018 19:25:01 Running pre-build action: VCS Version Collector
26-Mar-2018 19:25:01
Substituting variable: ${bamboo.working.directory} with /home/bamboo/xml-data/build-dir/PHPBB3-DDM-P5SP
26-Mar-2018 19:25:01 Starting task 'Build image' of type 'com.atlassian.bamboo.plugins.bamboo-docker-plugin:task.docker.cli'
26-Mar-2018 19:25:01
Beginning to execute external process for build 'phpBB3 - Development Docker Master - PHP 5.6 - SQLite Package #352 (PHPBB3-DDM-P5SP-352)'
... running command line:
/usr/bin/docker build --force-rm=true --tag=phpbb:php-5.6 /home/bamboo/xml-data/build-dir/PHPBB3-DDM-P5SP
... in: /home/bamboo/xml-data/build-dir/PHPBB3-DDM-P5SP
... using extra environment variables:
bamboo_planRepository_1_branch=master
bamboo_repository_75956230_previous_revision_number=c706883e44810994c37a6b895358d9dcb2d3ffb1
bamboo_planRepository_1_branchDisplayName=master
bamboo_repository_revision_number=f3338b2874fdffbf43fd500d2cc5cea90b7e86d8
bamboo_resultsUrl=https://bamboo.phpbb.com/browse/PHPBB3-DDM-P5SP-352
bamboo_capability_system_builder_command_Git=/usr/bin/git
bamboo_planRepository_1_name=phpBB Master
bamboo_build_working_directory=/home/bamboo/xml-data/build-dir/PHPBB3-DDM-P5SP
bamboo_buildKey=PHPBB3-DDM-P5SP
bamboo_capability_phpbb_tests=true
bamboo_shortPlanName=Development Docker Master
bamboo_capability_system_builder_command_fop=/usr/bin/fop
bamboo_capability_dbms_sqlite_2=true
bamboo_planRepository_name=phpBB Master
bamboo_repository_75956230_git_branch=master
bamboo_buildNumber=352
bamboo_capability_system_builder_phpunit_PHPUnit=/usr/bin/phpunit
bamboo_repository_75956230_name=phpBB Master
bamboo_shortJobName=PHP 5.6 - SQLite Package
bamboo_buildResultsUrl=https://bamboo.phpbb.com/browse/PHPBB3-DDM-P5SP-352
bamboo_planRepository_repositoryUrl=https://github.com/phpbb/phpbb.git
bamboo_repository_75956230_git_repositoryUrl=https://github.com/phpbb/phpbb.git
bamboo_agentId=131073
bamboo_planName=phpBB3 - Development Docker Master
bamboo_shortPlanKey=DDM
bamboo_shortJobKey=P5SP
bamboo_capability_dbms_mysql_55=true
bamboo_capability_system_jdk_JDK_1_7_0_65=/usr/lib/jvm/java-7-openjdk-amd64
bamboo_planRepository_revision=f3338b2874fdffbf43fd500d2cc5cea90b7e86d8
bamboo_repository_previous_revision_number=c706883e44810994c37a6b895358d9dcb2d3ffb1
bamboo_buildTimeStamp=2018-03-26T19:22:38.028Z
bamboo_planRepository_previousRevision=c706883e44810994c37a6b895358d9dcb2d3ffb1
bamboo_capability_system_builder_mvn2_Maven_2=/usr/share/maven2
bamboo_capability_system_jdk_JDK_1_6_0_16=/usr/lib/jvm/java-6-sun-1.6.0.16
bamboo_buildResultKey=PHPBB3-DDM-P5SP-352
bamboo_repository_git_branch=master
bamboo_repository_branch_name=master
bamboo_buildPlanName=phpBB3 - Development Docker Master - PHP 5.6 - SQLite Package
bamboo_planRepository_1_revision=f3338b2874fdffbf43fd500d2cc5cea90b7e86d8
bamboo_repository_name=phpBB Master
bamboo_buildFailed=false
bamboo_capability_system_docker_executable=/usr/bin/docker
bamboo_repository_75956230_git_username=
bamboo_planRepository_branch=master
bamboo_agentWorkingDirectory=/home/bamboo/xml-data/build-dir
bamboo_capability_system_git_executable=/usr/bin/git
bamboo_planRepository_1_previousRevision=c706883e44810994c37a6b895358d9dcb2d3ffb1
bamboo_capability_system_builder_phpunit_PHPUnit_3_4=/usr/bin/phpunit
bamboo_repository_git_username=
bamboo_repository_75956230_branch_name=master
bamboo_planRepository_branchDisplayName=master
bamboo_planRepository_1_type=gitv2
bamboo_planRepository_branchName=master
bamboo_capability_system_jdk_JDK=/usr/lib/jvm/java-6-sun
bamboo_plan_storageTag=PHPBB3-DDM
bamboo_planRepository_type=gitv2
bamboo_planRepository_1_username=
bamboo_repository_git_repositoryUrl=https://github.com/phpbb/phpbb.git
bamboo_capability_system_builder_ant_Ant=/usr/share/ant
bamboo_repository_75956230_revision_number=f3338b2874fdffbf43fd500d2cc5cea90b7e86d8
bamboo_working_directory=/home/bamboo/xml-data/build-dir/PHPBB3-DDM-P5SP
bamboo_planKey=PHPBB3-DDM
bamboo_planRepository_1_repositoryUrl=https://github.com/phpbb/phpbb.git
bamboo_planRepository_username=
bamboo_capability_local=true
bamboo_capability_system_jdk_JDK_1_6=/usr/lib/jvm/java-6-sun
bamboo_capability_system_jdk_JDK_1_7=/usr/lib/jvm/java-7-openjdk-amd64
bamboo_planRepository_1_branchName=master
26-Mar-2018 19:25:01 Sending build context to Docker daemon  19.97MB
26-Mar-2018 19:25:01
26-Mar-2018 19:25:02 Step 1/6 : FROM php:5.6
26-Mar-2018 19:25:02 ---> b7b6faef0ed2
26-Mar-2018 19:25:02 Step 2/6 : RUN apt-get update && apt-get install -y         git         zlib1g-dev         bzip2         zip         && docker-php-ext-install -j$(nproc) zip
26-Mar-2018 19:25:02 ---> Using cache
26-Mar-2018 19:25:02 ---> bae35de79b91
26-Mar-2018 19:25:02 Step 3/6 : RUN pecl install xdebug
26-Mar-2018 19:25:02 ---> Running in a7ce444b1fe6
26-Mar-2018 19:25:04 pecl/xdebug requires PHP (version >= 7.0.0), installed version is 5.6.34
26-Mar-2018 19:25:04 No valid packages found
26-Mar-2018 19:25:04 install failed
26-Mar-2018 19:25:04 Removing intermediate container a7ce444b1fe6
26-Mar-2018 19:25:04 The command '/bin/sh -c pecl install xdebug' returned a non-zero code: 1
26-Mar-2018 19:25:04 Failing task since return code of [/usr/bin/docker build --force-rm=true --tag=phpbb:php-5.6 /home/bamboo/xml-data/build-dir/PHPBB3-DDM-P5SP] was 1 while expected 0
26-Mar-2018 19:25:04 Error occurred while running Task 'Build image(3)' of type com.atlassian.bamboo.plugins.bamboo-docker-plugin:task.docker.cli.
26-Mar-2018 19:25:04 com.atlassian.bamboo.task.TaskException: Failed to execute task
26-Mar-2018 19:25:04         at com.atlassian.bamboo.plugins.docker.service.BuildService.execute(BuildService.java:53)
26-Mar-2018 19:25:04         at com.atlassian.bamboo.plugins.docker.tasks.cli.DockerCliTask.execute(DockerCliTask.java:60)
26-Mar-2018 19:25:04         at com.atlassian.bamboo.task.TaskExecutorImpl.lambda$executeTasks$3(TaskExecutorImpl.java:284)
26-Mar-2018 19:25:04         at com.atlassian.bamboo.task.TaskExecutorImpl.executeTaskWithPrePostActions(TaskExecutorImpl.java:223)
26-Mar-2018 19:25:04         at com.atlassian.bamboo.task.TaskExecutorImpl.executeTasks(TaskExecutorImpl.java:284)
26-Mar-2018 19:25:04         at com.atlassian.bamboo.task.TaskExecutorImpl.execute(TaskExecutorImpl.java:111)
26-Mar-2018 19:25:04         at com.atlassian.bamboo.build.pipeline.tasks.ExecuteBuildTask.call(ExecuteBuildTask.java:71)
26-Mar-2018 19:25:04         at com.atlassian.bamboo.v2.build.agent.DefaultBuildAgent.build(DefaultBuildAgent.java:185)
26-Mar-2018 19:25:04         at com.atlassian.bamboo.v2.build.agent.BuildAgentControllerImpl$1.call(BuildAgentControllerImpl.java:120)
26-Mar-2018 19:25:04         at com.atlassian.bamboo.v2.build.agent.BuildAgentControllerImpl$1.call(BuildAgentControllerImpl.java:113)
26-Mar-2018 19:25:04         at com.atlassian.bamboo.variable.CustomVariableContextImpl.withVariableSubstitutor(CustomVariableContextImpl.java:185)
26-Mar-2018 19:25:04         at com.atlassian.bamboo.v2.build.agent.BuildAgentControllerImpl.waitAndPerformBuild(BuildAgentControllerImpl.java:113)
26-Mar-2018 19:25:04         at com.atlassian.bamboo.v2.build.agent.DefaultBuildAgent$1.run(DefaultBuildAgent.java:126)
26-Mar-2018 19:25:04         at com.atlassian.bamboo.utils.BambooRunnables$1.run(BambooRunnables.java:47)
26-Mar-2018 19:25:04         at com.atlassian.bamboo.security.ImpersonationHelper.runWith(ImpersonationHelper.java:26)
26-Mar-2018 19:25:04         at com.atlassian.bamboo.security.ImpersonationHelper.runWithSystemAuthority(ImpersonationHelper.java:17)
26-Mar-2018 19:25:04         at com.atlassian.bamboo.security.ImpersonationHelper$1.run(ImpersonationHelper.java:41)
26-Mar-2018 19:25:04         at java.lang.Thread.run(Thread.java:748)
26-Mar-2018 19:25:04 Caused by: com.atlassian.bamboo.plugins.docker.client.DockerException: Error running Docker build command
26-Mar-2018 19:25:04         at com.atlassian.bamboo.plugins.docker.client.DockerCmd.build(DockerCmd.java:194)
26-Mar-2018 19:25:04         at com.atlassian.bamboo.plugins.docker.service.BuildService.execute(BuildService.java:40)
26-Mar-2018 19:25:04         ... 17 more
26-Mar-2018 19:25:04 Caused by: com.atlassian.utils.process.ProcessException: Error executing /usr/bin/docker build --force-rm=true --tag=phpbb:php-5.6 /home/bamboo/xml-data/build-dir/PHPBB3-DDM-P5SP
26-Mar-2018 19:25:04         at com.atlassian.bamboo.plugins.docker.process.DockerTaskProcessService.execute(DockerTaskProcessService.java:60)
26-Mar-2018 19:25:04         at com.atlassian.bamboo.plugins.docker.client.DockerCmd.build(DockerCmd.java:190)
26-Mar-2018 19:25:04         ... 18 more
26-Mar-2018 19:25:04 Running post build plugin 'NCover Results Collector'
26-Mar-2018 19:25:04 Running post build plugin 'Artifact Copier'
26-Mar-2018 19:25:04 Publishing an artifact: Release Files
26-Mar-2018 19:25:04 Unable to publish artifact [Release Files]: the source directory /home/bamboo/xml-data/build-dir/PHPBB3-DDM-P5SP/build/new_version/release_files does not exist.
26-Mar-2018 19:25:04 The artifact hasn't been successfully published after 181.7 μs
26-Mar-2018 19:25:04 Running post build plugin 'npm Cache Cleanup'
26-Mar-2018 19:25:04 Running post build plugin 'Clover Results Collector'
26-Mar-2018 19:25:04 Running post build plugin 'Docker Container Cleanup'
26-Mar-2018 19:25:04 Successfully removed working directory at '/home/bamboo/xml-data/build-dir/PHPBB3-DDM-P5SP'
26-Mar-2018 19:25:04 Finalising the build...
26-Mar-2018 19:25:04 Stopping timer.
26-Mar-2018 19:25:04 Build PHPBB3-DDM-P5SP-352 completed.
26-Mar-2018 19:25:04 Running on server: post build plugin 'NCover Results Collector'
26-Mar-2018 19:25:04 Running on server: post build plugin 'Build Hanging Detection Configuration'
26-Mar-2018 19:25:04 Running on server: post build plugin 'Clover Delta Calculator'
26-Mar-2018 19:25:04 Running on server: post build plugin 'Maven Dependencies Postprocessor'
26-Mar-2018 19:25:04 All post build plugins have finished
26-Mar-2018 19:25:04 Generating build results summary...
26-Mar-2018 19:25:04 Saving build results to disk...
26-Mar-2018 19:25:04 Logging substituted variables...
26-Mar-2018 19:25:04 Indexing build results...
26-Mar-2018 19:25:04 Finished building PHPBB3-DDM-P5SP-352.