Build: #526 failed

Job: PHP 7.3 - SQLite Package failed

Stages & jobs

  1. Default Stage

Build log

The build generated 135 lines of output. Download or view full build log

12-May-2019 20:39:26 Build phpBB3 - Development Docker Master - PHP 7.1 - SQLite Package #526 (PHPBB3-DDM-P5SP-526) started building on agent Default Agent
12-May-2019 20:39:26
12-May-2019 20:39:26 Build working directory is /home/bamboo/xml-data/build-dir/PHPBB3-DDM-P5SP
12-May-2019 20:39:26 Executing build phpBB3 - Development Docker Master - PHP 7.1 - SQLite Package #526 (PHPBB3-DDM-P5SP-526)
12-May-2019 20:39:26 Starting task 'Checkout Default Repository' of type 'com.atlassian.bamboo.plugins.vcs:task.vcs.checkout'
12-May-2019 20:39:26 Checking out into /home/bamboo/xml-data/build-dir/PHPBB3-DDM-P5SP
12-May-2019 20:39:26 Updating source code to revision: 53025be19166827c3a39fcc0152ea19dcb68ed21
12-May-2019 20:39:26 Fetching 'refs/heads/master' from 'https://github.com/phpbb/phpbb.git'.
12-May-2019 20:39:27 Checking out revision 53025be19166827c3a39fcc0152ea19dcb68ed21.
12-May-2019 20:39:27 Creating local git repository in '/home/bamboo/xml-data/build-dir/PHPBB3-DDM-P5SP/.git'.
12-May-2019 20:39:27 Cloning into '/home/bamboo/xml-data/build-dir/PHPBB3-DDM-P5SP'...
12-May-2019 20:39:27 done.
12-May-2019 20:39:32 Already on 'master'
12-May-2019 20:39:32 Updated source code to revision: 53025be19166827c3a39fcc0152ea19dcb68ed21
12-May-2019 20:39:32 Finished task 'Checkout Default Repository' with result: Success
12-May-2019 20:39:32 Running pre-build action: VCS Version Collector
12-May-2019 20:39:32
Substituting variable: ${bamboo.working.directory} with /home/bamboo/xml-data/build-dir/PHPBB3-DDM-P5SP
12-May-2019 20:39:32 Starting task 'Build image' of type 'com.atlassian.bamboo.plugins.bamboo-docker-plugin:task.docker.cli'
12-May-2019 20:39:32
Beginning to execute external process for build 'phpBB3 - Development Docker Master - PHP 7.1 - SQLite Package #526 (PHPBB3-DDM-P5SP-526)'
... running command line:
/usr/bin/docker build --force-rm=true --tag=phpbb:php-7.1 /home/bamboo/xml-data/build-dir/PHPBB3-DDM-P5SP
... in: /home/bamboo/xml-data/build-dir/PHPBB3-DDM-P5SP
... using extra environment variables:
bamboo_planRepository_1_branch=master
bamboo_repository_75956230_previous_revision_number=04cfbd643744d7988bc809bac46017a4578143e2
bamboo_planRepository_1_branchDisplayName=master
bamboo_repository_revision_number=53025be19166827c3a39fcc0152ea19dcb68ed21
bamboo_resultsUrl=https://bamboo.phpbb.com/browse/PHPBB3-DDM-P5SP-526
bamboo_capability_system_builder_command_Git=/usr/bin/git
bamboo_build_working_directory=/home/bamboo/xml-data/build-dir/PHPBB3-DDM-P5SP
bamboo_planRepository_1_name=phpBB Master
bamboo_buildKey=PHPBB3-DDM-P5SP
bamboo_capability_phpbb_tests=true
bamboo_shortPlanName=Development Docker Master
bamboo_capability_system_builder_command_fop=/usr/bin/fop
bamboo_capability_dbms_sqlite_2=true
bamboo_planRepository_name=phpBB Master
bamboo_repository_75956230_git_branch=master
bamboo_buildNumber=526
bamboo_capability_system_builder_phpunit_PHPUnit=/usr/bin/phpunit
bamboo_repository_75956230_name=phpBB Master
bamboo_shortJobName=PHP 7.1 - SQLite Package
bamboo_buildResultsUrl=https://bamboo.phpbb.com/browse/PHPBB3-DDM-P5SP-526
bamboo_planRepository_repositoryUrl=https://github.com/phpbb/phpbb.git
bamboo_repository_75956230_git_repositoryUrl=https://github.com/phpbb/phpbb.git
bamboo_agentId=131073
bamboo_planName=phpBB3 - Development Docker Master
bamboo_shortPlanKey=DDM
bamboo_shortJobKey=P5SP
bamboo_capability_dbms_mysql_55=true
bamboo_capability_system_jdk_JDK_1_7_0_65=/usr/lib/jvm/java-7-openjdk-amd64
bamboo_planRepository_revision=53025be19166827c3a39fcc0152ea19dcb68ed21
bamboo_buildTimeStamp=2019-05-12T20:39:26.793Z
bamboo_repository_previous_revision_number=04cfbd643744d7988bc809bac46017a4578143e2
bamboo_capability_system_jdk_JDK_1_6_0_16=/usr/lib/jvm/java-6-sun-1.6.0.16
bamboo_capability_system_builder_mvn2_Maven_2=/usr/share/maven2
bamboo_planRepository_previousRevision=04cfbd643744d7988bc809bac46017a4578143e2
bamboo_repository_git_branch=master
bamboo_buildResultKey=PHPBB3-DDM-P5SP-526
bamboo_repository_branch_name=master
bamboo_buildPlanName=phpBB3 - Development Docker Master - PHP 7.1 - SQLite Package
bamboo_planRepository_1_revision=53025be19166827c3a39fcc0152ea19dcb68ed21
bamboo_repository_name=phpBB Master
bamboo_buildFailed=false
bamboo_capability_system_docker_executable=/usr/bin/docker
bamboo_repository_75956230_git_username=
bamboo_planRepository_branch=master
bamboo_agentWorkingDirectory=/home/bamboo/xml-data/build-dir
bamboo_capability_system_git_executable=/usr/bin/git
bamboo_capability_system_builder_phpunit_PHPUnit_3_4=/usr/bin/phpunit
bamboo_repository_git_username=
bamboo_planRepository_1_previousRevision=04cfbd643744d7988bc809bac46017a4578143e2
bamboo_repository_75956230_branch_name=master
bamboo_planRepository_branchDisplayName=master
bamboo_planRepository_1_type=gitv2
bamboo_planRepository_branchName=master
bamboo_capability_system_jdk_JDK=/usr/lib/jvm/java-6-sun
bamboo_plan_storageTag=PHPBB3-DDM
bamboo_hg_cache_directory=/home/bamboo/xml-data/build-dir/_hg-repositories-cache
bamboo_planRepository_1_username=
bamboo_planRepository_type=gitv2
bamboo_git_cache_directory=/home/bamboo/xml-data/build-dir/_git-repositories-cache
bamboo_repository_git_repositoryUrl=https://github.com/phpbb/phpbb.git
bamboo_capability_system_builder_ant_Ant=/usr/share/ant
bamboo_repository_75956230_revision_number=53025be19166827c3a39fcc0152ea19dcb68ed21
bamboo_tmp_directory=/home/bamboo/temp
bamboo_working_directory=/home/bamboo/xml-data/build-dir/PHPBB3-DDM-P5SP
bamboo_planKey=PHPBB3-DDM
bamboo_capability_local=true
bamboo_planRepository_1_repositoryUrl=https://github.com/phpbb/phpbb.git
bamboo_planRepository_username=
bamboo_capability_system_jdk_JDK_1_6=/usr/lib/jvm/java-6-sun
bamboo_capability_system_jdk_JDK_1_7=/usr/lib/jvm/java-7-openjdk-amd64
bamboo_planRepository_1_branchName=master
12-May-2019 20:39:33 Sending build context to Docker daemon  20.66MB
12-May-2019 20:39:33
12-May-2019 20:39:34 Step 1/6 : FROM php:7.1
12-May-2019 20:39:35 7.1: Pulling from library/php
12-May-2019 20:39:35 743f2d6c1f65: Pulling fs layer
12-May-2019 20:39:35 6307e89982cc: Pulling fs layer
12-May-2019 20:39:35 807218e72ce2: Pulling fs layer
12-May-2019 20:39:35 5108df1d03f8: Pulling fs layer
12-May-2019 20:39:35 986b146a1f15: Pulling fs layer
12-May-2019 20:39:35 4f3abbd30807: Pulling fs layer
12-May-2019 20:39:35 9c4066d33c05: Pulling fs layer
12-May-2019 20:39:35 e72c42222a02: Pulling fs layer
12-May-2019 20:39:35 5108df1d03f8: Waiting
12-May-2019 20:39:35 986b146a1f15: Waiting
12-May-2019 20:39:35 4f3abbd30807: Waiting
12-May-2019 20:39:35 9c4066d33c05: Waiting
12-May-2019 20:39:35 e72c42222a02: Waiting
12-May-2019 20:39:36 6307e89982cc: Verifying Checksum
12-May-2019 20:39:36 6307e89982cc: Download complete
12-May-2019 20:39:36 5108df1d03f8: Verifying Checksum
12-May-2019 20:39:36 5108df1d03f8: Download complete
12-May-2019 20:39:36 743f2d6c1f65: Verifying Checksum
12-May-2019 20:39:36 743f2d6c1f65: Download complete
12-May-2019 20:39:37 4f3abbd30807: Verifying Checksum
12-May-2019 20:39:37 4f3abbd30807: Download complete
12-May-2019 20:39:38 807218e72ce2: Verifying Checksum
12-May-2019 20:39:38 807218e72ce2: Download complete
12-May-2019 20:39:38 986b146a1f15: Verifying Checksum
12-May-2019 20:39:38 986b146a1f15: Download complete
12-May-2019 20:39:38 e72c42222a02: Verifying Checksum
12-May-2019 20:39:38 e72c42222a02: Download complete
12-May-2019 20:39:39 743f2d6c1f65: Pull complete
12-May-2019 20:39:39 6307e89982cc: Pull complete
12-May-2019 20:39:39 9c4066d33c05: Verifying Checksum
12-May-2019 20:39:39 9c4066d33c05: Download complete
12-May-2019 20:39:43 807218e72ce2: Pull complete
12-May-2019 20:39:45 5108df1d03f8: Pull complete
12-May-2019 20:39:45 986b146a1f15: Pull complete
12-May-2019 20:39:46 4f3abbd30807: Pull complete
12-May-2019 20:39:47 9c4066d33c05: Pull complete
12-May-2019 20:39:48 e72c42222a02: Pull complete
12-May-2019 20:39:48 Digest: sha256:0dfa995c5452f6544f2f15066ed57aeddfbae6cbab70539ea7461153eacacea8
12-May-2019 20:39:48 Status: Downloaded newer image for php:7.1
12-May-2019 20:39:48 ---> f448caa23caa
12-May-2019 20:39:48 Step 2/6 : RUN apt-get update && apt-get install -y         git         zlib1g-dev         bzip2         zip         && docker-php-ext-install -j$(nproc) zip
12-May-2019 20:39:48 ---> Running in 065ca5004817
12-May-2019 20:40:11 Err:1 http://security.debian.org/debian-security stretch/updates InRelease
12-May-2019 20:40:11   Temporary failure resolving 'security.debian.org'
12-May-2019 20:40:11 Err:2 http://deb.debian.org/debian stretch InRelease
12-May-2019 20:40:11   Temporary failure resolving 'deb.debian.org'
12-May-2019 20:40:31 Err:3 http://deb.debian.org/debian stretch-updates InRelease
12-May-2019 20:40:31   Temporary failure resolving 'deb.debian.org'
12-May-2019 20:40:31 Reading package lists...
12-May-2019 20:40:31 W: Failed to fetch http://deb.debian.org/debian/dists/stretch/InRelease  Temporary failure resolving 'deb.debian.org'
12-May-2019 20:40:31 W: Failed to fetch http://security.debian.org/debian-security/dists/stretch/updates/InRelease  Temporary failure resolving 'security.debian.org'
12-May-2019 20:40:31 W: Failed to fetch http://deb.debian.org/debian/dists/stretch-updates/InRelease  Temporary failure resolving 'deb.debian.org'
12-May-2019 20:40:31 W: Some index files failed to download. They have been ignored, or old ones used instead.
12-May-2019 20:40:31 Reading package lists...
12-May-2019 20:40:31 Building dependency tree...
12-May-2019 20:40:31 Reading state information...
12-May-2019 20:40:31 E: Unable to locate package git
12-May-2019 20:40:31 E: Unable to locate package zlib1g-dev
12-May-2019 20:40:31 E: Unable to locate package zip
12-May-2019 20:40:32 Removing intermediate container 065ca5004817
12-May-2019 20:40:32 The command '/bin/sh -c apt-get update && apt-get install -y         git         zlib1g-dev         bzip2         zip         && docker-php-ext-install -j$(nproc) zip' returned a non-zero code: 100
12-May-2019 20:40:32 Failing task since return code of [/usr/bin/docker build --force-rm=true --tag=phpbb:php-7.1 /home/bamboo/xml-data/build-dir/PHPBB3-DDM-P5SP] was 100 while expected 0
12-May-2019 20:40:32 Error occurred while running Task 'Build image(3)' of type com.atlassian.bamboo.plugins.bamboo-docker-plugin:task.docker.cli.
12-May-2019 20:40:32 com.atlassian.bamboo.task.TaskException: Failed to execute task
12-May-2019 20:40:32         at com.atlassian.bamboo.plugins.docker.service.BuildService.execute(BuildService.java:53)
12-May-2019 20:40:32         at com.atlassian.bamboo.plugins.docker.tasks.cli.DockerCliTask.execute(DockerCliTask.java:70)
12-May-2019 20:40:32         at com.atlassian.bamboo.task.TaskExecutorImpl.lambda$executeTasks$3(TaskExecutorImpl.java:285)
12-May-2019 20:40:32         at com.atlassian.bamboo.task.TaskExecutorImpl.executeTaskWithPrePostActions(TaskExecutorImpl.java:224)
12-May-2019 20:40:32         at com.atlassian.bamboo.task.TaskExecutorImpl.executeTasks(TaskExecutorImpl.java:285)
12-May-2019 20:40:32         at com.atlassian.bamboo.task.TaskExecutorImpl.execute(TaskExecutorImpl.java:112)
12-May-2019 20:40:32         at com.atlassian.bamboo.build.pipeline.tasks.ExecuteBuildTask.call(ExecuteBuildTask.java:71)
12-May-2019 20:40:32         at com.atlassian.bamboo.v2.build.agent.DefaultBuildAgent.executeBuildPhase(DefaultBuildAgent.java:203)
12-May-2019 20:40:32         at com.atlassian.bamboo.v2.build.agent.DefaultBuildAgent.build(DefaultBuildAgent.java:175)
12-May-2019 20:40:32         at com.atlassian.bamboo.v2.build.agent.BuildAgentControllerImpl.lambda$waitAndPerformBuild$0(BuildAgentControllerImpl.java:122)
12-May-2019 20:40:32         at com.atlassian.bamboo.variable.CustomVariableContextImpl.withVariableSubstitutor(CustomVariableContextImpl.java:185)
12-May-2019 20:40:32         at com.atlassian.bamboo.v2.build.agent.BuildAgentControllerImpl.waitAndPerformBuild(BuildAgentControllerImpl.java:117)
12-May-2019 20:40:32         at com.atlassian.bamboo.v2.build.agent.DefaultBuildAgent$1.run(DefaultBuildAgent.java:126)
12-May-2019 20:40:32         at com.atlassian.bamboo.utils.BambooRunnables$1.run(BambooRunnables.java:48)
12-May-2019 20:40:32         at com.atlassian.bamboo.security.ImpersonationHelper.runWith(ImpersonationHelper.java:26)
12-May-2019 20:40:32         at com.atlassian.bamboo.security.ImpersonationHelper.runWithSystemAuthority(ImpersonationHelper.java:17)
12-May-2019 20:40:32         at com.atlassian.bamboo.security.ImpersonationHelper$1.run(ImpersonationHelper.java:41)
12-May-2019 20:40:32         at java.lang.Thread.run(Thread.java:748)
12-May-2019 20:40:32 Caused by: com.atlassian.bamboo.docker.DockerException: Error running Docker build command
12-May-2019 20:40:32         at com.atlassian.bamboo.plugins.docker.client.DockerCmd.build(DockerCmd.java:106)
12-May-2019 20:40:32         at com.atlassian.bamboo.plugins.docker.service.BuildService.execute(BuildService.java:40)
12-May-2019 20:40:32         ... 17 more
12-May-2019 20:40:32 Caused by: com.atlassian.utils.process.ProcessException: Error executing /usr/bin/docker build --force-rm=true --tag=phpbb:php-7.1 /home/bamboo/xml-data/build-dir/PHPBB3-DDM-P5SP
12-May-2019 20:40:32         at com.atlassian.bamboo.plugins.docker.process.DockerTaskProcessService.execute(DockerTaskProcessService.java:62)
12-May-2019 20:40:32         at com.atlassian.bamboo.plugins.docker.client.DockerCmd.build(DockerCmd.java:104)
12-May-2019 20:40:32         ... 18 more
12-May-2019 20:40:32 Running post build plugin 'NCover Results Collector'
12-May-2019 20:40:32 Running post build plugin 'Artifact Copier'
12-May-2019 20:40:32 Publishing an artifact: Release Files
12-May-2019 20:40:32 Unable to publish artifact [Release Files]: the source directory /home/bamboo/xml-data/build-dir/PHPBB3-DDM-P5SP/build/new_version/release_files does not exist.
12-May-2019 20:40:32 The artifact hasn't been successfully published after 162.0 μs
12-May-2019 20:40:32 Running post build plugin 'npm Cache Cleanup'
12-May-2019 20:40:32 Running post build plugin 'Clover Results Collector'
12-May-2019 20:40:32 Running post build plugin 'Docker Container Cleanup'
12-May-2019 20:40:32 Successfully removed working directory at '/home/bamboo/xml-data/build-dir/PHPBB3-DDM-P5SP'
12-May-2019 20:40:32 Finalising the build...
12-May-2019 20:40:32 Stopping timer.
12-May-2019 20:40:32 Build PHPBB3-DDM-P5SP-526 completed.
12-May-2019 20:40:32 Running on server: post build plugin 'NCover Results Collector'
12-May-2019 20:40:32 Running on server: post build plugin 'Build Hanging Detection Configuration'
12-May-2019 20:40:32 Running on server: post build plugin 'Clover Delta Calculator'
12-May-2019 20:40:32 Running on server: post build plugin 'Maven Dependencies Postprocessor'
12-May-2019 20:40:32 All post build plugins have finished
12-May-2019 20:40:32 Generating build results summary...
12-May-2019 20:40:32 Saving build results to disk...
12-May-2019 20:40:32 Logging substituted variables...
12-May-2019 20:40:32 Indexing build results...
12-May-2019 20:40:32 Finished building PHPBB3-DDM-P5SP-526.