Tests pending pull requests

Build: #9558 failed

Job: Build and Test Job failed

Stages & jobs

  1. Build and Test

Build log

The build generated 12,419 lines of output.The output is too long and has been truncated to the last 1,000 lines. Download or view full build log

07-Sep-2019 06:42:32 #6 /data/phpBB/vendor/phpunit/phpunit/src/TextUI/Command.php(149): PHPUnit_TextUI_TestRunner->doRun(Object(PHPUnit_Framework_TestSuite), Array)
07-Sep-2019 06:42:32 #7 /data/phpBB/vendor/phpunit/phpunit/src/TextUI/Command.php(100): PHPUnit_TextUI_Command->run(Array, true)
07-Sep-2019 06:42:32 #8 /data/phpBB/vendor/phpunit/phpunit/phpunit(52): PHPUnit_TextUI_Command::main()
07-Sep-2019 06:42:32 #9 {main}
07-Sep-2019 06:42:32 848) phpbb_tests_tree_nestedset_forum_get_data_test
07-Sep-2019 06:42:32 UnexpectedValueException: Unable to resolve the dependency '\phpbb\db\migration\data\v32x\v327' in /data/phpBB/phpbb/db/migration/schema_generator.php:238
07-Sep-2019 06:42:32 Stack trace:
07-Sep-2019 06:42:32 #0 /data/phpBB/phpbb/db/migration/schema_generator.php(214): phpbb\db\migration\schema_generator->check_dependencies()
07-Sep-2019 06:42:32 #1 /data/tests/test_framework/phpbb_database_test_case.php(84): phpbb\db\migration\schema_generator->get_schema()
07-Sep-2019 06:42:32 #2 /data/phpBB/vendor/phpunit/phpunit/src/Framework/TestSuite.php(672): phpbb_database_test_case::setUpBeforeClass()
07-Sep-2019 06:42:32 #3 /data/phpBB/vendor/phpunit/phpunit/src/Framework/TestSuite.php(722): PHPUnit_Framework_TestSuite->run(Object(PHPUnit_Framework_TestResult))
07-Sep-2019 06:42:32 #4 /data/phpBB/vendor/phpunit/phpunit/src/Framework/TestSuite.php(722): PHPUnit_Framework_TestSuite->run(Object(PHPUnit_Framework_TestResult))
07-Sep-2019 06:42:32 #5 /data/phpBB/vendor/phpunit/phpunit/src/TextUI/TestRunner.php(440): PHPUnit_Framework_TestSuite->run(Object(PHPUnit_Framework_TestResult))
07-Sep-2019 06:42:32 #6 /data/phpBB/vendor/phpunit/phpunit/src/TextUI/Command.php(149): PHPUnit_TextUI_TestRunner->doRun(Object(PHPUnit_Framework_TestSuite), Array)
07-Sep-2019 06:42:32 #7 /data/phpBB/vendor/phpunit/phpunit/src/TextUI/Command.php(100): PHPUnit_TextUI_Command->run(Array, true)
07-Sep-2019 06:42:32 #8 /data/phpBB/vendor/phpunit/phpunit/phpunit(52): PHPUnit_TextUI_Command::main()
07-Sep-2019 06:42:32 #9 {main}
07-Sep-2019 06:42:32 849) phpbb_tests_tree_nestedset_forum_get_data_test
07-Sep-2019 06:42:32 UnexpectedValueException: Unable to resolve the dependency '\phpbb\db\migration\data\v32x\v327' in /data/phpBB/phpbb/db/migration/schema_generator.php:238
07-Sep-2019 06:42:32 Stack trace:
07-Sep-2019 06:42:32 #0 /data/phpBB/phpbb/db/migration/schema_generator.php(214): phpbb\db\migration\schema_generator->check_dependencies()
07-Sep-2019 06:42:32 #1 /data/tests/test_framework/phpbb_database_test_case.php(84): phpbb\db\migration\schema_generator->get_schema()
07-Sep-2019 06:42:32 #2 /data/phpBB/vendor/phpunit/phpunit/src/Framework/TestSuite.php(672): phpbb_database_test_case::setUpBeforeClass()
07-Sep-2019 06:42:32 #3 /data/phpBB/vendor/phpunit/phpunit/src/Framework/TestSuite.php(722): PHPUnit_Framework_TestSuite->run(Object(PHPUnit_Framework_TestResult))
07-Sep-2019 06:42:32 #4 /data/phpBB/vendor/phpunit/phpunit/src/Framework/TestSuite.php(722): PHPUnit_Framework_TestSuite->run(Object(PHPUnit_Framework_TestResult))
07-Sep-2019 06:42:32 #5 /data/phpBB/vendor/phpunit/phpunit/src/TextUI/TestRunner.php(440): PHPUnit_Framework_TestSuite->run(Object(PHPUnit_Framework_TestResult))
07-Sep-2019 06:42:32 #6 /data/phpBB/vendor/phpunit/phpunit/src/TextUI/Command.php(149): PHPUnit_TextUI_TestRunner->doRun(Object(PHPUnit_Framework_TestSuite), Array)
07-Sep-2019 06:42:32 #7 /data/phpBB/vendor/phpunit/phpunit/src/TextUI/Command.php(100): PHPUnit_TextUI_Command->run(Array, true)
07-Sep-2019 06:42:32 #8 /data/phpBB/vendor/phpunit/phpunit/phpunit(52): PHPUnit_TextUI_Command::main()
07-Sep-2019 06:42:32 #9 {main}
07-Sep-2019 06:42:32 850) phpbb_tests_tree_nestedset_forum_get_data_test
07-Sep-2019 06:42:32 UnexpectedValueException: Unable to resolve the dependency '\phpbb\db\migration\data\v32x\v327' in /data/phpBB/phpbb/db/migration/schema_generator.php:238
07-Sep-2019 06:42:32 Stack trace:
07-Sep-2019 06:42:32 #0 /data/phpBB/phpbb/db/migration/schema_generator.php(214): phpbb\db\migration\schema_generator->check_dependencies()
07-Sep-2019 06:42:32 #1 /data/tests/test_framework/phpbb_database_test_case.php(84): phpbb\db\migration\schema_generator->get_schema()
07-Sep-2019 06:42:32 #2 /data/phpBB/vendor/phpunit/phpunit/src/Framework/TestSuite.php(672): phpbb_database_test_case::setUpBeforeClass()
07-Sep-2019 06:42:32 #3 /data/phpBB/vendor/phpunit/phpunit/src/Framework/TestSuite.php(722): PHPUnit_Framework_TestSuite->run(Object(PHPUnit_Framework_TestResult))
07-Sep-2019 06:42:32 #4 /data/phpBB/vendor/phpunit/phpunit/src/Framework/TestSuite.php(722): PHPUnit_Framework_TestSuite->run(Object(PHPUnit_Framework_TestResult))
07-Sep-2019 06:42:32 #5 /data/phpBB/vendor/phpunit/phpunit/src/TextUI/TestRunner.php(440): PHPUnit_Framework_TestSuite->run(Object(PHPUnit_Framework_TestResult))
07-Sep-2019 06:42:32 #6 /data/phpBB/vendor/phpunit/phpunit/src/TextUI/Command.php(149): PHPUnit_TextUI_TestRunner->doRun(Object(PHPUnit_Framework_TestSuite), Array)
07-Sep-2019 06:42:32 #7 /data/phpBB/vendor/phpunit/phpunit/src/TextUI/Command.php(100): PHPUnit_TextUI_Command->run(Array, true)
07-Sep-2019 06:42:32 #8 /data/phpBB/vendor/phpunit/phpunit/phpunit(52): PHPUnit_TextUI_Command::main()
07-Sep-2019 06:42:32 #9 {main}
07-Sep-2019 06:42:32 851) phpbb_tests_tree_nestedset_forum_get_data_test
07-Sep-2019 06:42:32 UnexpectedValueException: Unable to resolve the dependency '\phpbb\db\migration\data\v32x\v327' in /data/phpBB/phpbb/db/migration/schema_generator.php:238
07-Sep-2019 06:42:32 Stack trace:
07-Sep-2019 06:42:32 #0 /data/phpBB/phpbb/db/migration/schema_generator.php(214): phpbb\db\migration\schema_generator->check_dependencies()
07-Sep-2019 06:42:32 #1 /data/tests/test_framework/phpbb_database_test_case.php(84): phpbb\db\migration\schema_generator->get_schema()
07-Sep-2019 06:42:32 #2 /data/phpBB/vendor/phpunit/phpunit/src/Framework/TestSuite.php(672): phpbb_database_test_case::setUpBeforeClass()
07-Sep-2019 06:42:32 #3 /data/phpBB/vendor/phpunit/phpunit/src/Framework/TestSuite.php(722): PHPUnit_Framework_TestSuite->run(Object(PHPUnit_Framework_TestResult))
07-Sep-2019 06:42:32 #4 /data/phpBB/vendor/phpunit/phpunit/src/Framework/TestSuite.php(722): PHPUnit_Framework_TestSuite->run(Object(PHPUnit_Framework_TestResult))
07-Sep-2019 06:42:32 #5 /data/phpBB/vendor/phpunit/phpunit/src/TextUI/TestRunner.php(440): PHPUnit_Framework_TestSuite->run(Object(PHPUnit_Framework_TestResult))
07-Sep-2019 06:42:32 #6 /data/phpBB/vendor/phpunit/phpunit/src/TextUI/Command.php(149): PHPUnit_TextUI_TestRunner->doRun(Object(PHPUnit_Framework_TestSuite), Array)
07-Sep-2019 06:42:32 #7 /data/phpBB/vendor/phpunit/phpunit/src/TextUI/Command.php(100): PHPUnit_TextUI_Command->run(Array, true)
07-Sep-2019 06:42:32 #8 /data/phpBB/vendor/phpunit/phpunit/phpunit(52): PHPUnit_TextUI_Command::main()
07-Sep-2019 06:42:32 #9 {main}
07-Sep-2019 06:42:32 852) phpbb_tests_tree_nestedset_forum_get_data_test
07-Sep-2019 06:42:32 UnexpectedValueException: Unable to resolve the dependency '\phpbb\db\migration\data\v32x\v327' in /data/phpBB/phpbb/db/migration/schema_generator.php:238
07-Sep-2019 06:42:32 Stack trace:
07-Sep-2019 06:42:32 #0 /data/phpBB/phpbb/db/migration/schema_generator.php(214): phpbb\db\migration\schema_generator->check_dependencies()
07-Sep-2019 06:42:32 #1 /data/tests/test_framework/phpbb_database_test_case.php(84): phpbb\db\migration\schema_generator->get_schema()
07-Sep-2019 06:42:32 #2 /data/phpBB/vendor/phpunit/phpunit/src/Framework/TestSuite.php(672): phpbb_database_test_case::setUpBeforeClass()
07-Sep-2019 06:42:32 #3 /data/phpBB/vendor/phpunit/phpunit/src/Framework/TestSuite.php(722): PHPUnit_Framework_TestSuite->run(Object(PHPUnit_Framework_TestResult))
07-Sep-2019 06:42:32 #4 /data/phpBB/vendor/phpunit/phpunit/src/Framework/TestSuite.php(722): PHPUnit_Framework_TestSuite->run(Object(PHPUnit_Framework_TestResult))
07-Sep-2019 06:42:32 #5 /data/phpBB/vendor/phpunit/phpunit/src/TextUI/TestRunner.php(440): PHPUnit_Framework_TestSuite->run(Object(PHPUnit_Framework_TestResult))
07-Sep-2019 06:42:32 #6 /data/phpBB/vendor/phpunit/phpunit/src/TextUI/Command.php(149): PHPUnit_TextUI_TestRunner->doRun(Object(PHPUnit_Framework_TestSuite), Array)
07-Sep-2019 06:42:32 #7 /data/phpBB/vendor/phpunit/phpunit/src/TextUI/Command.php(100): PHPUnit_TextUI_Command->run(Array, true)
07-Sep-2019 06:42:32 #8 /data/phpBB/vendor/phpunit/phpunit/phpunit(52): PHPUnit_TextUI_Command::main()
07-Sep-2019 06:42:32 #9 {main}
07-Sep-2019 06:42:32 853) phpbb_tests_tree_nestedset_forum_get_data_test
07-Sep-2019 06:42:32 UnexpectedValueException: Unable to resolve the dependency '\phpbb\db\migration\data\v32x\v327' in /data/phpBB/phpbb/db/migration/schema_generator.php:238
07-Sep-2019 06:42:32 Stack trace:
07-Sep-2019 06:42:32 #0 /data/phpBB/phpbb/db/migration/schema_generator.php(214): phpbb\db\migration\schema_generator->check_dependencies()
07-Sep-2019 06:42:32 #1 /data/tests/test_framework/phpbb_database_test_case.php(84): phpbb\db\migration\schema_generator->get_schema()
07-Sep-2019 06:42:32 #2 /data/phpBB/vendor/phpunit/phpunit/src/Framework/TestSuite.php(672): phpbb_database_test_case::setUpBeforeClass()
07-Sep-2019 06:42:32 #3 /data/phpBB/vendor/phpunit/phpunit/src/Framework/TestSuite.php(722): PHPUnit_Framework_TestSuite->run(Object(PHPUnit_Framework_TestResult))
07-Sep-2019 06:42:32 #4 /data/phpBB/vendor/phpunit/phpunit/src/Framework/TestSuite.php(722): PHPUnit_Framework_TestSuite->run(Object(PHPUnit_Framework_TestResult))
07-Sep-2019 06:42:32 #5 /data/phpBB/vendor/phpunit/phpunit/src/TextUI/TestRunner.php(440): PHPUnit_Framework_TestSuite->run(Object(PHPUnit_Framework_TestResult))
07-Sep-2019 06:42:32 #6 /data/phpBB/vendor/phpunit/phpunit/src/TextUI/Command.php(149): PHPUnit_TextUI_TestRunner->doRun(Object(PHPUnit_Framework_TestSuite), Array)
07-Sep-2019 06:42:32 #7 /data/phpBB/vendor/phpunit/phpunit/src/TextUI/Command.php(100): PHPUnit_TextUI_Command->run(Array, true)
07-Sep-2019 06:42:32 #8 /data/phpBB/vendor/phpunit/phpunit/phpunit(52): PHPUnit_TextUI_Command::main()
07-Sep-2019 06:42:32 #9 {main}
07-Sep-2019 06:42:32 854) phpbb_tests_tree_nestedset_forum_get_data_test
07-Sep-2019 06:42:32 UnexpectedValueException: Unable to resolve the dependency '\phpbb\db\migration\data\v32x\v327' in /data/phpBB/phpbb/db/migration/schema_generator.php:238
07-Sep-2019 06:42:32 Stack trace:
07-Sep-2019 06:42:32 #0 /data/phpBB/phpbb/db/migration/schema_generator.php(214): phpbb\db\migration\schema_generator->check_dependencies()
07-Sep-2019 06:42:32 #1 /data/tests/test_framework/phpbb_database_test_case.php(84): phpbb\db\migration\schema_generator->get_schema()
07-Sep-2019 06:42:32 #2 /data/phpBB/vendor/phpunit/phpunit/src/Framework/TestSuite.php(672): phpbb_database_test_case::setUpBeforeClass()
07-Sep-2019 06:42:32 #3 /data/phpBB/vendor/phpunit/phpunit/src/Framework/TestSuite.php(722): PHPUnit_Framework_TestSuite->run(Object(PHPUnit_Framework_TestResult))
07-Sep-2019 06:42:32 #4 /data/phpBB/vendor/phpunit/phpunit/src/Framework/TestSuite.php(722): PHPUnit_Framework_TestSuite->run(Object(PHPUnit_Framework_TestResult))
07-Sep-2019 06:42:32 #5 /data/phpBB/vendor/phpunit/phpunit/src/TextUI/TestRunner.php(440): PHPUnit_Framework_TestSuite->run(Object(PHPUnit_Framework_TestResult))
07-Sep-2019 06:42:32 #6 /data/phpBB/vendor/phpunit/phpunit/src/TextUI/Command.php(149): PHPUnit_TextUI_TestRunner->doRun(Object(PHPUnit_Framework_TestSuite), Array)
07-Sep-2019 06:42:32 #7 /data/phpBB/vendor/phpunit/phpunit/src/TextUI/Command.php(100): PHPUnit_TextUI_Command->run(Array, true)
07-Sep-2019 06:42:32 #8 /data/phpBB/vendor/phpunit/phpunit/phpunit(52): PHPUnit_TextUI_Command::main()
07-Sep-2019 06:42:32 #9 {main}
07-Sep-2019 06:42:32 855) phpbb_tests_tree_nestedset_forum_get_data_test
07-Sep-2019 06:42:32 UnexpectedValueException: Unable to resolve the dependency '\phpbb\db\migration\data\v32x\v327' in /data/phpBB/phpbb/db/migration/schema_generator.php:238
07-Sep-2019 06:42:32 Stack trace:
07-Sep-2019 06:42:32 #0 /data/phpBB/phpbb/db/migration/schema_generator.php(214): phpbb\db\migration\schema_generator->check_dependencies()
07-Sep-2019 06:42:32 #1 /data/tests/test_framework/phpbb_database_test_case.php(84): phpbb\db\migration\schema_generator->get_schema()
07-Sep-2019 06:42:32 #2 /data/phpBB/vendor/phpunit/phpunit/src/Framework/TestSuite.php(672): phpbb_database_test_case::setUpBeforeClass()
07-Sep-2019 06:42:32 #3 /data/phpBB/vendor/phpunit/phpunit/src/Framework/TestSuite.php(722): PHPUnit_Framework_TestSuite->run(Object(PHPUnit_Framework_TestResult))
07-Sep-2019 06:42:32 #4 /data/phpBB/vendor/phpunit/phpunit/src/Framework/TestSuite.php(722): PHPUnit_Framework_TestSuite->run(Object(PHPUnit_Framework_TestResult))
07-Sep-2019 06:42:32 #5 /data/phpBB/vendor/phpunit/phpunit/src/TextUI/TestRunner.php(440): PHPUnit_Framework_TestSuite->run(Object(PHPUnit_Framework_TestResult))
07-Sep-2019 06:42:32 #6 /data/phpBB/vendor/phpunit/phpunit/src/TextUI/Command.php(149): PHPUnit_TextUI_TestRunner->doRun(Object(PHPUnit_Framework_TestSuite), Array)
07-Sep-2019 06:42:32 #7 /data/phpBB/vendor/phpunit/phpunit/src/TextUI/Command.php(100): PHPUnit_TextUI_Command->run(Array, true)
07-Sep-2019 06:42:32 #8 /data/phpBB/vendor/phpunit/phpunit/phpunit(52): PHPUnit_TextUI_Command::main()
07-Sep-2019 06:42:32 #9 {main}
07-Sep-2019 06:42:32 856) phpbb_tests_tree_nestedset_forum_get_data_test
07-Sep-2019 06:42:32 UnexpectedValueException: Unable to resolve the dependency '\phpbb\db\migration\data\v32x\v327' in /data/phpBB/phpbb/db/migration/schema_generator.php:238
07-Sep-2019 06:42:32 Stack trace:
07-Sep-2019 06:42:32 #0 /data/phpBB/phpbb/db/migration/schema_generator.php(214): phpbb\db\migration\schema_generator->check_dependencies()
07-Sep-2019 06:42:32 #1 /data/tests/test_framework/phpbb_database_test_case.php(84): phpbb\db\migration\schema_generator->get_schema()
07-Sep-2019 06:42:32 #2 /data/phpBB/vendor/phpunit/phpunit/src/Framework/TestSuite.php(672): phpbb_database_test_case::setUpBeforeClass()
07-Sep-2019 06:42:32 #3 /data/phpBB/vendor/phpunit/phpunit/src/Framework/TestSuite.php(722): PHPUnit_Framework_TestSuite->run(Object(PHPUnit_Framework_TestResult))
07-Sep-2019 06:42:32 #4 /data/phpBB/vendor/phpunit/phpunit/src/Framework/TestSuite.php(722): PHPUnit_Framework_TestSuite->run(Object(PHPUnit_Framework_TestResult))
07-Sep-2019 06:42:32 #5 /data/phpBB/vendor/phpunit/phpunit/src/TextUI/TestRunner.php(440): PHPUnit_Framework_TestSuite->run(Object(PHPUnit_Framework_TestResult))
07-Sep-2019 06:42:32 #6 /data/phpBB/vendor/phpunit/phpunit/src/TextUI/Command.php(149): PHPUnit_TextUI_TestRunner->doRun(Object(PHPUnit_Framework_TestSuite), Array)
07-Sep-2019 06:42:32 #7 /data/phpBB/vendor/phpunit/phpunit/src/TextUI/Command.php(100): PHPUnit_TextUI_Command->run(Array, true)
07-Sep-2019 06:42:32 #8 /data/phpBB/vendor/phpunit/phpunit/phpunit(52): PHPUnit_TextUI_Command::main()
07-Sep-2019 06:42:32 #9 {main}
07-Sep-2019 06:42:32 857) phpbb_tests_tree_nestedset_forum_add_remove_test
07-Sep-2019 06:42:32 UnexpectedValueException: Unable to resolve the dependency '\phpbb\db\migration\data\v32x\v327' in /data/phpBB/phpbb/db/migration/schema_generator.php:238
07-Sep-2019 06:42:32 Stack trace:
07-Sep-2019 06:42:32 #0 /data/phpBB/phpbb/db/migration/schema_generator.php(214): phpbb\db\migration\schema_generator->check_dependencies()
07-Sep-2019 06:42:32 #1 /data/tests/test_framework/phpbb_database_test_case.php(84): phpbb\db\migration\schema_generator->get_schema()
07-Sep-2019 06:42:32 #2 /data/phpBB/vendor/phpunit/phpunit/src/Framework/TestSuite.php(672): phpbb_database_test_case::setUpBeforeClass()
07-Sep-2019 06:42:32 #3 /data/phpBB/vendor/phpunit/phpunit/src/Framework/TestSuite.php(722): PHPUnit_Framework_TestSuite->run(Object(PHPUnit_Framework_TestResult))
07-Sep-2019 06:42:32 #4 /data/phpBB/vendor/phpunit/phpunit/src/Framework/TestSuite.php(722): PHPUnit_Framework_TestSuite->run(Object(PHPUnit_Framework_TestResult))
07-Sep-2019 06:42:32 #5 /data/phpBB/vendor/phpunit/phpunit/src/TextUI/TestRunner.php(440): PHPUnit_Framework_TestSuite->run(Object(PHPUnit_Framework_TestResult))
07-Sep-2019 06:42:32 #6 /data/phpBB/vendor/phpunit/phpunit/src/TextUI/Command.php(149): PHPUnit_TextUI_TestRunner->doRun(Object(PHPUnit_Framework_TestSuite), Array)
07-Sep-2019 06:42:32 #7 /data/phpBB/vendor/phpunit/phpunit/src/TextUI/Command.php(100): PHPUnit_TextUI_Command->run(Array, true)
07-Sep-2019 06:42:32 #8 /data/phpBB/vendor/phpunit/phpunit/phpunit(52): PHPUnit_TextUI_Command::main()
07-Sep-2019 06:42:32 #9 {main}
07-Sep-2019 06:42:32 858) phpbb_tests_tree_nestedset_forum_add_remove_test
07-Sep-2019 06:42:32 UnexpectedValueException: Unable to resolve the dependency '\phpbb\db\migration\data\v32x\v327' in /data/phpBB/phpbb/db/migration/schema_generator.php:238
07-Sep-2019 06:42:32 Stack trace:
07-Sep-2019 06:42:32 #0 /data/phpBB/phpbb/db/migration/schema_generator.php(214): phpbb\db\migration\schema_generator->check_dependencies()
07-Sep-2019 06:42:32 #1 /data/tests/test_framework/phpbb_database_test_case.php(84): phpbb\db\migration\schema_generator->get_schema()
07-Sep-2019 06:42:32 #2 /data/phpBB/vendor/phpunit/phpunit/src/Framework/TestSuite.php(672): phpbb_database_test_case::setUpBeforeClass()
07-Sep-2019 06:42:32 #3 /data/phpBB/vendor/phpunit/phpunit/src/Framework/TestSuite.php(722): PHPUnit_Framework_TestSuite->run(Object(PHPUnit_Framework_TestResult))
07-Sep-2019 06:42:32 #4 /data/phpBB/vendor/phpunit/phpunit/src/Framework/TestSuite.php(722): PHPUnit_Framework_TestSuite->run(Object(PHPUnit_Framework_TestResult))
07-Sep-2019 06:42:32 #5 /data/phpBB/vendor/phpunit/phpunit/src/TextUI/TestRunner.php(440): PHPUnit_Framework_TestSuite->run(Object(PHPUnit_Framework_TestResult))
07-Sep-2019 06:42:32 #6 /data/phpBB/vendor/phpunit/phpunit/src/TextUI/Command.php(149): PHPUnit_TextUI_TestRunner->doRun(Object(PHPUnit_Framework_TestSuite), Array)
07-Sep-2019 06:42:32 #7 /data/phpBB/vendor/phpunit/phpunit/src/TextUI/Command.php(100): PHPUnit_TextUI_Command->run(Array, true)
07-Sep-2019 06:42:32 #8 /data/phpBB/vendor/phpunit/phpunit/phpunit(52): PHPUnit_TextUI_Command::main()
07-Sep-2019 06:42:32 #9 {main}
07-Sep-2019 06:42:32 859) phpbb_tests_tree_nestedset_forum_add_remove_test
07-Sep-2019 06:42:32 UnexpectedValueException: Unable to resolve the dependency '\phpbb\db\migration\data\v32x\v327' in /data/phpBB/phpbb/db/migration/schema_generator.php:238
07-Sep-2019 06:42:32 Stack trace:
07-Sep-2019 06:42:32 #0 /data/phpBB/phpbb/db/migration/schema_generator.php(214): phpbb\db\migration\schema_generator->check_dependencies()
07-Sep-2019 06:42:32 #1 /data/tests/test_framework/phpbb_database_test_case.php(84): phpbb\db\migration\schema_generator->get_schema()
07-Sep-2019 06:42:32 #2 /data/phpBB/vendor/phpunit/phpunit/src/Framework/TestSuite.php(672): phpbb_database_test_case::setUpBeforeClass()
07-Sep-2019 06:42:32 #3 /data/phpBB/vendor/phpunit/phpunit/src/Framework/TestSuite.php(722): PHPUnit_Framework_TestSuite->run(Object(PHPUnit_Framework_TestResult))
07-Sep-2019 06:42:32 #4 /data/phpBB/vendor/phpunit/phpunit/src/Framework/TestSuite.php(722): PHPUnit_Framework_TestSuite->run(Object(PHPUnit_Framework_TestResult))
07-Sep-2019 06:42:32 #5 /data/phpBB/vendor/phpunit/phpunit/src/TextUI/TestRunner.php(440): PHPUnit_Framework_TestSuite->run(Object(PHPUnit_Framework_TestResult))
07-Sep-2019 06:42:32 #6 /data/phpBB/vendor/phpunit/phpunit/src/TextUI/Command.php(149): PHPUnit_TextUI_TestRunner->doRun(Object(PHPUnit_Framework_TestSuite), Array)
07-Sep-2019 06:42:32 #7 /data/phpBB/vendor/phpunit/phpunit/src/TextUI/Command.php(100): PHPUnit_TextUI_Command->run(Array, true)
07-Sep-2019 06:42:32 #8 /data/phpBB/vendor/phpunit/phpunit/phpunit(52): PHPUnit_TextUI_Command::main()
07-Sep-2019 06:42:32 #9 {main}
07-Sep-2019 06:42:32 860) phpbb_tests_tree_nestedset_forum_add_remove_test
07-Sep-2019 06:42:32 UnexpectedValueException: Unable to resolve the dependency '\phpbb\db\migration\data\v32x\v327' in /data/phpBB/phpbb/db/migration/schema_generator.php:238
07-Sep-2019 06:42:32 Stack trace:
07-Sep-2019 06:42:32 #0 /data/phpBB/phpbb/db/migration/schema_generator.php(214): phpbb\db\migration\schema_generator->check_dependencies()
07-Sep-2019 06:42:32 #1 /data/tests/test_framework/phpbb_database_test_case.php(84): phpbb\db\migration\schema_generator->get_schema()
07-Sep-2019 06:42:32 #2 /data/phpBB/vendor/phpunit/phpunit/src/Framework/TestSuite.php(672): phpbb_database_test_case::setUpBeforeClass()
07-Sep-2019 06:42:32 #3 /data/phpBB/vendor/phpunit/phpunit/src/Framework/TestSuite.php(722): PHPUnit_Framework_TestSuite->run(Object(PHPUnit_Framework_TestResult))
07-Sep-2019 06:42:32 #4 /data/phpBB/vendor/phpunit/phpunit/src/Framework/TestSuite.php(722): PHPUnit_Framework_TestSuite->run(Object(PHPUnit_Framework_TestResult))
07-Sep-2019 06:42:32 #5 /data/phpBB/vendor/phpunit/phpunit/src/TextUI/TestRunner.php(440): PHPUnit_Framework_TestSuite->run(Object(PHPUnit_Framework_TestResult))
07-Sep-2019 06:42:32 #6 /data/phpBB/vendor/phpunit/phpunit/src/TextUI/Command.php(149): PHPUnit_TextUI_TestRunner->doRun(Object(PHPUnit_Framework_TestSuite), Array)
07-Sep-2019 06:42:32 #7 /data/phpBB/vendor/phpunit/phpunit/src/TextUI/Command.php(100): PHPUnit_TextUI_Command->run(Array, true)
07-Sep-2019 06:42:32 #8 /data/phpBB/vendor/phpunit/phpunit/phpunit(52): PHPUnit_TextUI_Command::main()
07-Sep-2019 06:42:32 #9 {main}
07-Sep-2019 06:42:32 861) phpbb_tests_tree_nestedset_forum_add_remove_test
07-Sep-2019 06:42:32 UnexpectedValueException: Unable to resolve the dependency '\phpbb\db\migration\data\v32x\v327' in /data/phpBB/phpbb/db/migration/schema_generator.php:238
07-Sep-2019 06:42:32 Stack trace:
07-Sep-2019 06:42:32 #0 /data/phpBB/phpbb/db/migration/schema_generator.php(214): phpbb\db\migration\schema_generator->check_dependencies()
07-Sep-2019 06:42:32 #1 /data/tests/test_framework/phpbb_database_test_case.php(84): phpbb\db\migration\schema_generator->get_schema()
07-Sep-2019 06:42:32 #2 /data/phpBB/vendor/phpunit/phpunit/src/Framework/TestSuite.php(672): phpbb_database_test_case::setUpBeforeClass()
07-Sep-2019 06:42:32 #3 /data/phpBB/vendor/phpunit/phpunit/src/Framework/TestSuite.php(722): PHPUnit_Framework_TestSuite->run(Object(PHPUnit_Framework_TestResult))
07-Sep-2019 06:42:32 #4 /data/phpBB/vendor/phpunit/phpunit/src/Framework/TestSuite.php(722): PHPUnit_Framework_TestSuite->run(Object(PHPUnit_Framework_TestResult))
07-Sep-2019 06:42:32 #5 /data/phpBB/vendor/phpunit/phpunit/src/TextUI/TestRunner.php(440): PHPUnit_Framework_TestSuite->run(Object(PHPUnit_Framework_TestResult))
07-Sep-2019 06:42:32 #6 /data/phpBB/vendor/phpunit/phpunit/src/TextUI/Command.php(149): PHPUnit_TextUI_TestRunner->doRun(Object(PHPUnit_Framework_TestSuite), Array)
07-Sep-2019 06:42:32 #7 /data/phpBB/vendor/phpunit/phpunit/src/TextUI/Command.php(100): PHPUnit_TextUI_Command->run(Array, true)
07-Sep-2019 06:42:32 #8 /data/phpBB/vendor/phpunit/phpunit/phpunit(52): PHPUnit_TextUI_Command::main()
07-Sep-2019 06:42:32 #9 {main}
07-Sep-2019 06:42:32 862) phpbb_tests_tree_nestedset_forum_move_test
07-Sep-2019 06:42:32 UnexpectedValueException: Unable to resolve the dependency '\phpbb\db\migration\data\v32x\v327' in /data/phpBB/phpbb/db/migration/schema_generator.php:238
07-Sep-2019 06:42:32 Stack trace:
07-Sep-2019 06:42:32 #0 /data/phpBB/phpbb/db/migration/schema_generator.php(214): phpbb\db\migration\schema_generator->check_dependencies()
07-Sep-2019 06:42:32 #1 /data/tests/test_framework/phpbb_database_test_case.php(84): phpbb\db\migration\schema_generator->get_schema()
07-Sep-2019 06:42:32 #2 /data/phpBB/vendor/phpunit/phpunit/src/Framework/TestSuite.php(672): phpbb_database_test_case::setUpBeforeClass()
07-Sep-2019 06:42:32 #3 /data/phpBB/vendor/phpunit/phpunit/src/Framework/TestSuite.php(722): PHPUnit_Framework_TestSuite->run(Object(PHPUnit_Framework_TestResult))
07-Sep-2019 06:42:32 #4 /data/phpBB/vendor/phpunit/phpunit/src/Framework/TestSuite.php(722): PHPUnit_Framework_TestSuite->run(Object(PHPUnit_Framework_TestResult))
07-Sep-2019 06:42:32 #5 /data/phpBB/vendor/phpunit/phpunit/src/TextUI/TestRunner.php(440): PHPUnit_Framework_TestSuite->run(Object(PHPUnit_Framework_TestResult))
07-Sep-2019 06:42:32 #6 /data/phpBB/vendor/phpunit/phpunit/src/TextUI/Command.php(149): PHPUnit_TextUI_TestRunner->doRun(Object(PHPUnit_Framework_TestSuite), Array)
07-Sep-2019 06:42:32 #7 /data/phpBB/vendor/phpunit/phpunit/src/TextUI/Command.php(100): PHPUnit_TextUI_Command->run(Array, true)
07-Sep-2019 06:42:32 #8 /data/phpBB/vendor/phpunit/phpunit/phpunit(52): PHPUnit_TextUI_Command::main()
07-Sep-2019 06:42:32 #9 {main}
07-Sep-2019 06:42:32 863) phpbb_tests_tree_nestedset_forum_move_test
07-Sep-2019 06:42:32 UnexpectedValueException: Unable to resolve the dependency '\phpbb\db\migration\data\v32x\v327' in /data/phpBB/phpbb/db/migration/schema_generator.php:238
07-Sep-2019 06:42:32 Stack trace:
07-Sep-2019 06:42:32 #0 /data/phpBB/phpbb/db/migration/schema_generator.php(214): phpbb\db\migration\schema_generator->check_dependencies()
07-Sep-2019 06:42:32 #1 /data/tests/test_framework/phpbb_database_test_case.php(84): phpbb\db\migration\schema_generator->get_schema()
07-Sep-2019 06:42:32 #2 /data/phpBB/vendor/phpunit/phpunit/src/Framework/TestSuite.php(672): phpbb_database_test_case::setUpBeforeClass()
07-Sep-2019 06:42:32 #3 /data/phpBB/vendor/phpunit/phpunit/src/Framework/TestSuite.php(722): PHPUnit_Framework_TestSuite->run(Object(PHPUnit_Framework_TestResult))
07-Sep-2019 06:42:32 #4 /data/phpBB/vendor/phpunit/phpunit/src/Framework/TestSuite.php(722): PHPUnit_Framework_TestSuite->run(Object(PHPUnit_Framework_TestResult))
07-Sep-2019 06:42:32 #5 /data/phpBB/vendor/phpunit/phpunit/src/TextUI/TestRunner.php(440): PHPUnit_Framework_TestSuite->run(Object(PHPUnit_Framework_TestResult))
07-Sep-2019 06:42:32 #6 /data/phpBB/vendor/phpunit/phpunit/src/TextUI/Command.php(149): PHPUnit_TextUI_TestRunner->doRun(Object(PHPUnit_Framework_TestSuite), Array)
07-Sep-2019 06:42:32 #7 /data/phpBB/vendor/phpunit/phpunit/src/TextUI/Command.php(100): PHPUnit_TextUI_Command->run(Array, true)
07-Sep-2019 06:42:32 #8 /data/phpBB/vendor/phpunit/phpunit/phpunit(52): PHPUnit_TextUI_Command::main()
07-Sep-2019 06:42:32 #9 {main}
07-Sep-2019 06:42:32 864) phpbb_tests_tree_nestedset_forum_move_test
07-Sep-2019 06:42:32 UnexpectedValueException: Unable to resolve the dependency '\phpbb\db\migration\data\v32x\v327' in /data/phpBB/phpbb/db/migration/schema_generator.php:238
07-Sep-2019 06:42:32 Stack trace:
07-Sep-2019 06:42:32 #0 /data/phpBB/phpbb/db/migration/schema_generator.php(214): phpbb\db\migration\schema_generator->check_dependencies()
07-Sep-2019 06:42:32 #1 /data/tests/test_framework/phpbb_database_test_case.php(84): phpbb\db\migration\schema_generator->get_schema()
07-Sep-2019 06:42:32 #2 /data/phpBB/vendor/phpunit/phpunit/src/Framework/TestSuite.php(672): phpbb_database_test_case::setUpBeforeClass()
07-Sep-2019 06:42:32 #3 /data/phpBB/vendor/phpunit/phpunit/src/Framework/TestSuite.php(722): PHPUnit_Framework_TestSuite->run(Object(PHPUnit_Framework_TestResult))
07-Sep-2019 06:42:32 #4 /data/phpBB/vendor/phpunit/phpunit/src/Framework/TestSuite.php(722): PHPUnit_Framework_TestSuite->run(Object(PHPUnit_Framework_TestResult))
07-Sep-2019 06:42:32 #5 /data/phpBB/vendor/phpunit/phpunit/src/TextUI/TestRunner.php(440): PHPUnit_Framework_TestSuite->run(Object(PHPUnit_Framework_TestResult))
07-Sep-2019 06:42:32 #6 /data/phpBB/vendor/phpunit/phpunit/src/TextUI/Command.php(149): PHPUnit_TextUI_TestRunner->doRun(Object(PHPUnit_Framework_TestSuite), Array)
07-Sep-2019 06:42:32 #7 /data/phpBB/vendor/phpunit/phpunit/src/TextUI/Command.php(100): PHPUnit_TextUI_Command->run(Array, true)
07-Sep-2019 06:42:32 #8 /data/phpBB/vendor/phpunit/phpunit/phpunit(52): PHPUnit_TextUI_Command::main()
07-Sep-2019 06:42:32 #9 {main}
07-Sep-2019 06:42:32 865) phpbb_tests_tree_nestedset_forum_move_test
07-Sep-2019 06:42:32 UnexpectedValueException: Unable to resolve the dependency '\phpbb\db\migration\data\v32x\v327' in /data/phpBB/phpbb/db/migration/schema_generator.php:238
07-Sep-2019 06:42:32 Stack trace:
07-Sep-2019 06:42:32 #0 /data/phpBB/phpbb/db/migration/schema_generator.php(214): phpbb\db\migration\schema_generator->check_dependencies()
07-Sep-2019 06:42:32 #1 /data/tests/test_framework/phpbb_database_test_case.php(84): phpbb\db\migration\schema_generator->get_schema()
07-Sep-2019 06:42:32 #2 /data/phpBB/vendor/phpunit/phpunit/src/Framework/TestSuite.php(672): phpbb_database_test_case::setUpBeforeClass()
07-Sep-2019 06:42:32 #3 /data/phpBB/vendor/phpunit/phpunit/src/Framework/TestSuite.php(722): PHPUnit_Framework_TestSuite->run(Object(PHPUnit_Framework_TestResult))
07-Sep-2019 06:42:32 #4 /data/phpBB/vendor/phpunit/phpunit/src/Framework/TestSuite.php(722): PHPUnit_Framework_TestSuite->run(Object(PHPUnit_Framework_TestResult))
07-Sep-2019 06:42:32 #5 /data/phpBB/vendor/phpunit/phpunit/src/TextUI/TestRunner.php(440): PHPUnit_Framework_TestSuite->run(Object(PHPUnit_Framework_TestResult))
07-Sep-2019 06:42:32 #6 /data/phpBB/vendor/phpunit/phpunit/src/TextUI/Command.php(149): PHPUnit_TextUI_TestRunner->doRun(Object(PHPUnit_Framework_TestSuite), Array)
07-Sep-2019 06:42:32 #7 /data/phpBB/vendor/phpunit/phpunit/src/TextUI/Command.php(100): PHPUnit_TextUI_Command->run(Array, true)
07-Sep-2019 06:42:32 #8 /data/phpBB/vendor/phpunit/phpunit/phpunit(52): PHPUnit_TextUI_Command::main()
07-Sep-2019 06:42:32 #9 {main}
07-Sep-2019 06:42:32 866) phpbb_tests_tree_nestedset_forum_move_test
07-Sep-2019 06:42:32 UnexpectedValueException: Unable to resolve the dependency '\phpbb\db\migration\data\v32x\v327' in /data/phpBB/phpbb/db/migration/schema_generator.php:238
07-Sep-2019 06:42:32 Stack trace:
07-Sep-2019 06:42:32 #0 /data/phpBB/phpbb/db/migration/schema_generator.php(214): phpbb\db\migration\schema_generator->check_dependencies()
07-Sep-2019 06:42:32 #1 /data/tests/test_framework/phpbb_database_test_case.php(84): phpbb\db\migration\schema_generator->get_schema()
07-Sep-2019 06:42:32 #2 /data/phpBB/vendor/phpunit/phpunit/src/Framework/TestSuite.php(672): phpbb_database_test_case::setUpBeforeClass()
07-Sep-2019 06:42:32 #3 /data/phpBB/vendor/phpunit/phpunit/src/Framework/TestSuite.php(722): PHPUnit_Framework_TestSuite->run(Object(PHPUnit_Framework_TestResult))
07-Sep-2019 06:42:32 #4 /data/phpBB/vendor/phpunit/phpunit/src/Framework/TestSuite.php(722): PHPUnit_Framework_TestSuite->run(Object(PHPUnit_Framework_TestResult))
07-Sep-2019 06:42:32 #5 /data/phpBB/vendor/phpunit/phpunit/src/TextUI/TestRunner.php(440): PHPUnit_Framework_TestSuite->run(Object(PHPUnit_Framework_TestResult))
07-Sep-2019 06:42:32 #6 /data/phpBB/vendor/phpunit/phpunit/src/TextUI/Command.php(149): PHPUnit_TextUI_TestRunner->doRun(Object(PHPUnit_Framework_TestSuite), Array)
07-Sep-2019 06:42:32 #7 /data/phpBB/vendor/phpunit/phpunit/src/TextUI/Command.php(100): PHPUnit_TextUI_Command->run(Array, true)
07-Sep-2019 06:42:32 #8 /data/phpBB/vendor/phpunit/phpunit/phpunit(52): PHPUnit_TextUI_Command::main()
07-Sep-2019 06:42:32 #9 {main}
07-Sep-2019 06:42:32 867) phpbb_tests_tree_nestedset_forum_move_test
07-Sep-2019 06:42:32 UnexpectedValueException: Unable to resolve the dependency '\phpbb\db\migration\data\v32x\v327' in /data/phpBB/phpbb/db/migration/schema_generator.php:238
07-Sep-2019 06:42:32 Stack trace:
07-Sep-2019 06:42:32 #0 /data/phpBB/phpbb/db/migration/schema_generator.php(214): phpbb\db\migration\schema_generator->check_dependencies()
07-Sep-2019 06:42:32 #1 /data/tests/test_framework/phpbb_database_test_case.php(84): phpbb\db\migration\schema_generator->get_schema()
07-Sep-2019 06:42:32 #2 /data/phpBB/vendor/phpunit/phpunit/src/Framework/TestSuite.php(672): phpbb_database_test_case::setUpBeforeClass()
07-Sep-2019 06:42:32 #3 /data/phpBB/vendor/phpunit/phpunit/src/Framework/TestSuite.php(722): PHPUnit_Framework_TestSuite->run(Object(PHPUnit_Framework_TestResult))
07-Sep-2019 06:42:32 #4 /data/phpBB/vendor/phpunit/phpunit/src/Framework/TestSuite.php(722): PHPUnit_Framework_TestSuite->run(Object(PHPUnit_Framework_TestResult))
07-Sep-2019 06:42:32 #5 /data/phpBB/vendor/phpunit/phpunit/src/TextUI/TestRunner.php(440): PHPUnit_Framework_TestSuite->run(Object(PHPUnit_Framework_TestResult))
07-Sep-2019 06:42:32 #6 /data/phpBB/vendor/phpunit/phpunit/src/TextUI/Command.php(149): PHPUnit_TextUI_TestRunner->doRun(Object(PHPUnit_Framework_TestSuite), Array)
07-Sep-2019 06:42:32 #7 /data/phpBB/vendor/phpunit/phpunit/src/TextUI/Command.php(100): PHPUnit_TextUI_Command->run(Array, true)
07-Sep-2019 06:42:32 #8 /data/phpBB/vendor/phpunit/phpunit/phpunit(52): PHPUnit_TextUI_Command::main()
07-Sep-2019 06:42:32 #9 {main}
07-Sep-2019 06:42:32 868) phpbb_tests_tree_nestedset_forum_move_test
07-Sep-2019 06:42:32 UnexpectedValueException: Unable to resolve the dependency '\phpbb\db\migration\data\v32x\v327' in /data/phpBB/phpbb/db/migration/schema_generator.php:238
07-Sep-2019 06:42:32 Stack trace:
07-Sep-2019 06:42:32 #0 /data/phpBB/phpbb/db/migration/schema_generator.php(214): phpbb\db\migration\schema_generator->check_dependencies()
07-Sep-2019 06:42:32 #1 /data/tests/test_framework/phpbb_database_test_case.php(84): phpbb\db\migration\schema_generator->get_schema()
07-Sep-2019 06:42:32 #2 /data/phpBB/vendor/phpunit/phpunit/src/Framework/TestSuite.php(672): phpbb_database_test_case::setUpBeforeClass()
07-Sep-2019 06:42:32 #3 /data/phpBB/vendor/phpunit/phpunit/src/Framework/TestSuite.php(722): PHPUnit_Framework_TestSuite->run(Object(PHPUnit_Framework_TestResult))
07-Sep-2019 06:42:32 #4 /data/phpBB/vendor/phpunit/phpunit/src/Framework/TestSuite.php(722): PHPUnit_Framework_TestSuite->run(Object(PHPUnit_Framework_TestResult))
07-Sep-2019 06:42:32 #5 /data/phpBB/vendor/phpunit/phpunit/src/TextUI/TestRunner.php(440): PHPUnit_Framework_TestSuite->run(Object(PHPUnit_Framework_TestResult))
07-Sep-2019 06:42:32 #6 /data/phpBB/vendor/phpunit/phpunit/src/TextUI/Command.php(149): PHPUnit_TextUI_TestRunner->doRun(Object(PHPUnit_Framework_TestSuite), Array)
07-Sep-2019 06:42:32 #7 /data/phpBB/vendor/phpunit/phpunit/src/TextUI/Command.php(100): PHPUnit_TextUI_Command->run(Array, true)
07-Sep-2019 06:42:32 #8 /data/phpBB/vendor/phpunit/phpunit/phpunit(52): PHPUnit_TextUI_Command::main()
07-Sep-2019 06:42:32 #9 {main}
07-Sep-2019 06:42:32 869) phpbb_tests_tree_nestedset_forum_move_test
07-Sep-2019 06:42:32 UnexpectedValueException: Unable to resolve the dependency '\phpbb\db\migration\data\v32x\v327' in /data/phpBB/phpbb/db/migration/schema_generator.php:238
07-Sep-2019 06:42:32 Stack trace:
07-Sep-2019 06:42:32 #0 /data/phpBB/phpbb/db/migration/schema_generator.php(214): phpbb\db\migration\schema_generator->check_dependencies()
07-Sep-2019 06:42:32 #1 /data/tests/test_framework/phpbb_database_test_case.php(84): phpbb\db\migration\schema_generator->get_schema()
07-Sep-2019 06:42:32 #2 /data/phpBB/vendor/phpunit/phpunit/src/Framework/TestSuite.php(672): phpbb_database_test_case::setUpBeforeClass()
07-Sep-2019 06:42:32 #3 /data/phpBB/vendor/phpunit/phpunit/src/Framework/TestSuite.php(722): PHPUnit_Framework_TestSuite->run(Object(PHPUnit_Framework_TestResult))
07-Sep-2019 06:42:32 #4 /data/phpBB/vendor/phpunit/phpunit/src/Framework/TestSuite.php(722): PHPUnit_Framework_TestSuite->run(Object(PHPUnit_Framework_TestResult))
07-Sep-2019 06:42:32 #5 /data/phpBB/vendor/phpunit/phpunit/src/TextUI/TestRunner.php(440): PHPUnit_Framework_TestSuite->run(Object(PHPUnit_Framework_TestResult))
07-Sep-2019 06:42:32 #6 /data/phpBB/vendor/phpunit/phpunit/src/TextUI/Command.php(149): PHPUnit_TextUI_TestRunner->doRun(Object(PHPUnit_Framework_TestSuite), Array)
07-Sep-2019 06:42:32 #7 /data/phpBB/vendor/phpunit/phpunit/src/TextUI/Command.php(100): PHPUnit_TextUI_Command->run(Array, true)
07-Sep-2019 06:42:32 #8 /data/phpBB/vendor/phpunit/phpunit/phpunit(52): PHPUnit_TextUI_Command::main()
07-Sep-2019 06:42:32 #9 {main}
07-Sep-2019 06:42:32 870) phpbb_tests_tree_nestedset_forum_move_test
07-Sep-2019 06:42:32 UnexpectedValueException: Unable to resolve the dependency '\phpbb\db\migration\data\v32x\v327' in /data/phpBB/phpbb/db/migration/schema_generator.php:238
07-Sep-2019 06:42:32 Stack trace:
07-Sep-2019 06:42:32 #0 /data/phpBB/phpbb/db/migration/schema_generator.php(214): phpbb\db\migration\schema_generator->check_dependencies()
07-Sep-2019 06:42:32 #1 /data/tests/test_framework/phpbb_database_test_case.php(84): phpbb\db\migration\schema_generator->get_schema()
07-Sep-2019 06:42:32 #2 /data/phpBB/vendor/phpunit/phpunit/src/Framework/TestSuite.php(672): phpbb_database_test_case::setUpBeforeClass()
07-Sep-2019 06:42:32 #3 /data/phpBB/vendor/phpunit/phpunit/src/Framework/TestSuite.php(722): PHPUnit_Framework_TestSuite->run(Object(PHPUnit_Framework_TestResult))
07-Sep-2019 06:42:32 #4 /data/phpBB/vendor/phpunit/phpunit/src/Framework/TestSuite.php(722): PHPUnit_Framework_TestSuite->run(Object(PHPUnit_Framework_TestResult))
07-Sep-2019 06:42:32 #5 /data/phpBB/vendor/phpunit/phpunit/src/TextUI/TestRunner.php(440): PHPUnit_Framework_TestSuite->run(Object(PHPUnit_Framework_TestResult))
07-Sep-2019 06:42:32 #6 /data/phpBB/vendor/phpunit/phpunit/src/TextUI/Command.php(149): PHPUnit_TextUI_TestRunner->doRun(Object(PHPUnit_Framework_TestSuite), Array)
07-Sep-2019 06:42:32 #7 /data/phpBB/vendor/phpunit/phpunit/src/TextUI/Command.php(100): PHPUnit_TextUI_Command->run(Array, true)
07-Sep-2019 06:42:32 #8 /data/phpBB/vendor/phpunit/phpunit/phpunit(52): PHPUnit_TextUI_Command::main()
07-Sep-2019 06:42:32 #9 {main}
07-Sep-2019 06:42:32 871) phpbb_tests_tree_nestedset_forum_move_test
07-Sep-2019 06:42:32 UnexpectedValueException: Unable to resolve the dependency '\phpbb\db\migration\data\v32x\v327' in /data/phpBB/phpbb/db/migration/schema_generator.php:238
07-Sep-2019 06:42:32 Stack trace:
07-Sep-2019 06:42:32 #0 /data/phpBB/phpbb/db/migration/schema_generator.php(214): phpbb\db\migration\schema_generator->check_dependencies()
07-Sep-2019 06:42:32 #1 /data/tests/test_framework/phpbb_database_test_case.php(84): phpbb\db\migration\schema_generator->get_schema()
07-Sep-2019 06:42:32 #2 /data/phpBB/vendor/phpunit/phpunit/src/Framework/TestSuite.php(672): phpbb_database_test_case::setUpBeforeClass()
07-Sep-2019 06:42:32 #3 /data/phpBB/vendor/phpunit/phpunit/src/Framework/TestSuite.php(722): PHPUnit_Framework_TestSuite->run(Object(PHPUnit_Framework_TestResult))
07-Sep-2019 06:42:32 #4 /data/phpBB/vendor/phpunit/phpunit/src/Framework/TestSuite.php(722): PHPUnit_Framework_TestSuite->run(Object(PHPUnit_Framework_TestResult))
07-Sep-2019 06:42:32 #5 /data/phpBB/vendor/phpunit/phpunit/src/TextUI/TestRunner.php(440): PHPUnit_Framework_TestSuite->run(Object(PHPUnit_Framework_TestResult))
07-Sep-2019 06:42:32 #6 /data/phpBB/vendor/phpunit/phpunit/src/TextUI/Command.php(149): PHPUnit_TextUI_TestRunner->doRun(Object(PHPUnit_Framework_TestSuite), Array)
07-Sep-2019 06:42:32 #7 /data/phpBB/vendor/phpunit/phpunit/src/TextUI/Command.php(100): PHPUnit_TextUI_Command->run(Array, true)
07-Sep-2019 06:42:32 #8 /data/phpBB/vendor/phpunit/phpunit/phpunit(52): PHPUnit_TextUI_Command::main()
07-Sep-2019 06:42:32 #9 {main}
07-Sep-2019 06:42:32 872) phpbb_tests_tree_nestedset_forum_move_test
07-Sep-2019 06:42:32 UnexpectedValueException: Unable to resolve the dependency '\phpbb\db\migration\data\v32x\v327' in /data/phpBB/phpbb/db/migration/schema_generator.php:238
07-Sep-2019 06:42:32 Stack trace:
07-Sep-2019 06:42:32 #0 /data/phpBB/phpbb/db/migration/schema_generator.php(214): phpbb\db\migration\schema_generator->check_dependencies()
07-Sep-2019 06:42:32 #1 /data/tests/test_framework/phpbb_database_test_case.php(84): phpbb\db\migration\schema_generator->get_schema()
07-Sep-2019 06:42:32 #2 /data/phpBB/vendor/phpunit/phpunit/src/Framework/TestSuite.php(672): phpbb_database_test_case::setUpBeforeClass()
07-Sep-2019 06:42:32 #3 /data/phpBB/vendor/phpunit/phpunit/src/Framework/TestSuite.php(722): PHPUnit_Framework_TestSuite->run(Object(PHPUnit_Framework_TestResult))
07-Sep-2019 06:42:32 #4 /data/phpBB/vendor/phpunit/phpunit/src/Framework/TestSuite.php(722): PHPUnit_Framework_TestSuite->run(Object(PHPUnit_Framework_TestResult))
07-Sep-2019 06:42:32 #5 /data/phpBB/vendor/phpunit/phpunit/src/TextUI/TestRunner.php(440): PHPUnit_Framework_TestSuite->run(Object(PHPUnit_Framework_TestResult))
07-Sep-2019 06:42:32 #6 /data/phpBB/vendor/phpunit/phpunit/src/TextUI/Command.php(149): PHPUnit_TextUI_TestRunner->doRun(Object(PHPUnit_Framework_TestSuite), Array)
07-Sep-2019 06:42:32 #7 /data/phpBB/vendor/phpunit/phpunit/src/TextUI/Command.php(100): PHPUnit_TextUI_Command->run(Array, true)
07-Sep-2019 06:42:32 #8 /data/phpBB/vendor/phpunit/phpunit/phpunit(52): PHPUnit_TextUI_Command::main()
07-Sep-2019 06:42:32 #9 {main}
07-Sep-2019 06:42:32 873) phpbb_tests_tree_nestedset_forum_move_test
07-Sep-2019 06:42:32 UnexpectedValueException: Unable to resolve the dependency '\phpbb\db\migration\data\v32x\v327' in /data/phpBB/phpbb/db/migration/schema_generator.php:238
07-Sep-2019 06:42:32 Stack trace:
07-Sep-2019 06:42:32 #0 /data/phpBB/phpbb/db/migration/schema_generator.php(214): phpbb\db\migration\schema_generator->check_dependencies()
07-Sep-2019 06:42:32 #1 /data/tests/test_framework/phpbb_database_test_case.php(84): phpbb\db\migration\schema_generator->get_schema()
07-Sep-2019 06:42:32 #2 /data/phpBB/vendor/phpunit/phpunit/src/Framework/TestSuite.php(672): phpbb_database_test_case::setUpBeforeClass()
07-Sep-2019 06:42:32 #3 /data/phpBB/vendor/phpunit/phpunit/src/Framework/TestSuite.php(722): PHPUnit_Framework_TestSuite->run(Object(PHPUnit_Framework_TestResult))
07-Sep-2019 06:42:32 #4 /data/phpBB/vendor/phpunit/phpunit/src/Framework/TestSuite.php(722): PHPUnit_Framework_TestSuite->run(Object(PHPUnit_Framework_TestResult))
07-Sep-2019 06:42:32 #5 /data/phpBB/vendor/phpunit/phpunit/src/TextUI/TestRunner.php(440): PHPUnit_Framework_TestSuite->run(Object(PHPUnit_Framework_TestResult))
07-Sep-2019 06:42:32 #6 /data/phpBB/vendor/phpunit/phpunit/src/TextUI/Command.php(149): PHPUnit_TextUI_TestRunner->doRun(Object(PHPUnit_Framework_TestSuite), Array)
07-Sep-2019 06:42:32 #7 /data/phpBB/vendor/phpunit/phpunit/src/TextUI/Command.php(100): PHPUnit_TextUI_Command->run(Array, true)
07-Sep-2019 06:42:32 #8 /data/phpBB/vendor/phpunit/phpunit/phpunit(52): PHPUnit_TextUI_Command::main()
07-Sep-2019 06:42:32 #9 {main}
07-Sep-2019 06:42:32 874) phpbb_tests_tree_nestedset_forum_move_test
07-Sep-2019 06:42:32 UnexpectedValueException: Unable to resolve the dependency '\phpbb\db\migration\data\v32x\v327' in /data/phpBB/phpbb/db/migration/schema_generator.php:238
07-Sep-2019 06:42:32 Stack trace:
07-Sep-2019 06:42:32 #0 /data/phpBB/phpbb/db/migration/schema_generator.php(214): phpbb\db\migration\schema_generator->check_dependencies()
07-Sep-2019 06:42:32 #1 /data/tests/test_framework/phpbb_database_test_case.php(84): phpbb\db\migration\schema_generator->get_schema()
07-Sep-2019 06:42:32 #2 /data/phpBB/vendor/phpunit/phpunit/src/Framework/TestSuite.php(672): phpbb_database_test_case::setUpBeforeClass()
07-Sep-2019 06:42:32 #3 /data/phpBB/vendor/phpunit/phpunit/src/Framework/TestSuite.php(722): PHPUnit_Framework_TestSuite->run(Object(PHPUnit_Framework_TestResult))
07-Sep-2019 06:42:32 #4 /data/phpBB/vendor/phpunit/phpunit/src/Framework/TestSuite.php(722): PHPUnit_Framework_TestSuite->run(Object(PHPUnit_Framework_TestResult))
07-Sep-2019 06:42:32 #5 /data/phpBB/vendor/phpunit/phpunit/src/TextUI/TestRunner.php(440): PHPUnit_Framework_TestSuite->run(Object(PHPUnit_Framework_TestResult))
07-Sep-2019 06:42:32 #6 /data/phpBB/vendor/phpunit/phpunit/src/TextUI/Command.php(149): PHPUnit_TextUI_TestRunner->doRun(Object(PHPUnit_Framework_TestSuite), Array)
07-Sep-2019 06:42:32 #7 /data/phpBB/vendor/phpunit/phpunit/src/TextUI/Command.php(100): PHPUnit_TextUI_Command->run(Array, true)
07-Sep-2019 06:42:32 #8 /data/phpBB/vendor/phpunit/phpunit/phpunit(52): PHPUnit_TextUI_Command::main()
07-Sep-2019 06:42:32 #9 {main}
07-Sep-2019 06:42:32 875) phpbb_tests_tree_nestedset_forum_move_test
07-Sep-2019 06:42:32 UnexpectedValueException: Unable to resolve the dependency '\phpbb\db\migration\data\v32x\v327' in /data/phpBB/phpbb/db/migration/schema_generator.php:238
07-Sep-2019 06:42:32 Stack trace:
07-Sep-2019 06:42:32 #0 /data/phpBB/phpbb/db/migration/schema_generator.php(214): phpbb\db\migration\schema_generator->check_dependencies()
07-Sep-2019 06:42:32 #1 /data/tests/test_framework/phpbb_database_test_case.php(84): phpbb\db\migration\schema_generator->get_schema()
07-Sep-2019 06:42:32 #2 /data/phpBB/vendor/phpunit/phpunit/src/Framework/TestSuite.php(672): phpbb_database_test_case::setUpBeforeClass()
07-Sep-2019 06:42:32 #3 /data/phpBB/vendor/phpunit/phpunit/src/Framework/TestSuite.php(722): PHPUnit_Framework_TestSuite->run(Object(PHPUnit_Framework_TestResult))
07-Sep-2019 06:42:32 #4 /data/phpBB/vendor/phpunit/phpunit/src/Framework/TestSuite.php(722): PHPUnit_Framework_TestSuite->run(Object(PHPUnit_Framework_TestResult))
07-Sep-2019 06:42:32 #5 /data/phpBB/vendor/phpunit/phpunit/src/TextUI/TestRunner.php(440): PHPUnit_Framework_TestSuite->run(Object(PHPUnit_Framework_TestResult))
07-Sep-2019 06:42:32 #6 /data/phpBB/vendor/phpunit/phpunit/src/TextUI/Command.php(149): PHPUnit_TextUI_TestRunner->doRun(Object(PHPUnit_Framework_TestSuite), Array)
07-Sep-2019 06:42:32 #7 /data/phpBB/vendor/phpunit/phpunit/src/TextUI/Command.php(100): PHPUnit_TextUI_Command->run(Array, true)
07-Sep-2019 06:42:32 #8 /data/phpBB/vendor/phpunit/phpunit/phpunit(52): PHPUnit_TextUI_Command::main()
07-Sep-2019 06:42:32 #9 {main}
07-Sep-2019 06:42:32 876) phpbb_tests_tree_nestedset_forum_move_test
07-Sep-2019 06:42:32 UnexpectedValueException: Unable to resolve the dependency '\phpbb\db\migration\data\v32x\v327' in /data/phpBB/phpbb/db/migration/schema_generator.php:238
07-Sep-2019 06:42:32 Stack trace:
07-Sep-2019 06:42:32 #0 /data/phpBB/phpbb/db/migration/schema_generator.php(214): phpbb\db\migration\schema_generator->check_dependencies()
07-Sep-2019 06:42:32 #1 /data/tests/test_framework/phpbb_database_test_case.php(84): phpbb\db\migration\schema_generator->get_schema()
07-Sep-2019 06:42:32 #2 /data/phpBB/vendor/phpunit/phpunit/src/Framework/TestSuite.php(672): phpbb_database_test_case::setUpBeforeClass()
07-Sep-2019 06:42:32 #3 /data/phpBB/vendor/phpunit/phpunit/src/Framework/TestSuite.php(722): PHPUnit_Framework_TestSuite->run(Object(PHPUnit_Framework_TestResult))
07-Sep-2019 06:42:32 #4 /data/phpBB/vendor/phpunit/phpunit/src/Framework/TestSuite.php(722): PHPUnit_Framework_TestSuite->run(Object(PHPUnit_Framework_TestResult))
07-Sep-2019 06:42:32 #5 /data/phpBB/vendor/phpunit/phpunit/src/TextUI/TestRunner.php(440): PHPUnit_Framework_TestSuite->run(Object(PHPUnit_Framework_TestResult))
07-Sep-2019 06:42:32 #6 /data/phpBB/vendor/phpunit/phpunit/src/TextUI/Command.php(149): PHPUnit_TextUI_TestRunner->doRun(Object(PHPUnit_Framework_TestSuite), Array)
07-Sep-2019 06:42:32 #7 /data/phpBB/vendor/phpunit/phpunit/src/TextUI/Command.php(100): PHPUnit_TextUI_Command->run(Array, true)
07-Sep-2019 06:42:32 #8 /data/phpBB/vendor/phpunit/phpunit/phpunit(52): PHPUnit_TextUI_Command::main()
07-Sep-2019 06:42:32 #9 {main}
07-Sep-2019 06:42:32 877) phpbb_tests_tree_nestedset_forum_move_test
07-Sep-2019 06:42:32 UnexpectedValueException: Unable to resolve the dependency '\phpbb\db\migration\data\v32x\v327' in /data/phpBB/phpbb/db/migration/schema_generator.php:238
07-Sep-2019 06:42:32 Stack trace:
07-Sep-2019 06:42:32 #0 /data/phpBB/phpbb/db/migration/schema_generator.php(214): phpbb\db\migration\schema_generator->check_dependencies()
07-Sep-2019 06:42:32 #1 /data/tests/test_framework/phpbb_database_test_case.php(84): phpbb\db\migration\schema_generator->get_schema()
07-Sep-2019 06:42:32 #2 /data/phpBB/vendor/phpunit/phpunit/src/Framework/TestSuite.php(672): phpbb_database_test_case::setUpBeforeClass()
07-Sep-2019 06:42:32 #3 /data/phpBB/vendor/phpunit/phpunit/src/Framework/TestSuite.php(722): PHPUnit_Framework_TestSuite->run(Object(PHPUnit_Framework_TestResult))
07-Sep-2019 06:42:32 #4 /data/phpBB/vendor/phpunit/phpunit/src/Framework/TestSuite.php(722): PHPUnit_Framework_TestSuite->run(Object(PHPUnit_Framework_TestResult))
07-Sep-2019 06:42:32 #5 /data/phpBB/vendor/phpunit/phpunit/src/TextUI/TestRunner.php(440): PHPUnit_Framework_TestSuite->run(Object(PHPUnit_Framework_TestResult))
07-Sep-2019 06:42:32 #6 /data/phpBB/vendor/phpunit/phpunit/src/TextUI/Command.php(149): PHPUnit_TextUI_TestRunner->doRun(Object(PHPUnit_Framework_TestSuite), Array)
07-Sep-2019 06:42:32 #7 /data/phpBB/vendor/phpunit/phpunit/src/TextUI/Command.php(100): PHPUnit_TextUI_Command->run(Array, true)
07-Sep-2019 06:42:32 #8 /data/phpBB/vendor/phpunit/phpunit/phpunit(52): PHPUnit_TextUI_Command::main()
07-Sep-2019 06:42:32 #9 {main}
07-Sep-2019 06:42:32 878) phpbb_tests_tree_nestedset_forum_move_test
07-Sep-2019 06:42:32 UnexpectedValueException: Unable to resolve the dependency '\phpbb\db\migration\data\v32x\v327' in /data/phpBB/phpbb/db/migration/schema_generator.php:238
07-Sep-2019 06:42:32 Stack trace:
07-Sep-2019 06:42:32 #0 /data/phpBB/phpbb/db/migration/schema_generator.php(214): phpbb\db\migration\schema_generator->check_dependencies()
07-Sep-2019 06:42:32 #1 /data/tests/test_framework/phpbb_database_test_case.php(84): phpbb\db\migration\schema_generator->get_schema()
07-Sep-2019 06:42:32 #2 /data/phpBB/vendor/phpunit/phpunit/src/Framework/TestSuite.php(672): phpbb_database_test_case::setUpBeforeClass()
07-Sep-2019 06:42:32 #3 /data/phpBB/vendor/phpunit/phpunit/src/Framework/TestSuite.php(722): PHPUnit_Framework_TestSuite->run(Object(PHPUnit_Framework_TestResult))
07-Sep-2019 06:42:32 #4 /data/phpBB/vendor/phpunit/phpunit/src/Framework/TestSuite.php(722): PHPUnit_Framework_TestSuite->run(Object(PHPUnit_Framework_TestResult))
07-Sep-2019 06:42:32 #5 /data/phpBB/vendor/phpunit/phpunit/src/TextUI/TestRunner.php(440): PHPUnit_Framework_TestSuite->run(Object(PHPUnit_Framework_TestResult))
07-Sep-2019 06:42:32 #6 /data/phpBB/vendor/phpunit/phpunit/src/TextUI/Command.php(149): PHPUnit_TextUI_TestRunner->doRun(Object(PHPUnit_Framework_TestSuite), Array)
07-Sep-2019 06:42:32 #7 /data/phpBB/vendor/phpunit/phpunit/src/TextUI/Command.php(100): PHPUnit_TextUI_Command->run(Array, true)
07-Sep-2019 06:42:32 #8 /data/phpBB/vendor/phpunit/phpunit/phpunit(52): PHPUnit_TextUI_Command::main()
07-Sep-2019 06:42:32 #9 {main}
07-Sep-2019 06:42:32 879) phpbb_tests_tree_nestedset_forum_move_test
07-Sep-2019 06:42:32 UnexpectedValueException: Unable to resolve the dependency '\phpbb\db\migration\data\v32x\v327' in /data/phpBB/phpbb/db/migration/schema_generator.php:238
07-Sep-2019 06:42:32 Stack trace:
07-Sep-2019 06:42:32 #0 /data/phpBB/phpbb/db/migration/schema_generator.php(214): phpbb\db\migration\schema_generator->check_dependencies()
07-Sep-2019 06:42:32 #1 /data/tests/test_framework/phpbb_database_test_case.php(84): phpbb\db\migration\schema_generator->get_schema()
07-Sep-2019 06:42:32 #2 /data/phpBB/vendor/phpunit/phpunit/src/Framework/TestSuite.php(672): phpbb_database_test_case::setUpBeforeClass()
07-Sep-2019 06:42:32 #3 /data/phpBB/vendor/phpunit/phpunit/src/Framework/TestSuite.php(722): PHPUnit_Framework_TestSuite->run(Object(PHPUnit_Framework_TestResult))
07-Sep-2019 06:42:32 #4 /data/phpBB/vendor/phpunit/phpunit/src/Framework/TestSuite.php(722): PHPUnit_Framework_TestSuite->run(Object(PHPUnit_Framework_TestResult))
07-Sep-2019 06:42:32 #5 /data/phpBB/vendor/phpunit/phpunit/src/TextUI/TestRunner.php(440): PHPUnit_Framework_TestSuite->run(Object(PHPUnit_Framework_TestResult))
07-Sep-2019 06:42:32 #6 /data/phpBB/vendor/phpunit/phpunit/src/TextUI/Command.php(149): PHPUnit_TextUI_TestRunner->doRun(Object(PHPUnit_Framework_TestSuite), Array)
07-Sep-2019 06:42:32 #7 /data/phpBB/vendor/phpunit/phpunit/src/TextUI/Command.php(100): PHPUnit_TextUI_Command->run(Array, true)
07-Sep-2019 06:42:32 #8 /data/phpBB/vendor/phpunit/phpunit/phpunit(52): PHPUnit_TextUI_Command::main()
07-Sep-2019 06:42:32 #9 {main}
07-Sep-2019 06:42:32 880) phpbb_tests_tree_nestedset_forum_move_test
07-Sep-2019 06:42:32 UnexpectedValueException: Unable to resolve the dependency '\phpbb\db\migration\data\v32x\v327' in /data/phpBB/phpbb/db/migration/schema_generator.php:238
07-Sep-2019 06:42:32 Stack trace:
07-Sep-2019 06:42:32 #0 /data/phpBB/phpbb/db/migration/schema_generator.php(214): phpbb\db\migration\schema_generator->check_dependencies()
07-Sep-2019 06:42:32 #1 /data/tests/test_framework/phpbb_database_test_case.php(84): phpbb\db\migration\schema_generator->get_schema()
07-Sep-2019 06:42:32 #2 /data/phpBB/vendor/phpunit/phpunit/src/Framework/TestSuite.php(672): phpbb_database_test_case::setUpBeforeClass()
07-Sep-2019 06:42:32 #3 /data/phpBB/vendor/phpunit/phpunit/src/Framework/TestSuite.php(722): PHPUnit_Framework_TestSuite->run(Object(PHPUnit_Framework_TestResult))
07-Sep-2019 06:42:32 #4 /data/phpBB/vendor/phpunit/phpunit/src/Framework/TestSuite.php(722): PHPUnit_Framework_TestSuite->run(Object(PHPUnit_Framework_TestResult))
07-Sep-2019 06:42:32 #5 /data/phpBB/vendor/phpunit/phpunit/src/TextUI/TestRunner.php(440): PHPUnit_Framework_TestSuite->run(Object(PHPUnit_Framework_TestResult))
07-Sep-2019 06:42:32 #6 /data/phpBB/vendor/phpunit/phpunit/src/TextUI/Command.php(149): PHPUnit_TextUI_TestRunner->doRun(Object(PHPUnit_Framework_TestSuite), Array)
07-Sep-2019 06:42:32 #7 /data/phpBB/vendor/phpunit/phpunit/src/TextUI/Command.php(100): PHPUnit_TextUI_Command->run(Array, true)
07-Sep-2019 06:42:32 #8 /data/phpBB/vendor/phpunit/phpunit/phpunit(52): PHPUnit_TextUI_Command::main()
07-Sep-2019 06:42:32 #9 {main}
07-Sep-2019 06:42:32 881) phpbb_tests_tree_nestedset_forum_move_test
07-Sep-2019 06:42:32 UnexpectedValueException: Unable to resolve the dependency '\phpbb\db\migration\data\v32x\v327' in /data/phpBB/phpbb/db/migration/schema_generator.php:238
07-Sep-2019 06:42:32 Stack trace:
07-Sep-2019 06:42:32 #0 /data/phpBB/phpbb/db/migration/schema_generator.php(214): phpbb\db\migration\schema_generator->check_dependencies()
07-Sep-2019 06:42:32 #1 /data/tests/test_framework/phpbb_database_test_case.php(84): phpbb\db\migration\schema_generator->get_schema()
07-Sep-2019 06:42:32 #2 /data/phpBB/vendor/phpunit/phpunit/src/Framework/TestSuite.php(672): phpbb_database_test_case::setUpBeforeClass()
07-Sep-2019 06:42:32 #3 /data/phpBB/vendor/phpunit/phpunit/src/Framework/TestSuite.php(722): PHPUnit_Framework_TestSuite->run(Object(PHPUnit_Framework_TestResult))
07-Sep-2019 06:42:32 #4 /data/phpBB/vendor/phpunit/phpunit/src/Framework/TestSuite.php(722): PHPUnit_Framework_TestSuite->run(Object(PHPUnit_Framework_TestResult))
07-Sep-2019 06:42:32 #5 /data/phpBB/vendor/phpunit/phpunit/src/TextUI/TestRunner.php(440): PHPUnit_Framework_TestSuite->run(Object(PHPUnit_Framework_TestResult))
07-Sep-2019 06:42:32 #6 /data/phpBB/vendor/phpunit/phpunit/src/TextUI/Command.php(149): PHPUnit_TextUI_TestRunner->doRun(Object(PHPUnit_Framework_TestSuite), Array)
07-Sep-2019 06:42:32 #7 /data/phpBB/vendor/phpunit/phpunit/src/TextUI/Command.php(100): PHPUnit_TextUI_Command->run(Array, true)
07-Sep-2019 06:42:32 #8 /data/phpBB/vendor/phpunit/phpunit/phpunit(52): PHPUnit_TextUI_Command::main()
07-Sep-2019 06:42:32 #9 {main}
07-Sep-2019 06:42:32 882) phpbb_tests_tree_nestedset_forum_move_test
07-Sep-2019 06:42:32 UnexpectedValueException: Unable to resolve the dependency '\phpbb\db\migration\data\v32x\v327' in /data/phpBB/phpbb/db/migration/schema_generator.php:238
07-Sep-2019 06:42:32 Stack trace:
07-Sep-2019 06:42:32 #0 /data/phpBB/phpbb/db/migration/schema_generator.php(214): phpbb\db\migration\schema_generator->check_dependencies()
07-Sep-2019 06:42:32 #1 /data/tests/test_framework/phpbb_database_test_case.php(84): phpbb\db\migration\schema_generator->get_schema()
07-Sep-2019 06:42:32 #2 /data/phpBB/vendor/phpunit/phpunit/src/Framework/TestSuite.php(672): phpbb_database_test_case::setUpBeforeClass()
07-Sep-2019 06:42:32 #3 /data/phpBB/vendor/phpunit/phpunit/src/Framework/TestSuite.php(722): PHPUnit_Framework_TestSuite->run(Object(PHPUnit_Framework_TestResult))
07-Sep-2019 06:42:32 #4 /data/phpBB/vendor/phpunit/phpunit/src/Framework/TestSuite.php(722): PHPUnit_Framework_TestSuite->run(Object(PHPUnit_Framework_TestResult))
07-Sep-2019 06:42:32 #5 /data/phpBB/vendor/phpunit/phpunit/src/TextUI/TestRunner.php(440): PHPUnit_Framework_TestSuite->run(Object(PHPUnit_Framework_TestResult))
07-Sep-2019 06:42:32 #6 /data/phpBB/vendor/phpunit/phpunit/src/TextUI/Command.php(149): PHPUnit_TextUI_TestRunner->doRun(Object(PHPUnit_Framework_TestSuite), Array)
07-Sep-2019 06:42:32 #7 /data/phpBB/vendor/phpunit/phpunit/src/TextUI/Command.php(100): PHPUnit_TextUI_Command->run(Array, true)
07-Sep-2019 06:42:32 #8 /data/phpBB/vendor/phpunit/phpunit/phpunit(52): PHPUnit_TextUI_Command::main()
07-Sep-2019 06:42:32 #9 {main}
07-Sep-2019 06:42:32 883) phpbb_tests_tree_nestedset_forum_move_test
07-Sep-2019 06:42:32 UnexpectedValueException: Unable to resolve the dependency '\phpbb\db\migration\data\v32x\v327' in /data/phpBB/phpbb/db/migration/schema_generator.php:238
07-Sep-2019 06:42:32 Stack trace:
07-Sep-2019 06:42:32 #0 /data/phpBB/phpbb/db/migration/schema_generator.php(214): phpbb\db\migration\schema_generator->check_dependencies()
07-Sep-2019 06:42:32 #1 /data/tests/test_framework/phpbb_database_test_case.php(84): phpbb\db\migration\schema_generator->get_schema()
07-Sep-2019 06:42:32 #2 /data/phpBB/vendor/phpunit/phpunit/src/Framework/TestSuite.php(672): phpbb_database_test_case::setUpBeforeClass()
07-Sep-2019 06:42:32 #3 /data/phpBB/vendor/phpunit/phpunit/src/Framework/TestSuite.php(722): PHPUnit_Framework_TestSuite->run(Object(PHPUnit_Framework_TestResult))
07-Sep-2019 06:42:32 #4 /data/phpBB/vendor/phpunit/phpunit/src/Framework/TestSuite.php(722): PHPUnit_Framework_TestSuite->run(Object(PHPUnit_Framework_TestResult))
07-Sep-2019 06:42:32 #5 /data/phpBB/vendor/phpunit/phpunit/src/TextUI/TestRunner.php(440): PHPUnit_Framework_TestSuite->run(Object(PHPUnit_Framework_TestResult))
07-Sep-2019 06:42:32 #6 /data/phpBB/vendor/phpunit/phpunit/src/TextUI/Command.php(149): PHPUnit_TextUI_TestRunner->doRun(Object(PHPUnit_Framework_TestSuite), Array)
07-Sep-2019 06:42:32 #7 /data/phpBB/vendor/phpunit/phpunit/src/TextUI/Command.php(100): PHPUnit_TextUI_Command->run(Array, true)
07-Sep-2019 06:42:32 #8 /data/phpBB/vendor/phpunit/phpunit/phpunit(52): PHPUnit_TextUI_Command::main()
07-Sep-2019 06:42:32 #9 {main}
07-Sep-2019 06:42:32 884) phpbb_tests_tree_nestedset_forum_move_test
07-Sep-2019 06:42:32 UnexpectedValueException: Unable to resolve the dependency '\phpbb\db\migration\data\v32x\v327' in /data/phpBB/phpbb/db/migration/schema_generator.php:238
07-Sep-2019 06:42:32 Stack trace:
07-Sep-2019 06:42:32 #0 /data/phpBB/phpbb/db/migration/schema_generator.php(214): phpbb\db\migration\schema_generator->check_dependencies()
07-Sep-2019 06:42:32 #1 /data/tests/test_framework/phpbb_database_test_case.php(84): phpbb\db\migration\schema_generator->get_schema()
07-Sep-2019 06:42:32 #2 /data/phpBB/vendor/phpunit/phpunit/src/Framework/TestSuite.php(672): phpbb_database_test_case::setUpBeforeClass()
07-Sep-2019 06:42:32 #3 /data/phpBB/vendor/phpunit/phpunit/src/Framework/TestSuite.php(722): PHPUnit_Framework_TestSuite->run(Object(PHPUnit_Framework_TestResult))
07-Sep-2019 06:42:32 #4 /data/phpBB/vendor/phpunit/phpunit/src/Framework/TestSuite.php(722): PHPUnit_Framework_TestSuite->run(Object(PHPUnit_Framework_TestResult))
07-Sep-2019 06:42:32 #5 /data/phpBB/vendor/phpunit/phpunit/src/TextUI/TestRunner.php(440): PHPUnit_Framework_TestSuite->run(Object(PHPUnit_Framework_TestResult))
07-Sep-2019 06:42:32 #6 /data/phpBB/vendor/phpunit/phpunit/src/TextUI/Command.php(149): PHPUnit_TextUI_TestRunner->doRun(Object(PHPUnit_Framework_TestSuite), Array)
07-Sep-2019 06:42:32 #7 /data/phpBB/vendor/phpunit/phpunit/src/TextUI/Command.php(100): PHPUnit_TextUI_Command->run(Array, true)
07-Sep-2019 06:42:32 #8 /data/phpBB/vendor/phpunit/phpunit/phpunit(52): PHPUnit_TextUI_Command::main()
07-Sep-2019 06:42:32 #9 {main}
07-Sep-2019 06:42:32 885) phpbb_tests_tree_nestedset_forum_move_test
07-Sep-2019 06:42:32 UnexpectedValueException: Unable to resolve the dependency '\phpbb\db\migration\data\v32x\v327' in /data/phpBB/phpbb/db/migration/schema_generator.php:238
07-Sep-2019 06:42:32 Stack trace:
07-Sep-2019 06:42:32 #0 /data/phpBB/phpbb/db/migration/schema_generator.php(214): phpbb\db\migration\schema_generator->check_dependencies()
07-Sep-2019 06:42:32 #1 /data/tests/test_framework/phpbb_database_test_case.php(84): phpbb\db\migration\schema_generator->get_schema()
07-Sep-2019 06:42:32 #2 /data/phpBB/vendor/phpunit/phpunit/src/Framework/TestSuite.php(672): phpbb_database_test_case::setUpBeforeClass()
07-Sep-2019 06:42:32 #3 /data/phpBB/vendor/phpunit/phpunit/src/Framework/TestSuite.php(722): PHPUnit_Framework_TestSuite->run(Object(PHPUnit_Framework_TestResult))
07-Sep-2019 06:42:32 #4 /data/phpBB/vendor/phpunit/phpunit/src/Framework/TestSuite.php(722): PHPUnit_Framework_TestSuite->run(Object(PHPUnit_Framework_TestResult))
07-Sep-2019 06:42:32 #5 /data/phpBB/vendor/phpunit/phpunit/src/TextUI/TestRunner.php(440): PHPUnit_Framework_TestSuite->run(Object(PHPUnit_Framework_TestResult))
07-Sep-2019 06:42:32 #6 /data/phpBB/vendor/phpunit/phpunit/src/TextUI/Command.php(149): PHPUnit_TextUI_TestRunner->doRun(Object(PHPUnit_Framework_TestSuite), Array)
07-Sep-2019 06:42:32 #7 /data/phpBB/vendor/phpunit/phpunit/src/TextUI/Command.php(100): PHPUnit_TextUI_Command->run(Array, true)
07-Sep-2019 06:42:32 #8 /data/phpBB/vendor/phpunit/phpunit/phpunit(52): PHPUnit_TextUI_Command::main()
07-Sep-2019 06:42:32 #9 {main}
07-Sep-2019 06:42:32 886) phpbb_tests_tree_nestedset_forum_move_test
07-Sep-2019 06:42:32 UnexpectedValueException: Unable to resolve the dependency '\phpbb\db\migration\data\v32x\v327' in /data/phpBB/phpbb/db/migration/schema_generator.php:238
07-Sep-2019 06:42:32 Stack trace:
07-Sep-2019 06:42:32 #0 /data/phpBB/phpbb/db/migration/schema_generator.php(214): phpbb\db\migration\schema_generator->check_dependencies()
07-Sep-2019 06:42:32 #1 /data/tests/test_framework/phpbb_database_test_case.php(84): phpbb\db\migration\schema_generator->get_schema()
07-Sep-2019 06:42:32 #2 /data/phpBB/vendor/phpunit/phpunit/src/Framework/TestSuite.php(672): phpbb_database_test_case::setUpBeforeClass()
07-Sep-2019 06:42:32 #3 /data/phpBB/vendor/phpunit/phpunit/src/Framework/TestSuite.php(722): PHPUnit_Framework_TestSuite->run(Object(PHPUnit_Framework_TestResult))
07-Sep-2019 06:42:32 #4 /data/phpBB/vendor/phpunit/phpunit/src/Framework/TestSuite.php(722): PHPUnit_Framework_TestSuite->run(Object(PHPUnit_Framework_TestResult))
07-Sep-2019 06:42:32 #5 /data/phpBB/vendor/phpunit/phpunit/src/TextUI/TestRunner.php(440): PHPUnit_Framework_TestSuite->run(Object(PHPUnit_Framework_TestResult))
07-Sep-2019 06:42:32 #6 /data/phpBB/vendor/phpunit/phpunit/src/TextUI/Command.php(149): PHPUnit_TextUI_TestRunner->doRun(Object(PHPUnit_Framework_TestSuite), Array)
07-Sep-2019 06:42:32 #7 /data/phpBB/vendor/phpunit/phpunit/src/TextUI/Command.php(100): PHPUnit_TextUI_Command->run(Array, true)
07-Sep-2019 06:42:32 #8 /data/phpBB/vendor/phpunit/phpunit/phpunit(52): PHPUnit_TextUI_Command::main()
07-Sep-2019 06:42:32 #9 {main}
07-Sep-2019 06:42:32 887) phpbb_tests_tree_nestedset_forum_move_test
07-Sep-2019 06:42:32 UnexpectedValueException: Unable to resolve the dependency '\phpbb\db\migration\data\v32x\v327' in /data/phpBB/phpbb/db/migration/schema_generator.php:238
07-Sep-2019 06:42:32 Stack trace:
07-Sep-2019 06:42:32 #0 /data/phpBB/phpbb/db/migration/schema_generator.php(214): phpbb\db\migration\schema_generator->check_dependencies()
07-Sep-2019 06:42:32 #1 /data/tests/test_framework/phpbb_database_test_case.php(84): phpbb\db\migration\schema_generator->get_schema()
07-Sep-2019 06:42:32 #2 /data/phpBB/vendor/phpunit/phpunit/src/Framework/TestSuite.php(672): phpbb_database_test_case::setUpBeforeClass()
07-Sep-2019 06:42:32 #3 /data/phpBB/vendor/phpunit/phpunit/src/Framework/TestSuite.php(722): PHPUnit_Framework_TestSuite->run(Object(PHPUnit_Framework_TestResult))
07-Sep-2019 06:42:32 #4 /data/phpBB/vendor/phpunit/phpunit/src/Framework/TestSuite.php(722): PHPUnit_Framework_TestSuite->run(Object(PHPUnit_Framework_TestResult))
07-Sep-2019 06:42:32 #5 /data/phpBB/vendor/phpunit/phpunit/src/TextUI/TestRunner.php(440): PHPUnit_Framework_TestSuite->run(Object(PHPUnit_Framework_TestResult))
07-Sep-2019 06:42:32 #6 /data/phpBB/vendor/phpunit/phpunit/src/TextUI/Command.php(149): PHPUnit_TextUI_TestRunner->doRun(Object(PHPUnit_Framework_TestSuite), Array)
07-Sep-2019 06:42:32 #7 /data/phpBB/vendor/phpunit/phpunit/src/TextUI/Command.php(100): PHPUnit_TextUI_Command->run(Array, true)
07-Sep-2019 06:42:32 #8 /data/phpBB/vendor/phpunit/phpunit/phpunit(52): PHPUnit_TextUI_Command::main()
07-Sep-2019 06:42:32 #9 {main}
07-Sep-2019 06:42:32 888) phpbb_tests_tree_nestedset_forum_move_test
07-Sep-2019 06:42:32 UnexpectedValueException: Unable to resolve the dependency '\phpbb\db\migration\data\v32x\v327' in /data/phpBB/phpbb/db/migration/schema_generator.php:238
07-Sep-2019 06:42:32 Stack trace:
07-Sep-2019 06:42:32 #0 /data/phpBB/phpbb/db/migration/schema_generator.php(214): phpbb\db\migration\schema_generator->check_dependencies()
07-Sep-2019 06:42:32 #1 /data/tests/test_framework/phpbb_database_test_case.php(84): phpbb\db\migration\schema_generator->get_schema()
07-Sep-2019 06:42:32 #2 /data/phpBB/vendor/phpunit/phpunit/src/Framework/TestSuite.php(672): phpbb_database_test_case::setUpBeforeClass()
07-Sep-2019 06:42:32 #3 /data/phpBB/vendor/phpunit/phpunit/src/Framework/TestSuite.php(722): PHPUnit_Framework_TestSuite->run(Object(PHPUnit_Framework_TestResult))
07-Sep-2019 06:42:32 #4 /data/phpBB/vendor/phpunit/phpunit/src/Framework/TestSuite.php(722): PHPUnit_Framework_TestSuite->run(Object(PHPUnit_Framework_TestResult))
07-Sep-2019 06:42:32 #5 /data/phpBB/vendor/phpunit/phpunit/src/TextUI/TestRunner.php(440): PHPUnit_Framework_TestSuite->run(Object(PHPUnit_Framework_TestResult))
07-Sep-2019 06:42:32 #6 /data/phpBB/vendor/phpunit/phpunit/src/TextUI/Command.php(149): PHPUnit_TextUI_TestRunner->doRun(Object(PHPUnit_Framework_TestSuite), Array)
07-Sep-2019 06:42:32 #7 /data/phpBB/vendor/phpunit/phpunit/src/TextUI/Command.php(100): PHPUnit_TextUI_Command->run(Array, true)
07-Sep-2019 06:42:32 #8 /data/phpBB/vendor/phpunit/phpunit/phpunit(52): PHPUnit_TextUI_Command::main()
07-Sep-2019 06:42:32 #9 {main}
07-Sep-2019 06:42:32 889) phpbb_tests_tree_nestedset_forum_move_test
07-Sep-2019 06:42:32 UnexpectedValueException: Unable to resolve the dependency '\phpbb\db\migration\data\v32x\v327' in /data/phpBB/phpbb/db/migration/schema_generator.php:238
07-Sep-2019 06:42:32 Stack trace:
07-Sep-2019 06:42:32 #0 /data/phpBB/phpbb/db/migration/schema_generator.php(214): phpbb\db\migration\schema_generator->check_dependencies()
07-Sep-2019 06:42:32 #1 /data/tests/test_framework/phpbb_database_test_case.php(84): phpbb\db\migration\schema_generator->get_schema()
07-Sep-2019 06:42:32 #2 /data/phpBB/vendor/phpunit/phpunit/src/Framework/TestSuite.php(672): phpbb_database_test_case::setUpBeforeClass()
07-Sep-2019 06:42:32 #3 /data/phpBB/vendor/phpunit/phpunit/src/Framework/TestSuite.php(722): PHPUnit_Framework_TestSuite->run(Object(PHPUnit_Framework_TestResult))
07-Sep-2019 06:42:32 #4 /data/phpBB/vendor/phpunit/phpunit/src/Framework/TestSuite.php(722): PHPUnit_Framework_TestSuite->run(Object(PHPUnit_Framework_TestResult))
07-Sep-2019 06:42:32 #5 /data/phpBB/vendor/phpunit/phpunit/src/TextUI/TestRunner.php(440): PHPUnit_Framework_TestSuite->run(Object(PHPUnit_Framework_TestResult))
07-Sep-2019 06:42:32 #6 /data/phpBB/vendor/phpunit/phpunit/src/TextUI/Command.php(149): PHPUnit_TextUI_TestRunner->doRun(Object(PHPUnit_Framework_TestSuite), Array)
07-Sep-2019 06:42:32 #7 /data/phpBB/vendor/phpunit/phpunit/src/TextUI/Command.php(100): PHPUnit_TextUI_Command->run(Array, true)
07-Sep-2019 06:42:32 #8 /data/phpBB/vendor/phpunit/phpunit/phpunit(52): PHPUnit_TextUI_Command::main()
07-Sep-2019 06:42:32 #9 {main}
07-Sep-2019 06:42:32 890) phpbb_tests_tree_nestedset_forum_move_test
07-Sep-2019 06:42:32 UnexpectedValueException: Unable to resolve the dependency '\phpbb\db\migration\data\v32x\v327' in /data/phpBB/phpbb/db/migration/schema_generator.php:238
07-Sep-2019 06:42:32 Stack trace:
07-Sep-2019 06:42:32 #0 /data/phpBB/phpbb/db/migration/schema_generator.php(214): phpbb\db\migration\schema_generator->check_dependencies()
07-Sep-2019 06:42:32 #1 /data/tests/test_framework/phpbb_database_test_case.php(84): phpbb\db\migration\schema_generator->get_schema()
07-Sep-2019 06:42:32 #2 /data/phpBB/vendor/phpunit/phpunit/src/Framework/TestSuite.php(672): phpbb_database_test_case::setUpBeforeClass()
07-Sep-2019 06:42:32 #3 /data/phpBB/vendor/phpunit/phpunit/src/Framework/TestSuite.php(722): PHPUnit_Framework_TestSuite->run(Object(PHPUnit_Framework_TestResult))
07-Sep-2019 06:42:32 #4 /data/phpBB/vendor/phpunit/phpunit/src/Framework/TestSuite.php(722): PHPUnit_Framework_TestSuite->run(Object(PHPUnit_Framework_TestResult))
07-Sep-2019 06:42:32 #5 /data/phpBB/vendor/phpunit/phpunit/src/TextUI/TestRunner.php(440): PHPUnit_Framework_TestSuite->run(Object(PHPUnit_Framework_TestResult))
07-Sep-2019 06:42:32 #6 /data/phpBB/vendor/phpunit/phpunit/src/TextUI/Command.php(149): PHPUnit_TextUI_TestRunner->doRun(Object(PHPUnit_Framework_TestSuite), Array)
07-Sep-2019 06:42:32 #7 /data/phpBB/vendor/phpunit/phpunit/src/TextUI/Command.php(100): PHPUnit_TextUI_Command->run(Array, true)
07-Sep-2019 06:42:32 #8 /data/phpBB/vendor/phpunit/phpunit/phpunit(52): PHPUnit_TextUI_Command::main()
07-Sep-2019 06:42:32 #9 {main}
07-Sep-2019 06:42:32 891) phpbb_tests_tree_nestedset_forum_move_test
07-Sep-2019 06:42:32 UnexpectedValueException: Unable to resolve the dependency '\phpbb\db\migration\data\v32x\v327' in /data/phpBB/phpbb/db/migration/schema_generator.php:238
07-Sep-2019 06:42:32 Stack trace:
07-Sep-2019 06:42:32 #0 /data/phpBB/phpbb/db/migration/schema_generator.php(214): phpbb\db\migration\schema_generator->check_dependencies()
07-Sep-2019 06:42:32 #1 /data/tests/test_framework/phpbb_database_test_case.php(84): phpbb\db\migration\schema_generator->get_schema()
07-Sep-2019 06:42:32 #2 /data/phpBB/vendor/phpunit/phpunit/src/Framework/TestSuite.php(672): phpbb_database_test_case::setUpBeforeClass()
07-Sep-2019 06:42:32 #3 /data/phpBB/vendor/phpunit/phpunit/src/Framework/TestSuite.php(722): PHPUnit_Framework_TestSuite->run(Object(PHPUnit_Framework_TestResult))
07-Sep-2019 06:42:32 #4 /data/phpBB/vendor/phpunit/phpunit/src/Framework/TestSuite.php(722): PHPUnit_Framework_TestSuite->run(Object(PHPUnit_Framework_TestResult))
07-Sep-2019 06:42:32 #5 /data/phpBB/vendor/phpunit/phpunit/src/TextUI/TestRunner.php(440): PHPUnit_Framework_TestSuite->run(Object(PHPUnit_Framework_TestResult))
07-Sep-2019 06:42:32 #6 /data/phpBB/vendor/phpunit/phpunit/src/TextUI/Command.php(149): PHPUnit_TextUI_TestRunner->doRun(Object(PHPUnit_Framework_TestSuite), Array)
07-Sep-2019 06:42:32 #7 /data/phpBB/vendor/phpunit/phpunit/src/TextUI/Command.php(100): PHPUnit_TextUI_Command->run(Array, true)
07-Sep-2019 06:42:32 #8 /data/phpBB/vendor/phpunit/phpunit/phpunit(52): PHPUnit_TextUI_Command::main()
07-Sep-2019 06:42:32 #9 {main}
07-Sep-2019 06:42:32 892) phpbb_tests_tree_nestedset_forum_move_test
07-Sep-2019 06:42:32 UnexpectedValueException: Unable to resolve the dependency '\phpbb\db\migration\data\v32x\v327' in /data/phpBB/phpbb/db/migration/schema_generator.php:238
07-Sep-2019 06:42:32 Stack trace:
07-Sep-2019 06:42:32 #0 /data/phpBB/phpbb/db/migration/schema_generator.php(214): phpbb\db\migration\schema_generator->check_dependencies()
07-Sep-2019 06:42:32 #1 /data/tests/test_framework/phpbb_database_test_case.php(84): phpbb\db\migration\schema_generator->get_schema()
07-Sep-2019 06:42:32 #2 /data/phpBB/vendor/phpunit/phpunit/src/Framework/TestSuite.php(672): phpbb_database_test_case::setUpBeforeClass()
07-Sep-2019 06:42:32 #3 /data/phpBB/vendor/phpunit/phpunit/src/Framework/TestSuite.php(722): PHPUnit_Framework_TestSuite->run(Object(PHPUnit_Framework_TestResult))
07-Sep-2019 06:42:32 #4 /data/phpBB/vendor/phpunit/phpunit/src/Framework/TestSuite.php(722): PHPUnit_Framework_TestSuite->run(Object(PHPUnit_Framework_TestResult))
07-Sep-2019 06:42:32 #5 /data/phpBB/vendor/phpunit/phpunit/src/TextUI/TestRunner.php(440): PHPUnit_Framework_TestSuite->run(Object(PHPUnit_Framework_TestResult))
07-Sep-2019 06:42:32 #6 /data/phpBB/vendor/phpunit/phpunit/src/TextUI/Command.php(149): PHPUnit_TextUI_TestRunner->doRun(Object(PHPUnit_Framework_TestSuite), Array)
07-Sep-2019 06:42:32 #7 /data/phpBB/vendor/phpunit/phpunit/src/TextUI/Command.php(100): PHPUnit_TextUI_Command->run(Array, true)
07-Sep-2019 06:42:32 #8 /data/phpBB/vendor/phpunit/phpunit/phpunit(52): PHPUnit_TextUI_Command::main()
07-Sep-2019 06:42:32 #9 {main}
07-Sep-2019 06:42:32 893) phpbb_tests_tree_nestedset_forum_move_test
07-Sep-2019 06:42:32 UnexpectedValueException: Unable to resolve the dependency '\phpbb\db\migration\data\v32x\v327' in /data/phpBB/phpbb/db/migration/schema_generator.php:238
07-Sep-2019 06:42:32 Stack trace:
07-Sep-2019 06:42:32 #0 /data/phpBB/phpbb/db/migration/schema_generator.php(214): phpbb\db\migration\schema_generator->check_dependencies()
07-Sep-2019 06:42:32 #1 /data/tests/test_framework/phpbb_database_test_case.php(84): phpbb\db\migration\schema_generator->get_schema()
07-Sep-2019 06:42:32 #2 /data/phpBB/vendor/phpunit/phpunit/src/Framework/TestSuite.php(672): phpbb_database_test_case::setUpBeforeClass()
07-Sep-2019 06:42:32 #3 /data/phpBB/vendor/phpunit/phpunit/src/Framework/TestSuite.php(722): PHPUnit_Framework_TestSuite->run(Object(PHPUnit_Framework_TestResult))
07-Sep-2019 06:42:32 #4 /data/phpBB/vendor/phpunit/phpunit/src/Framework/TestSuite.php(722): PHPUnit_Framework_TestSuite->run(Object(PHPUnit_Framework_TestResult))
07-Sep-2019 06:42:32 #5 /data/phpBB/vendor/phpunit/phpunit/src/TextUI/TestRunner.php(440): PHPUnit_Framework_TestSuite->run(Object(PHPUnit_Framework_TestResult))
07-Sep-2019 06:42:32 #6 /data/phpBB/vendor/phpunit/phpunit/src/TextUI/Command.php(149): PHPUnit_TextUI_TestRunner->doRun(Object(PHPUnit_Framework_TestSuite), Array)
07-Sep-2019 06:42:32 #7 /data/phpBB/vendor/phpunit/phpunit/src/TextUI/Command.php(100): PHPUnit_TextUI_Command->run(Array, true)
07-Sep-2019 06:42:32 #8 /data/phpBB/vendor/phpunit/phpunit/phpunit(52): PHPUnit_TextUI_Command::main()
07-Sep-2019 06:42:32 #9 {main}
07-Sep-2019 06:42:32 894) phpbb_tests_tree_nestedset_forum_move_test
07-Sep-2019 06:42:32 UnexpectedValueException: Unable to resolve the dependency '\phpbb\db\migration\data\v32x\v327' in /data/phpBB/phpbb/db/migration/schema_generator.php:238
07-Sep-2019 06:42:32 Stack trace:
07-Sep-2019 06:42:32 #0 /data/phpBB/phpbb/db/migration/schema_generator.php(214): phpbb\db\migration\schema_generator->check_dependencies()
07-Sep-2019 06:42:32 #1 /data/tests/test_framework/phpbb_database_test_case.php(84): phpbb\db\migration\schema_generator->get_schema()
07-Sep-2019 06:42:32 #2 /data/phpBB/vendor/phpunit/phpunit/src/Framework/TestSuite.php(672): phpbb_database_test_case::setUpBeforeClass()
07-Sep-2019 06:42:32 #3 /data/phpBB/vendor/phpunit/phpunit/src/Framework/TestSuite.php(722): PHPUnit_Framework_TestSuite->run(Object(PHPUnit_Framework_TestResult))
07-Sep-2019 06:42:32 #4 /data/phpBB/vendor/phpunit/phpunit/src/Framework/TestSuite.php(722): PHPUnit_Framework_TestSuite->run(Object(PHPUnit_Framework_TestResult))
07-Sep-2019 06:42:32 #5 /data/phpBB/vendor/phpunit/phpunit/src/TextUI/TestRunner.php(440): PHPUnit_Framework_TestSuite->run(Object(PHPUnit_Framework_TestResult))
07-Sep-2019 06:42:32 #6 /data/phpBB/vendor/phpunit/phpunit/src/TextUI/Command.php(149): PHPUnit_TextUI_TestRunner->doRun(Object(PHPUnit_Framework_TestSuite), Array)
07-Sep-2019 06:42:32 #7 /data/phpBB/vendor/phpunit/phpunit/src/TextUI/Command.php(100): PHPUnit_TextUI_Command->run(Array, true)
07-Sep-2019 06:42:32 #8 /data/phpBB/vendor/phpunit/phpunit/phpunit(52): PHPUnit_TextUI_Command::main()
07-Sep-2019 06:42:32 #9 {main}
07-Sep-2019 06:42:32 895) phpbb_tests_tree_nestedset_forum_move_test
07-Sep-2019 06:42:32 UnexpectedValueException: Unable to resolve the dependency '\phpbb\db\migration\data\v32x\v327' in /data/phpBB/phpbb/db/migration/schema_generator.php:238
07-Sep-2019 06:42:32 Stack trace:
07-Sep-2019 06:42:32 #0 /data/phpBB/phpbb/db/migration/schema_generator.php(214): phpbb\db\migration\schema_generator->check_dependencies()
07-Sep-2019 06:42:32 #1 /data/tests/test_framework/phpbb_database_test_case.php(84): phpbb\db\migration\schema_generator->get_schema()
07-Sep-2019 06:42:32 #2 /data/phpBB/vendor/phpunit/phpunit/src/Framework/TestSuite.php(672): phpbb_database_test_case::setUpBeforeClass()
07-Sep-2019 06:42:32 #3 /data/phpBB/vendor/phpunit/phpunit/src/Framework/TestSuite.php(722): PHPUnit_Framework_TestSuite->run(Object(PHPUnit_Framework_TestResult))
07-Sep-2019 06:42:32 #4 /data/phpBB/vendor/phpunit/phpunit/src/Framework/TestSuite.php(722): PHPUnit_Framework_TestSuite->run(Object(PHPUnit_Framework_TestResult))
07-Sep-2019 06:42:32 #5 /data/phpBB/vendor/phpunit/phpunit/src/TextUI/TestRunner.php(440): PHPUnit_Framework_TestSuite->run(Object(PHPUnit_Framework_TestResult))
07-Sep-2019 06:42:32 #6 /data/phpBB/vendor/phpunit/phpunit/src/TextUI/Command.php(149): PHPUnit_TextUI_TestRunner->doRun(Object(PHPUnit_Framework_TestSuite), Array)
07-Sep-2019 06:42:32 #7 /data/phpBB/vendor/phpunit/phpunit/src/TextUI/Command.php(100): PHPUnit_TextUI_Command->run(Array, true)
07-Sep-2019 06:42:32 #8 /data/phpBB/vendor/phpunit/phpunit/phpunit(52): PHPUnit_TextUI_Command::main()
07-Sep-2019 06:42:32 #9 {main}
07-Sep-2019 06:42:32 896) phpbb_tests_tree_nestedset_forum_move_test
07-Sep-2019 06:42:32 UnexpectedValueException: Unable to resolve the dependency '\phpbb\db\migration\data\v32x\v327' in /data/phpBB/phpbb/db/migration/schema_generator.php:238
07-Sep-2019 06:42:32 Stack trace:
07-Sep-2019 06:42:32 #0 /data/phpBB/phpbb/db/migration/schema_generator.php(214): phpbb\db\migration\schema_generator->check_dependencies()
07-Sep-2019 06:42:32 #1 /data/tests/test_framework/phpbb_database_test_case.php(84): phpbb\db\migration\schema_generator->get_schema()
07-Sep-2019 06:42:32 #2 /data/phpBB/vendor/phpunit/phpunit/src/Framework/TestSuite.php(672): phpbb_database_test_case::setUpBeforeClass()
07-Sep-2019 06:42:32 #3 /data/phpBB/vendor/phpunit/phpunit/src/Framework/TestSuite.php(722): PHPUnit_Framework_TestSuite->run(Object(PHPUnit_Framework_TestResult))
07-Sep-2019 06:42:32 #4 /data/phpBB/vendor/phpunit/phpunit/src/Framework/TestSuite.php(722): PHPUnit_Framework_TestSuite->run(Object(PHPUnit_Framework_TestResult))
07-Sep-2019 06:42:32 #5 /data/phpBB/vendor/phpunit/phpunit/src/TextUI/TestRunner.php(440): PHPUnit_Framework_TestSuite->run(Object(PHPUnit_Framework_TestResult))
07-Sep-2019 06:42:32 #6 /data/phpBB/vendor/phpunit/phpunit/src/TextUI/Command.php(149): PHPUnit_TextUI_TestRunner->doRun(Object(PHPUnit_Framework_TestSuite), Array)
07-Sep-2019 06:42:32 #7 /data/phpBB/vendor/phpunit/phpunit/src/TextUI/Command.php(100): PHPUnit_TextUI_Command->run(Array, true)
07-Sep-2019 06:42:32 #8 /data/phpBB/vendor/phpunit/phpunit/phpunit(52): PHPUnit_TextUI_Command::main()
07-Sep-2019 06:42:32 #9 {main}
07-Sep-2019 06:42:32 897) phpbb_tests_tree_nestedset_forum_regenerate_test
07-Sep-2019 06:42:32 UnexpectedValueException: Unable to resolve the dependency '\phpbb\db\migration\data\v32x\v327' in /data/phpBB/phpbb/db/migration/schema_generator.php:238
07-Sep-2019 06:42:32 Stack trace:
07-Sep-2019 06:42:32 #0 /data/phpBB/phpbb/db/migration/schema_generator.php(214): phpbb\db\migration\schema_generator->check_dependencies()
07-Sep-2019 06:42:32 #1 /data/tests/test_framework/phpbb_database_test_case.php(84): phpbb\db\migration\schema_generator->get_schema()
07-Sep-2019 06:42:32 #2 /data/phpBB/vendor/phpunit/phpunit/src/Framework/TestSuite.php(672): phpbb_database_test_case::setUpBeforeClass()
07-Sep-2019 06:42:32 #3 /data/phpBB/vendor/phpunit/phpunit/src/Framework/TestSuite.php(722): PHPUnit_Framework_TestSuite->run(Object(PHPUnit_Framework_TestResult))
07-Sep-2019 06:42:32 #4 /data/phpBB/vendor/phpunit/phpunit/src/Framework/TestSuite.php(722): PHPUnit_Framework_TestSuite->run(Object(PHPUnit_Framework_TestResult))
07-Sep-2019 06:42:32 #5 /data/phpBB/vendor/phpunit/phpunit/src/TextUI/TestRunner.php(440): PHPUnit_Framework_TestSuite->run(Object(PHPUnit_Framework_TestResult))
07-Sep-2019 06:42:32 #6 /data/phpBB/vendor/phpunit/phpunit/src/TextUI/Command.php(149): PHPUnit_TextUI_TestRunner->doRun(Object(PHPUnit_Framework_TestSuite), Array)
07-Sep-2019 06:42:32 #7 /data/phpBB/vendor/phpunit/phpunit/src/TextUI/Command.php(100): PHPUnit_TextUI_Command->run(Array, true)
07-Sep-2019 06:42:32 #8 /data/phpBB/vendor/phpunit/phpunit/phpunit(52): PHPUnit_TextUI_Command::main()
07-Sep-2019 06:42:32 #9 {main}
07-Sep-2019 06:42:32 898) phpbb_tests_tree_nestedset_forum_regenerate_test
07-Sep-2019 06:42:32 UnexpectedValueException: Unable to resolve the dependency '\phpbb\db\migration\data\v32x\v327' in /data/phpBB/phpbb/db/migration/schema_generator.php:238
07-Sep-2019 06:42:32 Stack trace:
07-Sep-2019 06:42:32 #0 /data/phpBB/phpbb/db/migration/schema_generator.php(214): phpbb\db\migration\schema_generator->check_dependencies()
07-Sep-2019 06:42:32 #1 /data/tests/test_framework/phpbb_database_test_case.php(84): phpbb\db\migration\schema_generator->get_schema()
07-Sep-2019 06:42:32 #2 /data/phpBB/vendor/phpunit/phpunit/src/Framework/TestSuite.php(672): phpbb_database_test_case::setUpBeforeClass()
07-Sep-2019 06:42:32 #3 /data/phpBB/vendor/phpunit/phpunit/src/Framework/TestSuite.php(722): PHPUnit_Framework_TestSuite->run(Object(PHPUnit_Framework_TestResult))
07-Sep-2019 06:42:32 #4 /data/phpBB/vendor/phpunit/phpunit/src/Framework/TestSuite.php(722): PHPUnit_Framework_TestSuite->run(Object(PHPUnit_Framework_TestResult))
07-Sep-2019 06:42:32 #5 /data/phpBB/vendor/phpunit/phpunit/src/TextUI/TestRunner.php(440): PHPUnit_Framework_TestSuite->run(Object(PHPUnit_Framework_TestResult))
07-Sep-2019 06:42:32 #6 /data/phpBB/vendor/phpunit/phpunit/src/TextUI/Command.php(149): PHPUnit_TextUI_TestRunner->doRun(Object(PHPUnit_Framework_TestSuite), Array)
07-Sep-2019 06:42:32 #7 /data/phpBB/vendor/phpunit/phpunit/src/TextUI/Command.php(100): PHPUnit_TextUI_Command->run(Array, true)
07-Sep-2019 06:42:32 #8 /data/phpBB/vendor/phpunit/phpunit/phpunit(52): PHPUnit_TextUI_Command::main()
07-Sep-2019 06:42:32 #9 {main}
07-Sep-2019 06:42:32 899) phpbb_tests_tree_nestedset_forum_regenerate_test
07-Sep-2019 06:42:32 UnexpectedValueException: Unable to resolve the dependency '\phpbb\db\migration\data\v32x\v327' in /data/phpBB/phpbb/db/migration/schema_generator.php:238
07-Sep-2019 06:42:32 Stack trace:
07-Sep-2019 06:42:32 #0 /data/phpBB/phpbb/db/migration/schema_generator.php(214): phpbb\db\migration\schema_generator->check_dependencies()
07-Sep-2019 06:42:32 #1 /data/tests/test_framework/phpbb_database_test_case.php(84): phpbb\db\migration\schema_generator->get_schema()
07-Sep-2019 06:42:32 #2 /data/phpBB/vendor/phpunit/phpunit/src/Framework/TestSuite.php(672): phpbb_database_test_case::setUpBeforeClass()
07-Sep-2019 06:42:32 #3 /data/phpBB/vendor/phpunit/phpunit/src/Framework/TestSuite.php(722): PHPUnit_Framework_TestSuite->run(Object(PHPUnit_Framework_TestResult))
07-Sep-2019 06:42:32 #4 /data/phpBB/vendor/phpunit/phpunit/src/Framework/TestSuite.php(722): PHPUnit_Framework_TestSuite->run(Object(PHPUnit_Framework_TestResult))
07-Sep-2019 06:42:32 #5 /data/phpBB/vendor/phpunit/phpunit/src/TextUI/TestRunner.php(440): PHPUnit_Framework_TestSuite->run(Object(PHPUnit_Framework_TestResult))
07-Sep-2019 06:42:32 #6 /data/phpBB/vendor/phpunit/phpunit/src/TextUI/Command.php(149): PHPUnit_TextUI_TestRunner->doRun(Object(PHPUnit_Framework_TestSuite), Array)
07-Sep-2019 06:42:32 #7 /data/phpBB/vendor/phpunit/phpunit/src/TextUI/Command.php(100): PHPUnit_TextUI_Command->run(Array, true)
07-Sep-2019 06:42:32 #8 /data/phpBB/vendor/phpunit/phpunit/phpunit(52): PHPUnit_TextUI_Command::main()
07-Sep-2019 06:42:32 #9 {main}
07-Sep-2019 06:42:32 900) phpbb_tests_tree_nestedset_forum_regenerate_test
07-Sep-2019 06:42:32 UnexpectedValueException: Unable to resolve the dependency '\phpbb\db\migration\data\v32x\v327' in /data/phpBB/phpbb/db/migration/schema_generator.php:238
07-Sep-2019 06:42:32 Stack trace:
07-Sep-2019 06:42:32 #0 /data/phpBB/phpbb/db/migration/schema_generator.php(214): phpbb\db\migration\schema_generator->check_dependencies()
07-Sep-2019 06:42:32 #1 /data/tests/test_framework/phpbb_database_test_case.php(84): phpbb\db\migration\schema_generator->get_schema()
07-Sep-2019 06:42:32 #2 /data/phpBB/vendor/phpunit/phpunit/src/Framework/TestSuite.php(672): phpbb_database_test_case::setUpBeforeClass()
07-Sep-2019 06:42:32 #3 /data/phpBB/vendor/phpunit/phpunit/src/Framework/TestSuite.php(722): PHPUnit_Framework_TestSuite->run(Object(PHPUnit_Framework_TestResult))
07-Sep-2019 06:42:32 #4 /data/phpBB/vendor/phpunit/phpunit/src/Framework/TestSuite.php(722): PHPUnit_Framework_TestSuite->run(Object(PHPUnit_Framework_TestResult))
07-Sep-2019 06:42:32 #5 /data/phpBB/vendor/phpunit/phpunit/src/TextUI/TestRunner.php(440): PHPUnit_Framework_TestSuite->run(Object(PHPUnit_Framework_TestResult))
07-Sep-2019 06:42:32 #6 /data/phpBB/vendor/phpunit/phpunit/src/TextUI/Command.php(149): PHPUnit_TextUI_TestRunner->doRun(Object(PHPUnit_Framework_TestSuite), Array)
07-Sep-2019 06:42:32 #7 /data/phpBB/vendor/phpunit/phpunit/src/TextUI/Command.php(100): PHPUnit_TextUI_Command->run(Array, true)
07-Sep-2019 06:42:32 #8 /data/phpBB/vendor/phpunit/phpunit/phpunit(52): PHPUnit_TextUI_Command::main()
07-Sep-2019 06:42:32 #9 {main}
07-Sep-2019 06:42:32 901) phpbb_tests_tree_nestedset_forum_regenerate_test
07-Sep-2019 06:42:32 UnexpectedValueException: Unable to resolve the dependency '\phpbb\db\migration\data\v32x\v327' in /data/phpBB/phpbb/db/migration/schema_generator.php:238
07-Sep-2019 06:42:32 Stack trace:
07-Sep-2019 06:42:32 #0 /data/phpBB/phpbb/db/migration/schema_generator.php(214): phpbb\db\migration\schema_generator->check_dependencies()
07-Sep-2019 06:42:32 #1 /data/tests/test_framework/phpbb_database_test_case.php(84): phpbb\db\migration\schema_generator->get_schema()
07-Sep-2019 06:42:32 #2 /data/phpBB/vendor/phpunit/phpunit/src/Framework/TestSuite.php(672): phpbb_database_test_case::setUpBeforeClass()
07-Sep-2019 06:42:32 #3 /data/phpBB/vendor/phpunit/phpunit/src/Framework/TestSuite.php(722): PHPUnit_Framework_TestSuite->run(Object(PHPUnit_Framework_TestResult))
07-Sep-2019 06:42:32 #4 /data/phpBB/vendor/phpunit/phpunit/src/Framework/TestSuite.php(722): PHPUnit_Framework_TestSuite->run(Object(PHPUnit_Framework_TestResult))
07-Sep-2019 06:42:32 #5 /data/phpBB/vendor/phpunit/phpunit/src/TextUI/TestRunner.php(440): PHPUnit_Framework_TestSuite->run(Object(PHPUnit_Framework_TestResult))
07-Sep-2019 06:42:32 #6 /data/phpBB/vendor/phpunit/phpunit/src/TextUI/Command.php(149): PHPUnit_TextUI_TestRunner->doRun(Object(PHPUnit_Framework_TestSuite), Array)
07-Sep-2019 06:42:32 #7 /data/phpBB/vendor/phpunit/phpunit/src/TextUI/Command.php(100): PHPUnit_TextUI_Command->run(Array, true)
07-Sep-2019 06:42:32 #8 /data/phpBB/vendor/phpunit/phpunit/phpunit(52): PHPUnit_TextUI_Command::main()
07-Sep-2019 06:42:32 #9 {main}
07-Sep-2019 06:42:32 902) phpbb_tests_tree_nestedset_forum_regenerate_test
07-Sep-2019 06:42:32 UnexpectedValueException: Unable to resolve the dependency '\phpbb\db\migration\data\v32x\v327' in /data/phpBB/phpbb/db/migration/schema_generator.php:238
07-Sep-2019 06:42:32 Stack trace:
07-Sep-2019 06:42:32 #0 /data/phpBB/phpbb/db/migration/schema_generator.php(214): phpbb\db\migration\schema_generator->check_dependencies()
07-Sep-2019 06:42:32 #1 /data/tests/test_framework/phpbb_database_test_case.php(84): phpbb\db\migration\schema_generator->get_schema()
07-Sep-2019 06:42:32 #2 /data/phpBB/vendor/phpunit/phpunit/src/Framework/TestSuite.php(672): phpbb_database_test_case::setUpBeforeClass()
07-Sep-2019 06:42:32 #3 /data/phpBB/vendor/phpunit/phpunit/src/Framework/TestSuite.php(722): PHPUnit_Framework_TestSuite->run(Object(PHPUnit_Framework_TestResult))
07-Sep-2019 06:42:32 #4 /data/phpBB/vendor/phpunit/phpunit/src/Framework/TestSuite.php(722): PHPUnit_Framework_TestSuite->run(Object(PHPUnit_Framework_TestResult))
07-Sep-2019 06:42:32 #5 /data/phpBB/vendor/phpunit/phpunit/src/TextUI/TestRunner.php(440): PHPUnit_Framework_TestSuite->run(Object(PHPUnit_Framework_TestResult))
07-Sep-2019 06:42:32 #6 /data/phpBB/vendor/phpunit/phpunit/src/TextUI/Command.php(149): PHPUnit_TextUI_TestRunner->doRun(Object(PHPUnit_Framework_TestSuite), Array)
07-Sep-2019 06:42:32 #7 /data/phpBB/vendor/phpunit/phpunit/src/TextUI/Command.php(100): PHPUnit_TextUI_Command->run(Array, true)
07-Sep-2019 06:42:32 #8 /data/phpBB/vendor/phpunit/phpunit/phpunit(52): PHPUnit_TextUI_Command::main()
07-Sep-2019 06:42:32 #9 {main}
07-Sep-2019 06:42:32 903) pphpbb_tests_tree_nestedset_forum_test
07-Sep-2019 06:42:32 UnexpectedValueException: Unable to resolve the dependency '\phpbb\db\migration\data\v32x\v327' in /data/phpBB/phpbb/db/migration/schema_generator.php:238
07-Sep-2019 06:42:32 Stack trace:
07-Sep-2019 06:42:32 #0 /data/phpBB/phpbb/db/migration/schema_generator.php(214): phpbb\db\migration\schema_generator->check_dependencies()
07-Sep-2019 06:42:32 #1 /data/tests/test_framework/phpbb_database_test_case.php(84): phpbb\db\migration\schema_generator->get_schema()
07-Sep-2019 06:42:32 #2 /data/phpBB/vendor/phpunit/phpunit/src/Framework/TestSuite.php(672): phpbb_database_test_case::setUpBeforeClass()
07-Sep-2019 06:42:32 #3 /data/phpBB/vendor/phpunit/phpunit/src/Framework/TestSuite.php(722): PHPUnit_Framework_TestSuite->run(Object(PHPUnit_Framework_TestResult))
07-Sep-2019 06:42:32 #4 /data/phpBB/vendor/phpunit/phpunit/src/Framework/TestSuite.php(722): PHPUnit_Framework_TestSuite->run(Object(PHPUnit_Framework_TestResult))
07-Sep-2019 06:42:32 #5 /data/phpBB/vendor/phpunit/phpunit/src/TextUI/TestRunner.php(440): PHPUnit_Framework_TestSuite->run(Object(PHPUnit_Framework_TestResult))
07-Sep-2019 06:42:32 #6 /data/phpBB/vendor/phpunit/phpunit/src/TextUI/Command.php(149): PHPUnit_TextUI_TestRunner->doRun(Object(PHPUnit_Framework_TestSuite), Array)
07-Sep-2019 06:42:32 #7 /data/phpBB/vendor/phpunit/phpunit/src/TextUI/Command.php(100): PHPUnit_TextUI_Command->run(Array, true)
07-Sep-2019 06:42:32 #8 /data/phpBB/vendor/phpunit/phpunit/phpunit(52): PHPUnit_TextUI_Command::main()
07-Sep-2019 06:42:32 #9 {main}
07-Sep-2019 06:42:32 904) pphpbb_tests_tree_nestedset_forum_test
07-Sep-2019 06:42:32 UnexpectedValueException: Unable to resolve the dependency '\phpbb\db\migration\data\v32x\v327' in /data/phpBB/phpbb/db/migration/schema_generator.php:238
07-Sep-2019 06:42:32 Stack trace:
07-Sep-2019 06:42:32 #0 /data/phpBB/phpbb/db/migration/schema_generator.php(214): phpbb\db\migration\schema_generator->check_dependencies()
07-Sep-2019 06:42:32 #1 /data/tests/test_framework/phpbb_database_test_case.php(84): phpbb\db\migration\schema_generator->get_schema()
07-Sep-2019 06:42:32 #2 /data/phpBB/vendor/phpunit/phpunit/src/Framework/TestSuite.php(672): phpbb_database_test_case::setUpBeforeClass()
07-Sep-2019 06:42:32 #3 /data/phpBB/vendor/phpunit/phpunit/src/Framework/TestSuite.php(722): PHPUnit_Framework_TestSuite->run(Object(PHPUnit_Framework_TestResult))
07-Sep-2019 06:42:32 #4 /data/phpBB/vendor/phpunit/phpunit/src/Framework/TestSuite.php(722): PHPUnit_Framework_TestSuite->run(Object(PHPUnit_Framework_TestResult))
07-Sep-2019 06:42:32 #5 /data/phpBB/vendor/phpunit/phpunit/src/TextUI/TestRunner.php(440): PHPUnit_Framework_TestSuite->run(Object(PHPUnit_Framework_TestResult))
07-Sep-2019 06:42:32 #6 /data/phpBB/vendor/phpunit/phpunit/src/TextUI/Command.php(149): PHPUnit_TextUI_TestRunner->doRun(Object(PHPUnit_Framework_TestSuite), Array)
07-Sep-2019 06:42:32 #7 /data/phpBB/vendor/phpunit/phpunit/src/TextUI/Command.php(100): PHPUnit_TextUI_Command->run(Array, true)
07-Sep-2019 06:42:32 #8 /data/phpBB/vendor/phpunit/phpunit/phpunit(52): PHPUnit_TextUI_Command::main()
07-Sep-2019 06:42:32 #9 {main}
07-Sep-2019 06:42:32 905) pphpbb_tests_tree_nestedset_forum_test
07-Sep-2019 06:42:32 UnexpectedValueException: Unable to resolve the dependency '\phpbb\db\migration\data\v32x\v327' in /data/phpBB/phpbb/db/migration/schema_generator.php:238
07-Sep-2019 06:42:32 Stack trace:
07-Sep-2019 06:42:32 #0 /data/phpBB/phpbb/db/migration/schema_generator.php(214): phpbb\db\migration\schema_generator->check_dependencies()
07-Sep-2019 06:42:32 #1 /data/tests/test_framework/phpbb_database_test_case.php(84): phpbb\db\migration\schema_generator->get_schema()
07-Sep-2019 06:42:32 #2 /data/phpBB/vendor/phpunit/phpunit/src/Framework/TestSuite.php(672): phpbb_database_test_case::setUpBeforeClass()
07-Sep-2019 06:42:32 #3 /data/phpBB/vendor/phpunit/phpunit/src/Framework/TestSuite.php(722): PHPUnit_Framework_TestSuite->run(Object(PHPUnit_Framework_TestResult))
07-Sep-2019 06:42:32 #4 /data/phpBB/vendor/phpunit/phpunit/src/Framework/TestSuite.php(722): PHPUnit_Framework_TestSuite->run(Object(PHPUnit_Framework_TestResult))
07-Sep-2019 06:42:32 #5 /data/phpBB/vendor/phpunit/phpunit/src/TextUI/TestRunner.php(440): PHPUnit_Framework_TestSuite->run(Object(PHPUnit_Framework_TestResult))
07-Sep-2019 06:42:32 #6 /data/phpBB/vendor/phpunit/phpunit/src/TextUI/Command.php(149): PHPUnit_TextUI_TestRunner->doRun(Object(PHPUnit_Framework_TestSuite), Array)
07-Sep-2019 06:42:32 #7 /data/phpBB/vendor/phpunit/phpunit/src/TextUI/Command.php(100): PHPUnit_TextUI_Command->run(Array, true)
07-Sep-2019 06:42:32 #8 /data/phpBB/vendor/phpunit/phpunit/phpunit(52): PHPUnit_TextUI_Command::main()
07-Sep-2019 06:42:32 #9 {main}
07-Sep-2019 06:42:32 906) pphpbb_tests_tree_nestedset_forum_test
07-Sep-2019 06:42:32 UnexpectedValueException: Unable to resolve the dependency '\phpbb\db\migration\data\v32x\v327' in /data/phpBB/phpbb/db/migration/schema_generator.php:238
07-Sep-2019 06:42:32 Stack trace:
07-Sep-2019 06:42:32 #0 /data/phpBB/phpbb/db/migration/schema_generator.php(214): phpbb\db\migration\schema_generator->check_dependencies()
07-Sep-2019 06:42:32 #1 /data/tests/test_framework/phpbb_database_test_case.php(84): phpbb\db\migration\schema_generator->get_schema()
07-Sep-2019 06:42:32 #2 /data/phpBB/vendor/phpunit/phpunit/src/Framework/TestSuite.php(672): phpbb_database_test_case::setUpBeforeClass()
07-Sep-2019 06:42:32 #3 /data/phpBB/vendor/phpunit/phpunit/src/Framework/TestSuite.php(722): PHPUnit_Framework_TestSuite->run(Object(PHPUnit_Framework_TestResult))
07-Sep-2019 06:42:32 #4 /data/phpBB/vendor/phpunit/phpunit/src/Framework/TestSuite.php(722): PHPUnit_Framework_TestSuite->run(Object(PHPUnit_Framework_TestResult))
07-Sep-2019 06:42:32 #5 /data/phpBB/vendor/phpunit/phpunit/src/TextUI/TestRunner.php(440): PHPUnit_Framework_TestSuite->run(Object(PHPUnit_Framework_TestResult))
07-Sep-2019 06:42:32 #6 /data/phpBB/vendor/phpunit/phpunit/src/TextUI/Command.php(149): PHPUnit_TextUI_TestRunner->doRun(Object(PHPUnit_Framework_TestSuite), Array)
07-Sep-2019 06:42:32 #7 /data/phpBB/vendor/phpunit/phpunit/src/TextUI/Command.php(100): PHPUnit_TextUI_Command->run(Array, true)
07-Sep-2019 06:42:32 #8 /data/phpBB/vendor/phpunit/phpunit/phpunit(52): PHPUnit_TextUI_Command::main()
07-Sep-2019 06:42:32 #9 {main}
07-Sep-2019 06:42:32 907) pphpbb_tests_tree_nestedset_forum_test
07-Sep-2019 06:42:32 UnexpectedValueException: Unable to resolve the dependency '\phpbb\db\migration\data\v32x\v327' in /data/phpBB/phpbb/db/migration/schema_generator.php:238
07-Sep-2019 06:42:32 Stack trace:
07-Sep-2019 06:42:32 #0 /data/phpBB/phpbb/db/migration/schema_generator.php(214): phpbb\db\migration\schema_generator->check_dependencies()
07-Sep-2019 06:42:32 #1 /data/tests/test_framework/phpbb_database_test_case.php(84): phpbb\db\migration\schema_generator->get_schema()
07-Sep-2019 06:42:32 #2 /data/phpBB/vendor/phpunit/phpunit/src/Framework/TestSuite.php(672): phpbb_database_test_case::setUpBeforeClass()
07-Sep-2019 06:42:32 #3 /data/phpBB/vendor/phpunit/phpunit/src/Framework/TestSuite.php(722): PHPUnit_Framework_TestSuite->run(Object(PHPUnit_Framework_TestResult))
07-Sep-2019 06:42:32 #4 /data/phpBB/vendor/phpunit/phpunit/src/Framework/TestSuite.php(722): PHPUnit_Framework_TestSuite->run(Object(PHPUnit_Framework_TestResult))
07-Sep-2019 06:42:32 #5 /data/phpBB/vendor/phpunit/phpunit/src/TextUI/TestRunner.php(440): PHPUnit_Framework_TestSuite->run(Object(PHPUnit_Framework_TestResult))
07-Sep-2019 06:42:32 #6 /data/phpBB/vendor/phpunit/phpunit/src/TextUI/Command.php(149): PHPUnit_TextUI_TestRunner->doRun(Object(PHPUnit_Framework_TestSuite), Array)
07-Sep-2019 06:42:32 #7 /data/phpBB/vendor/phpunit/phpunit/src/TextUI/Command.php(100): PHPUnit_TextUI_Command->run(Array, true)
07-Sep-2019 06:42:32 #8 /data/phpBB/vendor/phpunit/phpunit/phpunit(52): PHPUnit_TextUI_Command::main()
07-Sep-2019 06:42:32 #9 {main}
07-Sep-2019 06:42:32 908) phpbb_user_loader_test
07-Sep-2019 06:42:32 UnexpectedValueException: Unable to resolve the dependency '\phpbb\db\migration\data\v32x\v327' in /data/phpBB/phpbb/db/migration/schema_generator.php:238
07-Sep-2019 06:42:32 Stack trace:
07-Sep-2019 06:42:32 #0 /data/phpBB/phpbb/db/migration/schema_generator.php(214): phpbb\db\migration\schema_generator->check_dependencies()
07-Sep-2019 06:42:32 #1 /data/tests/test_framework/phpbb_database_test_case.php(84): phpbb\db\migration\schema_generator->get_schema()
07-Sep-2019 06:42:32 #2 /data/phpBB/vendor/phpunit/phpunit/src/Framework/TestSuite.php(672): phpbb_database_test_case::setUpBeforeClass()
07-Sep-2019 06:42:32 #3 /data/phpBB/vendor/phpunit/phpunit/src/Framework/TestSuite.php(722): PHPUnit_Framework_TestSuite->run(Object(PHPUnit_Framework_TestResult))
07-Sep-2019 06:42:32 #4 /data/phpBB/vendor/phpunit/phpunit/src/Framework/TestSuite.php(722): PHPUnit_Framework_TestSuite->run(Object(PHPUnit_Framework_TestResult))
07-Sep-2019 06:42:32 #5 /data/phpBB/vendor/phpunit/phpunit/src/TextUI/TestRunner.php(440): PHPUnit_Framework_TestSuite->run(Object(PHPUnit_Framework_TestResult))
07-Sep-2019 06:42:32 #6 /data/phpBB/vendor/phpunit/phpunit/src/TextUI/Command.php(149): PHPUnit_TextUI_TestRunner->doRun(Object(PHPUnit_Framework_TestSuite), Array)
07-Sep-2019 06:42:32 #7 /data/phpBB/vendor/phpunit/phpunit/src/TextUI/Command.php(100): PHPUnit_TextUI_Command->run(Array, true)
07-Sep-2019 06:42:32 #8 /data/phpBB/vendor/phpunit/phpunit/phpunit(52): PHPUnit_TextUI_Command::main()
07-Sep-2019 06:42:32 #9 {main}
07-Sep-2019 06:42:32 909) phpbb_user_loader_test
07-Sep-2019 06:42:32 UnexpectedValueException: Unable to resolve the dependency '\phpbb\db\migration\data\v32x\v327' in /data/phpBB/phpbb/db/migration/schema_generator.php:238
07-Sep-2019 06:42:32 Stack trace:
07-Sep-2019 06:42:32 #0 /data/phpBB/phpbb/db/migration/schema_generator.php(214): phpbb\db\migration\schema_generator->check_dependencies()
07-Sep-2019 06:42:32 #1 /data/tests/test_framework/phpbb_database_test_case.php(84): phpbb\db\migration\schema_generator->get_schema()
07-Sep-2019 06:42:32 #2 /data/phpBB/vendor/phpunit/phpunit/src/Framework/TestSuite.php(672): phpbb_database_test_case::setUpBeforeClass()
07-Sep-2019 06:42:32 #3 /data/phpBB/vendor/phpunit/phpunit/src/Framework/TestSuite.php(722): PHPUnit_Framework_TestSuite->run(Object(PHPUnit_Framework_TestResult))
07-Sep-2019 06:42:32 #4 /data/phpBB/vendor/phpunit/phpunit/src/Framework/TestSuite.php(722): PHPUnit_Framework_TestSuite->run(Object(PHPUnit_Framework_TestResult))
07-Sep-2019 06:42:32 #5 /data/phpBB/vendor/phpunit/phpunit/src/TextUI/TestRunner.php(440): PHPUnit_Framework_TestSuite->run(Object(PHPUnit_Framework_TestResult))
07-Sep-2019 06:42:32 #6 /data/phpBB/vendor/phpunit/phpunit/src/TextUI/Command.php(149): PHPUnit_TextUI_TestRunner->doRun(Object(PHPUnit_Framework_TestSuite), Array)
07-Sep-2019 06:42:32 #7 /data/phpBB/vendor/phpunit/phpunit/src/TextUI/Command.php(100): PHPUnit_TextUI_Command->run(Array, true)
07-Sep-2019 06:42:32 #8 /data/phpBB/vendor/phpunit/phpunit/phpunit(52): PHPUnit_TextUI_Command::main()
07-Sep-2019 06:42:32 #9 {main}
07-Sep-2019 06:42:32 910) phpbb_user_loader_test
07-Sep-2019 06:42:32 UnexpectedValueException: Unable to resolve the dependency '\phpbb\db\migration\data\v32x\v327' in /data/phpBB/phpbb/db/migration/schema_generator.php:238
07-Sep-2019 06:42:32 Stack trace:
07-Sep-2019 06:42:32 #0 /data/phpBB/phpbb/db/migration/schema_generator.php(214): phpbb\db\migration\schema_generator->check_dependencies()
07-Sep-2019 06:42:32 #1 /data/tests/test_framework/phpbb_database_test_case.php(84): phpbb\db\migration\schema_generator->get_schema()
07-Sep-2019 06:42:32 #2 /data/phpBB/vendor/phpunit/phpunit/src/Framework/TestSuite.php(672): phpbb_database_test_case::setUpBeforeClass()
07-Sep-2019 06:42:32 #3 /data/phpBB/vendor/phpunit/phpunit/src/Framework/TestSuite.php(722): PHPUnit_Framework_TestSuite->run(Object(PHPUnit_Framework_TestResult))
07-Sep-2019 06:42:32 #4 /data/phpBB/vendor/phpunit/phpunit/src/Framework/TestSuite.php(722): PHPUnit_Framework_TestSuite->run(Object(PHPUnit_Framework_TestResult))
07-Sep-2019 06:42:32 #5 /data/phpBB/vendor/phpunit/phpunit/src/TextUI/TestRunner.php(440): PHPUnit_Framework_TestSuite->run(Object(PHPUnit_Framework_TestResult))
07-Sep-2019 06:42:32 #6 /data/phpBB/vendor/phpunit/phpunit/src/TextUI/Command.php(149): PHPUnit_TextUI_TestRunner->doRun(Object(PHPUnit_Framework_TestSuite), Array)
07-Sep-2019 06:42:32 #7 /data/phpBB/vendor/phpunit/phpunit/src/TextUI/Command.php(100): PHPUnit_TextUI_Command->run(Array, true)
07-Sep-2019 06:42:32 #8 /data/phpBB/vendor/phpunit/phpunit/phpunit(52): PHPUnit_TextUI_Command::main()
07-Sep-2019 06:42:32 #9 {main}
07-Sep-2019 06:42:32 FAILURES!
07-Sep-2019 06:42:32 Tests: 29232, Assertions: 123751, Errors: 910, Skipped: 272, Incomplete: 1.
07-Sep-2019 06:42:33 Error occurred while running Task 'Run tests(10)' of type com.atlassian.bamboo.plugins.bamboo-docker-plugin:task.docker.cli.
07-Sep-2019 06:42:33 com.atlassian.bamboo.task.TaskException: Failed to execute task
07-Sep-2019 06:42:33         at com.atlassian.bamboo.plugins.docker.service.RunService.execute(RunService.java:75)
07-Sep-2019 06:42:33         at com.atlassian.bamboo.plugins.docker.tasks.cli.DockerCliTask.execute(DockerCliTask.java:70)
07-Sep-2019 06:42:33         at com.atlassian.bamboo.task.TaskExecutorImpl.lambda$executeTasks$3(TaskExecutorImpl.java:285)
07-Sep-2019 06:42:33         at com.atlassian.bamboo.task.TaskExecutorImpl.executeTaskWithPrePostActions(TaskExecutorImpl.java:224)
07-Sep-2019 06:42:33         at com.atlassian.bamboo.task.TaskExecutorImpl.executeTasks(TaskExecutorImpl.java:285)
07-Sep-2019 06:42:33         at com.atlassian.bamboo.task.TaskExecutorImpl.execute(TaskExecutorImpl.java:112)
07-Sep-2019 06:42:33         at com.atlassian.bamboo.build.pipeline.tasks.ExecuteBuildTask.call(ExecuteBuildTask.java:71)
07-Sep-2019 06:42:33         at com.atlassian.bamboo.v2.build.agent.DefaultBuildAgent.executeBuildPhase(DefaultBuildAgent.java:203)
07-Sep-2019 06:42:33         at com.atlassian.bamboo.v2.build.agent.DefaultBuildAgent.build(DefaultBuildAgent.java:175)
07-Sep-2019 06:42:33         at com.atlassian.bamboo.v2.build.agent.BuildAgentControllerImpl.lambda$waitAndPerformBuild$0(BuildAgentControllerImpl.java:122)
07-Sep-2019 06:42:33         at com.atlassian.bamboo.variable.CustomVariableContextImpl.withVariableSubstitutor(CustomVariableContextImpl.java:185)
07-Sep-2019 06:42:33         at com.atlassian.bamboo.v2.build.agent.BuildAgentControllerImpl.waitAndPerformBuild(BuildAgentControllerImpl.java:117)
07-Sep-2019 06:42:33         at com.atlassian.bamboo.v2.build.agent.DefaultBuildAgent$1.run(DefaultBuildAgent.java:126)
07-Sep-2019 06:42:33         at com.atlassian.bamboo.utils.BambooRunnables$1.run(BambooRunnables.java:48)
07-Sep-2019 06:42:33         at com.atlassian.bamboo.security.ImpersonationHelper.runWith(ImpersonationHelper.java:26)
07-Sep-2019 06:42:33         at com.atlassian.bamboo.security.ImpersonationHelper.runWithSystemAuthority(ImpersonationHelper.java:17)
07-Sep-2019 06:42:33         at com.atlassian.bamboo.security.ImpersonationHelper$1.run(ImpersonationHelper.java:41)
07-Sep-2019 06:42:33         at java.lang.Thread.run(Thread.java:748)
07-Sep-2019 06:42:33 Caused by: com.atlassian.bamboo.docker.DockerException: Error running Docker run command
07-Sep-2019 06:42:33         at com.atlassian.bamboo.docker.DockerContainerServiceImpl.run(DockerContainerServiceImpl.java:118)
07-Sep-2019 06:42:33         at sun.reflect.GeneratedMethodAccessor2260.invoke(Unknown Source)
07-Sep-2019 06:42:33         at sun.reflect.DelegatingMethodAccessorImpl.invoke(DelegatingMethodAccessorImpl.java:43)
07-Sep-2019 06:42:33         at java.lang.reflect.Method.invoke(Method.java:498)
07-Sep-2019 06:42:33         at com.atlassian.plugin.util.ContextClassLoaderSettingInvocationHandler.invoke(ContextClassLoaderSettingInvocationHandler.java:26)
07-Sep-2019 06:42:33         at com.sun.proxy.$Proxy401.run(Unknown Source)
07-Sep-2019 06:42:33         at sun.reflect.GeneratedMethodAccessor2260.invoke(Unknown Source)
07-Sep-2019 06:42:33         at sun.reflect.DelegatingMethodAccessorImpl.invoke(DelegatingMethodAccessorImpl.java:43)
07-Sep-2019 06:42:33         at java.lang.reflect.Method.invoke(Method.java:498)
07-Sep-2019 06:42:33         at org.springframework.aop.support.AopUtils.invokeJoinpointUsingReflection(AopUtils.java:302)
07-Sep-2019 06:42:33         at org.eclipse.gemini.blueprint.service.importer.support.internal.aop.ServiceInvoker.doInvoke(ServiceInvoker.java:56)
07-Sep-2019 06:42:33         at org.eclipse.gemini.blueprint.service.importer.support.internal.aop.ServiceInvoker.invoke(ServiceInvoker.java:60)
07-Sep-2019 06:42:33         at org.springframework.aop.framework.ReflectiveMethodInvocation.proceed(ReflectiveMethodInvocation.java:179)
07-Sep-2019 06:42:33         at org.springframework.aop.support.DelegatingIntroductionInterceptor.doProceed(DelegatingIntroductionInterceptor.java:133)
07-Sep-2019 06:42:33         at org.springframework.aop.support.DelegatingIntroductionInterceptor.invoke(DelegatingIntroductionInterceptor.java:121)
07-Sep-2019 06:42:33         at org.springframework.aop.framework.ReflectiveMethodInvocation.proceed(ReflectiveMethodInvocation.java:179)
07-Sep-2019 06:42:33         at org.eclipse.gemini.blueprint.service.util.internal.aop.ServiceTCCLInterceptor.invokeUnprivileged(ServiceTCCLInterceptor.java:70)
07-Sep-2019 06:42:33         at org.eclipse.gemini.blueprint.service.util.internal.aop.ServiceTCCLInterceptor.invoke(ServiceTCCLInterceptor.java:53)
07-Sep-2019 06:42:33         at org.springframework.aop.framework.ReflectiveMethodInvocation.proceed(ReflectiveMethodInvocation.java:179)
07-Sep-2019 06:42:33         at org.eclipse.gemini.blueprint.service.importer.support.LocalBundleContextAdvice.invoke(LocalBundleContextAdvice.java:57)
07-Sep-2019 06:42:33         at org.springframework.aop.framework.ReflectiveMethodInvocation.proceed(ReflectiveMethodInvocation.java:179)
07-Sep-2019 06:42:33         at org.springframework.aop.support.DelegatingIntroductionInterceptor.doProceed(DelegatingIntroductionInterceptor.java:133)
07-Sep-2019 06:42:33         at org.springframework.aop.support.DelegatingIntroductionInterceptor.invoke(DelegatingIntroductionInterceptor.java:121)
07-Sep-2019 06:42:33         at org.springframework.aop.framework.ReflectiveMethodInvocation.proceed(ReflectiveMethodInvocation.java:179)
07-Sep-2019 06:42:33         at org.springframework.aop.framework.JdkDynamicAopProxy.invoke(JdkDynamicAopProxy.java:207)
07-Sep-2019 06:42:33         at com.sun.proxy.$Proxy662.run(Unknown Source)
07-Sep-2019 06:42:33         at com.atlassian.bamboo.plugins.docker.client.DockerCmd.run(DockerCmd.java:51)
07-Sep-2019 06:42:33         at com.atlassian.bamboo.plugins.docker.service.RunService.execute(RunService.java:64)
07-Sep-2019 06:42:33         ... 17 more
07-Sep-2019 06:42:33 Caused by: com.atlassian.utils.process.ProcessException: Error executing /usr/bin/docker run --volume /home/bamboo/xml-data/build-dir/PHPBB3-PR-JOB1:/data --workdir /data --rm -u=991 -t phpbb:php-7.1 /bin/bash -c "phpBB/vendor/bin/phpunit --log-junit build/logs/phpunit.xml"
07-Sep-2019 06:42:33         at com.atlassian.bamboo.docker.DockerContainerServiceImpl.execute(DockerContainerServiceImpl.java:252)
07-Sep-2019 06:42:33         at com.atlassian.bamboo.docker.DockerContainerServiceImpl.run(DockerContainerServiceImpl.java:106)
07-Sep-2019 06:42:33         ... 44 more
07-Sep-2019 06:42:33 Starting task 'Parsing test results produced by script' of type 'com.atlassian.bamboo.plugins.testresultparser:task.testresultparser.junit'
07-Sep-2019 06:42:33 Parsing test results under /home/bamboo/xml-data/build-dir/PHPBB3-PR-JOB1...
07-Sep-2019 06:42:33 Failing task since 109 failing test cases were found.
07-Sep-2019 06:42:33 Finished task 'Parsing test results produced by script' with result: Failed
07-Sep-2019 06:42:33
Substituting variable: ${bamboo.PRnumber} with 5680
07-Sep-2019 06:42:33
Substituting variable: ${bamboo.buildResultsUrl} with https://bamboo.phpbb.com/browse/PHPBB3-PR-JOB1-9558
07-Sep-2019 06:42:33
Substituting variable: ${bamboo.buildResultsUrl} with https://bamboo.phpbb.com/browse/PHPBB3-PR-JOB1-9558
07-Sep-2019 06:42:33 Starting task 'Set result build status' of type 'com.atlassian.bamboo.plugins.scripttask:task.builder.script'
07-Sep-2019 06:42:33
Beginning to execute external process for build 'phpBB3 - Pull Requests - Build and Test Job #9558 (PHPBB3-PR-JOB1-9558)'
... running command line:
/bin/sh /home/bamboo/temp/PHPBB3-PR-JOB1-9558-ScriptBuildTask-3077500728887342382.sh
... in: /home/bamboo/xml-data/build-dir/PHPBB3-PR-JOB1
... using extra environment variables:
bamboo_planRepository_1_branch=3.1.x
bamboo_planRepository_1_branchDisplayName=3.1.x
bamboo_repository_revision_number=dc8ff9da28b8ab4ad11c7ea94cca526f17c87fe5
bamboo_PRref=3.2.x
bamboo_resultsUrl=https://bamboo.phpbb.com/browse/PHPBB3-PR-JOB1-9558
bamboo_capability_system_builder_command_Git=/usr/bin/git
bamboo_repository_75956235_git_username=bantu
bamboo_build_working_directory=/home/bamboo/xml-data/build-dir/PHPBB3-PR-JOB1
bamboo_planRepository_1_name=phpBB Ascraeus
bamboo_buildKey=PHPBB3-PR-JOB1
bamboo_capability_phpbb_tests=true
bamboo_shortPlanName=Pull Requests
bamboo_capability_system_builder_command_fop=/usr/bin/fop
bamboo_capability_dbms_sqlite_2=true
bamboo_planRepository_name=phpBB Ascraeus
bamboo_PRnumber=5680
bamboo_buildNumber=9558
bamboo_repository_75956235_git_repositoryUrl=https://github.com/phpbb/phpbb.git
bamboo_capability_system_builder_phpunit_PHPUnit=/usr/bin/phpunit
bamboo_shortJobName=Build and Test Job
bamboo_buildResultsUrl=https://bamboo.phpbb.com/browse/PHPBB3-PR-JOB1-9558
bamboo_repository_75956235_branch_name=3.1.x
bamboo_planRepository_repositoryUrl=https://github.com/phpbb/phpbb.git
bamboo_agentId=131073
bamboo_planName=phpBB3 - Pull Requests
bamboo_build_commandline_com_atlassian_bamboo_plugins_scripttask_task_builder_script_7=/bin/sh /home/bamboo/temp/PHPBB3-PR-JOB1-9558-ScriptBuildTask-7454260038433441920.sh
bamboo_shortPlanKey=PR
bamboo_shortJobKey=JOB1
bamboo_capability_dbms_mysql_55=true
bamboo_capability_system_jdk_JDK_1_7_0_65=/usr/lib/jvm/java-7-openjdk-amd64
bamboo_planRepository_revision=dc8ff9da28b8ab4ad11c7ea94cca526f17c87fe5
bamboo_buildTimeStamp=2019-09-07T06:34:49.254Z
bamboo_repository_previous_revision_number=dc8ff9da28b8ab4ad11c7ea94cca526f17c87fe5
bamboo_capability_system_jdk_JDK_1_6_0_16=/usr/lib/jvm/java-6-sun-1.6.0.16
bamboo_capability_system_builder_mvn2_Maven_2=/usr/share/maven2
bamboo_planRepository_previousRevision=dc8ff9da28b8ab4ad11c7ea94cca526f17c87fe5
bamboo_build_commandline_com_atlassian_bamboo_plugins_scripttask_task_builder_script_4=/bin/sh /home/bamboo/temp/PHPBB3-PR-JOB1-9558-ScriptBuildTask-737211713510852128.sh
bamboo_repository_git_branch=3.1.x
bamboo_buildResultKey=PHPBB3-PR-JOB1-9558
bamboo_repository_branch_name=3.1.x
bamboo_buildPlanName=phpBB3 - Pull Requests - Build and Test Job
bamboo_planRepository_1_revision=dc8ff9da28b8ab4ad11c7ea94cca526f17c87fe5
bamboo_repository_name=phpBB Ascraeus
bamboo_buildFailed=true
bamboo_build_commandline_com_atlassian_bamboo_plugins_bamboo_docker_plugin_task_docker_cli_10=/usr/bin/docker run --volume /home/bamboo/xml-data/build-dir/PHPBB3-PR-JOB1:/data --workdir /data --rm -u=991 -t phpbb:php-7.1 /bin/bash -c phpBB/vendor/bin/phpunit --log-junit build/logs/phpunit.xml
bamboo_capability_system_docker_executable=/usr/bin/docker
bamboo_build_commandline_com_atlassian_bamboo_plugins_bamboo_docker_plugin_task_docker_cli_11=/usr/bin/docker run --volume /home/bamboo/xml-data/build-dir/PHPBB3-PR-JOB1:/data --workdir /data/build --rm -u=991 phpbb:php-7.1 ../phpBB/vendor/bin/phing sniff
bamboo_build_commandline_com_atlassian_bamboo_plugins_bamboo_docker_plugin_task_docker_cli_12=/usr/bin/docker run --volume /home/bamboo/xml-data/build-dir/PHPBB3-PR-JOB1:/data --workdir /data/phpBB --rm -e HOME=/home/bamboo -u=991 phpbb:php-7.1 /bin/bash -c php ../composer.phar install --dev; cd ../build; ../phpBB/vendor/bin/phing clean prepare
bamboo_build_commandline_com_atlassian_bamboo_plugins_bamboo_docker_plugin_task_docker_cli_13=/usr/bin/docker build --force-rm=true --tag=phpbb:php-7.1 /home/bamboo/xml-data/build-dir/PHPBB3-PR-JOB1
bamboo_planRepository_branch=3.1.x
bamboo_agentWorkingDirectory=/home/bamboo/xml-data/build-dir
bamboo_jobFailed=true
bamboo_capability_system_git_executable=/usr/bin/git
bamboo_capability_system_builder_phpunit_PHPUnit_3_4=/usr/bin/phpunit
bamboo_repository_git_username=bantu
bamboo_planRepository_1_previousRevision=dc8ff9da28b8ab4ad11c7ea94cca526f17c87fe5
bamboo_repository_75956235_revision_number=dc8ff9da28b8ab4ad11c7ea94cca526f17c87fe5
bamboo_planRepository_branchDisplayName=3.1.x
bamboo_planRepository_1_type=gitv2
bamboo_planRepository_branchName=3.1.x
bamboo_repository_75956235_previous_revision_number=dc8ff9da28b8ab4ad11c7ea94cca526f17c87fe5
bamboo_capability_system_jdk_JDK=/usr/lib/jvm/java-6-sun
bamboo_plan_storageTag=PHPBB3-PR
bamboo_hg_cache_directory=/home/bamboo/xml-data/build-dir/_hg-repositories-cache
bamboo_planRepository_1_username=bantu
bamboo_planRepository_type=gitv2
bamboo_git_cache_directory=/home/bamboo/xml-data/build-dir/_git-repositories-cache
bamboo_ManualBuildTriggerReason_userName=Build Robot
bamboo_repository_git_repositoryUrl=https://github.com/phpbb/phpbb.git
bamboo_repository_75956235_git_branch=3.1.x
bamboo_capability_system_builder_ant_Ant=/usr/share/ant
bamboo_repository_75956235_name=phpBB Ascraeus
bamboo_tmp_directory=/home/bamboo/temp
bamboo_working_directory=/home/bamboo/xml-data/build-dir/PHPBB3-PR-JOB1
bamboo_planKey=PHPBB3-PR
bamboo_capability_local=true
bamboo_planRepository_1_repositoryUrl=https://github.com/phpbb/phpbb.git
bamboo_planRepository_username=bantu
bamboo_capability_system_jdk_JDK_1_6=/usr/lib/jvm/java-6-sun
bamboo_capability_system_jdk_JDK_1_7=/usr/lib/jvm/java-7-openjdk-amd64
bamboo_planRepository_1_branchName=3.1.x
07-Sep-2019 06:42:34 From https://github.com/phpbb/phpbb
07-Sep-2019 06:42:34 * branch            refs/pull/5680/head -> FETCH_HEAD
07-Sep-2019 06:42:34       <testsuite name="phpbb_attachment_resync_test" file="/data/tests/attachment/resync_test.php" tests="7" assertions="0" failures="0" errors="7" time="0.000000">
07-Sep-2019 06:42:34       <testsuite name="phpbb_auth_provider_apache_test" file="/data/tests/auth/provider_apache_test.php" tests="4" assertions="0" failures="0" errors="4" time="0.000000">
07-Sep-2019 06:42:34       <testsuite name="phpbb_auth_provider_db_test" file="/data/tests/auth/provider_db_test.php" tests="1" assertions="0" failures="0" errors="1" time="0.000000">
07-Sep-2019 06:42:34       <testsuite name="phpbb_cache_memory_test" file="/data/tests/cache/cache_memory_test.php" tests="4" assertions="0" failures="0" errors="4" time="0.000000">
07-Sep-2019 06:42:34       <testsuite name="phpbb_cache_dummy_driver_test" file="/data/tests/cache/dummy_driver_test.php" tests="4" assertions="0" failures="0" errors="4" time="0.000000">
07-Sep-2019 06:42:34       <testsuite name="phpbb_cache_file_driver_test" file="/data/tests/cache/file_driver_test.php" tests="4" assertions="0" failures="0" errors="4" time="0.000000">
07-Sep-2019 06:42:34       <testsuite name="phpbb_captcha_qa_test" file="/data/tests/captcha/qa_test.php" tests="5" assertions="0" failures="0" errors="5" time="0.000000">
07-Sep-2019 06:42:34       <testsuite name="phpbb_console_command_cron_run_test" file="/data/tests/console/cron/run_test.php" tests="8" assertions="0" failures="0" errors="8" time="0.000000">
07-Sep-2019 06:42:34       <testsuite name="phpbb_console_command_thumbnail_test" file="/data/tests/console/thumbnail_test.php" tests="1" assertions="0" failures="0" errors="1" time="0.000000">
07-Sep-2019 06:42:34       <testsuite name="phpbb_console_user_activate_test" file="/data/tests/console/user/activate_test.php" tests="6" assertions="0" failures="0" errors="6" time="0.000000">
07-Sep-2019 06:42:34       <testsuite name="phpbb_console_user_add_test" file="/data/tests/console/user/add_test.php" tests="3" assertions="0" failures="0" errors="3" time="0.000000">
07-Sep-2019 06:42:34       <testsuite name="phpbb_console_user_delete_test" file="/data/tests/console/user/delete_test.php" tests="3" assertions="0" failures="0" errors="3" time="0.000000">
07-Sep-2019 06:42:34       <testsuite name="phpbb_console_user_reclean_test" file="/data/tests/console/user/reclean_test.php" tests="1" assertions="0" failures="0" errors="1" time="0.000000">
07-Sep-2019 06:42:34       <testsuite name="phpbb_content_visibility_delete_post_test" file="/data/tests/content_visibility/delete_post_test.php" tests="8" assertions="0" failures="0" errors="8" time="0.000000">
07-Sep-2019 06:42:34       <testsuite name="phpbb_content_visibility_get_forums_visibility_sql_test" file="/data/tests/content_visibility/get_forums_visibility_sql_test.php" tests="6" assertions="0" failures="0" errors="6" time="0.000000">
07-Sep-2019 06:42:34       <testsuite name="phpbb_content_visibility_get_global_visibility_sql_test" file="/data/tests/content_visibility/get_global_visibility_sql_test.php" tests="6" assertions="0" failures="0" errors="6" time="0.000000">
07-Sep-2019 06:42:34       <testsuite name="phpbb_content_visibility_get_visibility_sql_test" file="/data/tests/content_visibility/get_visibility_sql_test.php" tests="4" assertions="0" failures="0" errors="4" time="0.000000">
07-Sep-2019 06:42:34       <testsuite name="phpbb_content_visibility_set_post_visibility_test" file="/data/tests/content_visibility/set_post_visibility_test.php" tests="8" assertions="0" failures="0" errors="8" time="0.000000">
07-Sep-2019 06:42:34       <testsuite name="phpbb_content_visibility_set_topic_visibility_test" file="/data/tests/content_visibility/set_topic_visibility_test.php" tests="4" assertions="0" failures="0" errors="4" time="0.000000">
07-Sep-2019 06:42:34       <testsuite name="phpbb_dbal_auto_increment_test" file="/data/tests/dbal/auto_increment_test.php" tests="1" assertions="0" failures="0" errors="1" time="0.000000">
07-Sep-2019 06:42:34       <testsuite name="phpbb_boolean_processor_test" file="/data/tests/dbal/boolean_processor_test.php" tests="8" assertions="0" failures="0" errors="8" time="0.000000">
07-Sep-2019 06:42:34       <testsuite name="phpbb_dbal_case_test" file="/data/tests/dbal/case_test.php" tests="3" assertions="0" failures="0" errors="3" time="0.000000">
07-Sep-2019 06:42:34       <testsuite name="phpbb_dbal_concatenate_test" file="/data/tests/dbal/concatenate_test.php" tests="2" assertions="0" failures="0" errors="2" time="0.000000">
07-Sep-2019 06:42:34       <testsuite name="phpbb_dbal_connect_test" file="/data/tests/dbal/connect_test.php" tests="1" assertions="0" failures="0" errors="1" time="0.000000">
07-Sep-2019 06:42:34       <testsuite name="phpbb_dbal_cross_join_test" file="/data/tests/dbal/cross_join_test.php" tests="1" assertions="0" failures="0" errors="1" time="0.000000">
07-Sep-2019 06:42:34       <testsuite name="phpbb_dbal_migrator_test" file="/data/tests/dbal/migrator_test.php" tests="9" assertions="0" failures="0" errors="9" time="0.000000">
07-Sep-2019 06:42:34       <testsuite name="phpbb_dbal_migrator_tool_config_text_test" file="/data/tests/dbal/migrator_tool_config_text_test.php" tests="6" assertions="0" failures="0" errors="6" time="0.000000">
07-Sep-2019 06:42:34       <testsuite name="phpbb_dbal_order_lower_test" file="/data/tests/dbal/order_lower_test.php" tests="1" assertions="0" failures="0" errors="1" time="0.000000">
07-Sep-2019 06:42:34       <testsuite name="phpbb_dbal_schema_test" file="/data/tests/dbal/schema_test.php" tests="1" assertions="0" failures="0" errors="1" time="0.000000">
07-Sep-2019 06:42:34       <testsuite name="phpbb_dbal_sql_affected_rows_test" file="/data/tests/dbal/sql_affected_rows_test.php" tests="4" assertions="0" failures="0" errors="4" time="0.000000">
07-Sep-2019 06:42:34       <testsuite name="phpbb_dbal_sql_insert_buffer_test" file="/data/tests/dbal/sql_insert_buffer_test.php" tests="6" assertions="0" failures="0" errors="6" time="0.000000">
07-Sep-2019 06:42:34       <testsuite name="phpbb_dbal_write_sequence_test" file="/data/tests/dbal/write_sequence_test.php" tests="1" assertions="0" failures="0" errors="1" time="0.000000">
07-Sep-2019 06:42:34       <testsuite name="phpbb_dbal_write_test" file="/data/tests/dbal/write_test.php" tests="6" assertions="0" failures="0" errors="6" time="0.000000">
07-Sep-2019 06:42:34       <testsuite name="phpbb_feed_attachments_base_test" file="/data/tests/feed/attachments_base_test.php" tests="3" assertions="0" failures="0" errors="3" time="0.000000">
07-Sep-2019 06:42:34       <testsuite name="phpbb_functions_language_select_test" file="/data/tests/functions/language_select_test.php" tests="4" assertions="0" failures="0" errors="4" time="0.000000">
07-Sep-2019 06:42:34       <testsuite name="phpbb_functions_style_select_test" file="/data/tests/functions/style_select_test.php" tests="6" assertions="0" failures="0" errors="6" time="0.000000">
07-Sep-2019 06:42:34       <testsuite name="phpbb_functions_user_delete_test" file="/data/tests/functions/user_delete_test.php" tests="1" assertions="0" failures="0" errors="1" time="0.000000">
07-Sep-2019 06:42:34       <testsuite name="phpbb_functions_validate_email_test" file="/data/tests/functions/validate_email_test.php" tests="6" assertions="0" failures="0" errors="6" time="0.000000">
07-Sep-2019 06:42:34       <testsuite name="phpbb_functions_validate_lang_iso_test" file="/data/tests/functions/validate_lang_iso_test.php" tests="1" assertions="0" failures="0" errors="1" time="0.000000">
07-Sep-2019 06:42:34       <testsuite name="phpbb_functions_validate_user_email_test" file="/data/tests/functions/validate_user_email_test.php" tests="6" assertions="0" failures="0" errors="6" time="0.000000">
07-Sep-2019 06:42:34       <testsuite name="phpbb_functions_validate_data_test" file="/data/tests/functions/validate_username_test.php" tests="6" assertions="0" failures="0" errors="6" time="0.000000">
07-Sep-2019 06:42:34       <testsuite name="phpbb_update_rows_avoiding_duplicates_notify_status_test" file="/data/tests/functions_database_helper/update_rows_avoiding_duplicates_notify_status_test.php" tests="6" assertions="0" failures="0" errors="6" time="0.000000">
07-Sep-2019 06:42:34       <testsuite name="phpbb_update_rows_avoiding_duplicates_test" file="/data/tests/functions_database_helper/update_rows_avoiding_duplicates_test.php" tests="4" assertions="0" failures="0" errors="4" time="0.000000">
07-Sep-2019 06:42:34       <testsuite name="phpbb_functions_user_group_user_attributes_test" file="/data/tests/functions_user/group_user_attributes_test.php" tests="6" assertions="0" failures="0" errors="6" time="0.000000">
07-Sep-2019 06:42:34       <testsuite name="phpbb_lock_db_test" file="/data/tests/lock/db_test.php" tests="4" assertions="0" failures="0" errors="4" time="0.000000">
07-Sep-2019 06:42:34       <testsuite name="phpbb_log_add_test" file="/data/tests/log/add_test.php" tests="2" assertions="0" failures="0" errors="2" time="0.000000">
07-Sep-2019 06:42:34       <testsuite name="phpbb_log_delete_test" file="/data/tests/log/delete_test.php" tests="6" assertions="0" failures="0" errors="6" time="0.000000">
07-Sep-2019 06:42:34       <testsuite name="phpbb_log_function_add_log_test" file="/data/tests/log/function_add_log_test.php" tests="7" assertions="0" failures="0" errors="7" time="0.000000">
07-Sep-2019 06:42:34       <testsuite name="phpbb_mcp_post_ip_test" file="/data/tests/mcp/post_ip_test.php" tests="7" assertions="0" failures="0" errors="7" time="0.000000">
07-Sep-2019 06:42:34       <testsuite name="phpbb_migrator_convert_timezones_test" file="/data/tests/migrator/convert_timezones_test.php" tests="1" assertions="0" failures="0" errors="1" time="0.000000">
07-Sep-2019 06:42:34       <testsuite name="get_callable_from_step_test" file="/data/tests/migrator/get_callable_from_step_test.php" tests="3" assertions="0" failures="0" errors="3" time="0.000000">
07-Sep-2019 06:42:34       <testsuite name="phpbb_notification_convert_test" file="/data/tests/notification/convert_test.php" tests="1" assertions="0" failures="0" errors="1" time="0.000000">
07-Sep-2019 06:42:34       <testsuite name="phpbb_notification_group_request_test" file="/data/tests/notification/group_request_test.php" tests="1" assertions="0" failures="0" errors="1" time="0.000000">
07-Sep-2019 06:42:34       <testsuite name="phpbb_notification_test" file="/data/tests/notification/notification_test.php" tests="4" assertions="0" failures="0" errors="4" time="0.000000">
07-Sep-2019 06:42:34       <testsuite name="phpbb_notification_submit_post_type_bookmark_test" file="/data/tests/notification/submit_post_type_bookmark_test.php" tests="2" assertions="0" failures="0" errors="2" time="0.000000">
07-Sep-2019 06:42:34       <testsuite name="phpbb_notification_submit_post_type_post_in_queue_test" file="/data/tests/notification/submit_post_type_post_in_queue_test.php" tests="2" assertions="0" failures="0" errors="2" time="0.000000">
07-Sep-2019 06:42:34       <testsuite name="phpbb_notification_submit_post_type_post_test" file="/data/tests/notification/submit_post_type_post_test.php" tests="2" assertions="0" failures="0" errors="2" time="0.000000">
07-Sep-2019 06:42:34       <testsuite name="phpbb_notification_submit_post_type_quote_test" file="/data/tests/notification/submit_post_type_quote_test.php" tests="2" assertions="0" failures="0" errors="2" time="0.000000">
07-Sep-2019 06:42:34       <testsuite name="phpbb_notification_submit_post_type_topic_test" file="/data/tests/notification/submit_post_type_topic_test.php" tests="2" assertions="0" failures="0" errors="2" time="0.000000">
07-Sep-2019 06:42:34       <testsuite name="phpbb_notification_user_list_trim_test" file="/data/tests/notification/user_list_trim_test.php" tests="5" assertions="0" failures="0" errors="5" time="0.000000">
07-Sep-2019 06:42:34       <testsuite name="phpbb_privmsgs_delete_user_pms_test" file="/data/tests/privmsgs/delete_user_pms_test.php" tests="3" assertions="0" failures="0" errors="3" time="0.000000">
07-Sep-2019 06:42:34       <testsuite name="phpbb_session_check_ban_test" file="/data/tests/session/check_ban_test.php" tests="3" assertions="0" failures="0" errors="3" time="0.000000">
07-Sep-2019 06:42:34       <testsuite name="phpbb_session_check_isvalid_test" file="/data/tests/session/check_isvalid_test.php" tests="2" assertions="0" failures="0" errors="2" time="0.000000">
07-Sep-2019 06:42:34       <testsuite name="phpbb_session_create_test" file="/data/tests/session/create_test.php" tests="1" assertions="0" failures="0" errors="1" time="0.000000">
07-Sep-2019 06:42:34       <testsuite name="phpbb_session_extract_hostname_test" file="/data/tests/session/extract_hostname_test.php" tests="8" assertions="0" failures="0" errors="8" time="0.000000">
07-Sep-2019 06:42:34       <testsuite name="phpbb_session_extract_page_test" file="/data/tests/session/extract_page_test.php" tests="8" assertions="0" failures="0" errors="8" time="0.000000">
07-Sep-2019 06:42:34       <testsuite name="phpbb_session_garbage_collection_test" file="/data/tests/session/garbage_collection_test.php" tests="1" assertions="0" failures="0" errors="1" time="0.000000">
07-Sep-2019 06:42:34       <testsuite name="phpbb_session_login_keys_test" file="/data/tests/session/session_key_test.php" tests="2" assertions="0" failures="0" errors="2" time="0.000000">
07-Sep-2019 06:42:34       <testsuite name="phpbb_session_unset_admin_test" file="/data/tests/session/unset_admin_test.php" tests="1" assertions="0" failures="0" errors="1" time="0.000000">
07-Sep-2019 06:42:34       <testsuite name="phpbb_textreparser_base_test" file="/data/tests/text_reparser/base_test.php" tests="2" assertions="0" failures="0" errors="2" time="0.000000">
07-Sep-2019 06:42:34       <testsuite name="phpbb_text_reparser_manager_test" file="/data/tests/text_reparser/manager_test.php" tests="4" assertions="0" failures="0" errors="4" time="0.000000">
07-Sep-2019 06:42:34       <testsuite name="phpbb_textreparser_contact_admin_info_test" file="/data/tests/text_reparser/plugins/contact_admin_info_test.php" tests="3" assertions="0" failures="0" errors="3" time="0.000000">
07-Sep-2019 06:42:34       <testsuite name="phpbb_textreparser_forum_description_test" file="/data/tests/text_reparser/plugins/forum_description_test.php" tests="5" assertions="0" failures="0" errors="5" time="0.000000">
07-Sep-2019 06:42:34       <testsuite name="phpbb_textreparser_forum_rules_test" file="/data/tests/text_reparser/plugins/forum_rules_test.php" tests="5" assertions="0" failures="0" errors="5" time="0.000000">
07-Sep-2019 06:42:34       <testsuite name="phpbb_textreparser_group_description_test" file="/data/tests/text_reparser/plugins/group_description_test.php" tests="5" assertions="0" failures="0" errors="5" time="0.000000">
07-Sep-2019 06:42:34       <testsuite name="phpbb_textreparser_pm_text_test" file="/data/tests/text_reparser/plugins/pm_text_test.php" tests="5" assertions="0" failures="0" errors="5" time="0.000000">
07-Sep-2019 06:42:34       <testsuite name="phpbb_textreparser_poll_option_test" file="/data/tests/text_reparser/plugins/poll_option_test.php" tests="3" assertions="0" failures="0" errors="3" time="0.000000">
07-Sep-2019 06:42:34       <testsuite name="phpbb_textreparser_poll_title_test" file="/data/tests/text_reparser/plugins/poll_title_test.php" tests="5" assertions="0" failures="0" errors="5" time="0.000000">
07-Sep-2019 06:42:34       <testsuite name="phpbb_textreparser_post_text_test" file="/data/tests/text_reparser/plugins/post_text_test.php" tests="5" assertions="0" failures="0" errors="5" time="0.000000">
07-Sep-2019 06:42:34       <testsuite name="phpbb_textreparser_user_signature_test" file="/data/tests/text_reparser/plugins/user_signature_test.php" tests="5" assertions="0" failures="0" errors="5" time="0.000000">
07-Sep-2019 06:42:34       <testsuite name="phpbb_tests_tree_nestedset_forum_add_remove_test" file="/data/tests/tree/nestedset_forum_insert_delete_test.php" tests="5" assertions="0" failures="0" errors="5" time="0.000000">
07-Sep-2019 06:42:34       <testsuite name="phpbb_tests_tree_nestedset_forum_regenerate_test" file="/data/tests/tree/nestedset_forum_regenerate_test.php" tests="6" assertions="0" failures="0" errors="6" time="0.000000">
07-Sep-2019 06:42:34       <testsuite name="pphpbb_tests_tree_nestedset_forum_test" file="/data/tests/tree/nestedset_forum_test.php" tests="5" assertions="0" failures="0" errors="5" time="0.000000">
07-Sep-2019 06:42:34       <testsuite name="phpbb_user_loader_test" file="/data/tests/user/user_loader_test.php" tests="3" assertions="0" failures="0" errors="3" time="0.000000">
07-Sep-2019 06:42:34   % Total    % Received % Xferd  Average Speed   Time    Time     Time  Current
07-Sep-2019 06:42:34                                  Dload  Upload   Total   Spent    Left  Speed
07-Sep-2019 06:42:34
07-Sep-2019 06:42:34   0     0    0     0    0     0      0      0 --:--:-- --:--:-- --:--:--     0
07-Sep-2019 06:42:34 100   267  100    93  100   174    256    480 --:--:-- --:--:-- --:--:--   480
07-Sep-2019 06:42:34 Finished task 'Set result build status' with result: Success
07-Sep-2019 06:42:34 Running post build plugin 'NCover Results Collector'
07-Sep-2019 06:42:34 Running post build plugin 'Artifact Copier'
07-Sep-2019 06:42:34 Running post build plugin 'npm Cache Cleanup'
07-Sep-2019 06:42:34 Running post build plugin 'Clover Results Collector'
07-Sep-2019 06:42:34 Running post build plugin 'Docker Container Cleanup'
07-Sep-2019 06:42:35 Successfully removed working directory at '/home/bamboo/xml-data/build-dir/PHPBB3-PR-JOB1'
07-Sep-2019 06:42:35 Finalising the build...
07-Sep-2019 06:42:35 Stopping timer.
07-Sep-2019 06:42:35 Build PHPBB3-PR-JOB1-9558 completed.
07-Sep-2019 06:42:35 Running on server: post build plugin 'NCover Results Collector'
07-Sep-2019 06:42:35 Running on server: post build plugin 'Build Hanging Detection Configuration'
07-Sep-2019 06:42:35 Running on server: post build plugin 'Clover Delta Calculator'
07-Sep-2019 06:42:35 Running on server: post build plugin 'Maven Dependencies Postprocessor'
07-Sep-2019 06:42:35 All post build plugins have finished
07-Sep-2019 06:42:35 Generating build results summary...
07-Sep-2019 06:42:40 Saving build results to disk...
07-Sep-2019 06:42:40 Logging substituted variables...
07-Sep-2019 06:42:41 Indexing build results...
07-Sep-2019 06:42:41 Finished building PHPBB3-PR-JOB1-9558.
07-Sep-2019 06:42:41
Substituting variable: ${bamboo.PRnumber} with 5680